T-PRO Thesaurus der Provenienzbegriffe
type: ConceptScheme
notation: tpro

Aufführungsexemplar
type: Concept
created: 2022-11-15
issued: 2022-11-15
modified: 2025-12-03
publisher: Deutsche Nationalbibliothek
definition: Exemplar, das für eine Aufführung verwendet wurde, z.B. Rollen-, Regie- oder Soufflierbuch.
in scheme: T-PRO Thesaurus der Provenienzbegriffe
top concept of: T-PRO Thesaurus der Provenienzbegriffe
pref label: Aufführungsexemplar
  type: Label
  rank: preferred

Auktionsexemplar
type: Concept
preferred label: auction copies @en
created: 2022-11-15
issued: 2022-11-15
modified: 2025-12-03
publisher: Deutsche Nationalbibliothek
definition:
  literal form: Exemplar, das auf einer Auktion versteigert worden ist. Quellen sind z.B. aktuelle und historische Erwerbungsunterlagen, Auktionskataloge, Einlagen. Oft kombiniert mit Einlage: Zettel, Nummer, Preis, Kaufdatum.
in scheme: T-PRO Thesaurus der Provenienzbegriffe
top concept of: T-PRO Thesaurus der Provenienzbegriffe
pref label: Auktionsexemplar
  type: Label
  rank: preferred
pref label: auction copies
  type: Label
  rank: normal

Aussonderungsexemplar
type: Concept
preferred label: withdrawn copies @en
created: 2022-12-01
issued: 2022-12-01
modified: 2025-12-03
publisher: Deutsche Nationalbibliothek
definition: Exemplar, das aus dem Bestand einer Institution ausgesondert worden ist.
in scheme: T-PRO Thesaurus der Provenienzbegriffe
top concept of: T-PRO Thesaurus der Provenienzbegriffe
pref label: Aussonderungsexemplar
  type: Label
  rank: preferred
pref label: withdrawn copies
  type: Label
  rank: normal

Autogramm
type: Concept
preferred label: autographs @en
preferred label: signature @fr
created: 2022-12-01
issued: 2022-12-01
modified: 2025-12-03
publisher: Deutsche Nationalbibliothek
definition: Eigenhändiger Namenszug
in scheme: T-PRO Thesaurus der Provenienzbegriffe
top concept of: T-PRO Thesaurus der Provenienzbegriffe
pref label: Autogramm
  type: Label
  rank: preferred
pref label: autographs
  type: Label
  rank: normal
pref label: signature
  type: Label
  rank: normal

Belegexemplar
type: Concept
created: 2022-12-01
issued: 2022-12-01
modified: 2025-12-03
publisher: Deutsche Nationalbibliothek
definition: Exemplar, das dem Autor oder einer Institution aufgrund vertraglicher Vereinbarungen als Beleg für eine Publikation zur Verfügung gestellt worden ist.
in scheme: T-PRO Thesaurus der Provenienzbegriffe
top concept of: T-PRO Thesaurus der Provenienzbegriffe
pref label: Belegexemplar
  type: Label
  rank: preferred

Beutegut
type: Concept
preferred label: livre-trophée @fr
preferred label: loot @en
created: 2022-12-01
issued: 2022-12-01
modified: 2025-12-03
publisher: Deutsche Nationalbibliothek
definition: Kriegsbedingt verbrachtes Vermögen
in scheme: T-PRO Thesaurus der Provenienzbegriffe
pref label: Beutegut
  type: Label
  rank: preferred
pref label: loot
  type: Label
  rank: normal
pref label: livre-trophée
  type: Label
  rank: normal
broader: Enteignung
broader transitive: Enteignung

Enteignung
type: Concept
preferred label: expropriation @en
created: 2022-12-02
issued: 2022-12-02
modified: 2025-12-03
publisher: Deutsche Nationalbibliothek
definition: Als Enteignung wird der Entzug des Eigentums an einer beweglichen oder unbeweglichen Sache durch einen hoheitlichen Akt bezeichnet.
in scheme: T-PRO Thesaurus der Provenienzbegriffe
top concept of: T-PRO Thesaurus der Provenienzbegriffe
pref label: Enteignung
  type: Label
  rank: preferred
pref label: expropriation
  type: Label
  rank: normal
pref label: expropriation
  type: Label
  rank: normal
narrower: Beutegut
narrower: Bodenreform
narrower: NS-Raubgut
narrower: Säkularisationsgut

Bibliotheksexemplar
type: Concept
preferred label: library copies @en
created: 2022-12-01
issued: 2022-12-01
modified: 2025-12-03
publisher: Deutsche Nationalbibliothek
definition: Exemplar aus dem Besitz von Institutionen (im Gegensatz zu Privatsammlungen), z.B. Archiv, Gesellschaft, Schule. Oft kombiniert mit Nummer, Signatur, Stempel.
in scheme: T-PRO Thesaurus der Provenienzbegriffe
top concept of: T-PRO Thesaurus der Provenienzbegriffe
pref label: Bibliotheksexemplar
  type: Label
  rank: preferred
pref label: library copies
  type: Label
  rank: normal

Bodenreform
type: Concept
preferred label: land reform @en
preferred label: réforme agraire @fr
created: 2022-12-01
issued: 2022-12-01
modified: 2025-12-03
publisher: Deutsche Nationalbibliothek
definition: Ausstattung, z.B. Bodenreform in Deutschland nach Kriegsende 1945 in der Sowjetischen Besatzungszone (SBZ).
in scheme: T-PRO Thesaurus der Provenienzbegriffe
pref label: Bodenreform
  type: Label
  rank: preferred
pref label: land reform
  type: Label
  rank: normal
pref label: réforme agraire
  type: Label
  rank: normal
broader: Enteignung
broader transitive: Enteignung

Buchschnitt
type: Concept
preferred label: edge-marks @en
created: 2022-12-01
issued: 2022-12-01
modified: 2025-12-03
publisher: Deutsche Nationalbibliothek
definition: Merkmale auf dem Buchschnitt, die auf die Provenienz hinweisen, z.B. Notiz, Signatur, Stempel.
in scheme: T-PRO Thesaurus der Provenienzbegriffe
top concept of: T-PRO Thesaurus der Provenienzbegriffe
pref label: Buchschnitt
  type: Label
  rank: preferred
pref label: edge-marks
  type: Label
  rank: normal

Datum
type: Concept
preferred label: dates @en
created: 2022-12-01
issued: 2022-12-01
modified: 2025-12-03
publisher: Deutsche Nationalbibliothek
definition: Zeitangabe jeder Art
in scheme: T-PRO Thesaurus der Provenienzbegriffe
top concept of: T-PRO Thesaurus der Provenienzbegriffe
pref label: Datum
  type: Label
  rank: preferred
pref label: dates
  type: Label
  rank: normal
narrower: Kaufdatum
narrower: Lesedatum

Kaufdatum
type: Concept
created: 2022-12-02
issued: 2022-12-02
modified: 2025-12-03
publisher: Deutsche Nationalbibliothek
definition: Datum, an dem ein Exemplar durch Kauf oder Tausch erworben worden ist.
in scheme: T-PRO Thesaurus der Provenienzbegriffe
pref label: Kaufdatum
  type: Label
  rank: preferred
broader: Datum
broader transitive: Datum

Lesedatum
type: Concept
preferred label: reading dates @en
created: 2022-12-02
issued: 2022-12-02
modified: 2025-12-03
publisher: Deutsche Nationalbibliothek
definition: Lese- oder Ausleihdaten des Vorbesitzers
in scheme: T-PRO Thesaurus der Provenienzbegriffe
pref label: Lesedatum
  type: Label
  rank: preferred
pref label: reading dates
  type: Label
  rank: normal
broader: Datum
broader transitive: Datum

Dublettenstempel
type: Concept
preferred label: duplicate stamps @en
created: 2022-12-01
issued: 2022-12-01
modified: 2025-12-03
publisher: Deutsche Nationalbibliothek
definition: Stempelabdruck, der die Aussonderung von Zweit- und Staffelexemplaren kennzeichnet.
in scheme: T-PRO Thesaurus der Provenienzbegriffe
pref label: Dublettenstempel
  type: Label
  rank: preferred
pref label: duplicate stamps
  type: Label
  rank: normal
broader: Stempel
broader transitive: Stempel

Stempel
type: Concept
preferred label: cachets @fr
preferred label: stamps @en
created: 2022-12-02
issued: 2022-12-02
modified: 2025-12-03
publisher: Deutsche Nationalbibliothek
definition: Stempelabdruck jeder Art; Firmenstempel, Einbandstempel
in scheme: T-PRO Thesaurus der Provenienzbegriffe
top concept of: T-PRO Thesaurus der Provenienzbegriffe
pref label: Stempel
  type: Label
  rank: preferred
pref label: stamps
  type: Label
  rank: normal
pref label: cachets
  type: Label
  rank: normal
narrower: Dublettenstempel
narrower: Stempel: Buchbinder
narrower: Stempel: Buchbinderin
narrower: Stempel: Buchhändler
narrower: Stempel: Buchhändlerin

Durchschossenes Exemplar
type: Concept
preferred label: exemplaire interfolié @fr
preferred label: interleaved copy @en
created: 2022-12-01
issued: 2022-12-01
modified: 2025-12-03
publisher: Deutsche Nationalbibliothek
definition: Buchexemplar, das zwischen den einzelnen bedruckten Blättern mit leeren Blättern versehen ist.
in scheme: T-PRO Thesaurus der Provenienzbegriffe
top concept of: T-PRO Thesaurus der Provenienzbegriffe
pref label: Durchschossenes Exemplar
  type: Label
  rank: preferred
pref label: interleaved copy
  type: Label
  rank: normal
pref label: exemplaire interfolié
  type: Label
  rank: normal

Einband
type: Concept
preferred label: bindings @en
preferred label: reliures @fr
created: 2022-12-01
issued: 2022-12-01
modified: 2025-12-03
publisher: Deutsche Nationalbibliothek
definition: Einband mit Merkmalen auf der Außenseite der Buchdeckel und des Buchrückens, die auf die Provenienz hinweisen, z.B. Initiale, Monogramm, Signatur, Wappen.
in scheme: T-PRO Thesaurus der Provenienzbegriffe
top concept of: T-PRO Thesaurus der Provenienzbegriffe
pref label: Einband
  type: Label
  rank: preferred
pref label: bindings
  type: Label
  rank: normal
pref label: reliures
  type: Label
  rank: normal

Einlage: Brief
type: Concept
created: 2022-12-01
issued: 2022-12-01
modified: 2025-12-03
publisher: Deutsche Nationalbibliothek
definition: Schriftliche Mitteilung an einen bestimmten Adressaten; oft mit Autogramm oder Initialen und Datum versehen.
in scheme: T-PRO Thesaurus der Provenienzbegriffe
pref label: Einlage: Brief
  type: Label
  rank: preferred
broader: Einlage
broader transitive: Einlage

Einlage
type: Concept
preferred label: insertions @en
created: 2022-12-01
issued: 2022-12-01
modified: 2025-12-03
publisher: Deutsche Nationalbibliothek
definition: Einlage oder Beilage jeder Art, die Hinweise auf den Vorbesitzer gibt.
in scheme: T-PRO Thesaurus der Provenienzbegriffe
top concept of: T-PRO Thesaurus der Provenienzbegriffe
pref label: Einlage
  type: Label
  rank: preferred
pref label: insertions
  type: Label
  rank: normal
narrower: Einlage: Brief
narrower: Einlage: Fotografie
narrower: Einlage: Haar
narrower: Einlage: Lesezeichen
narrower: Einlage: Pflanze
narrower: Einlage: Zettel

Einlage: Fotografie
type: Concept
created: 2022-12-01
issued: 2022-12-01
modified: 2025-12-03
publisher: Deutsche Nationalbibliothek
definition: Fotoabzug auf Papier; nicht benutzt für Reproduktionen in Zeitungen oder auf Ansichtskarten.
in scheme: T-PRO Thesaurus der Provenienzbegriffe
pref label: Einlage: Fotografie
  type: Label
  rank: preferred
broader: Einlage
broader transitive: Einlage

Einlage: Haar
type: Concept
created: 2022-12-01
issued: 2022-12-01
modified: 2025-12-03
publisher: Deutsche Nationalbibliothek
definition: Haar/e, Haarlocke
in scheme: T-PRO Thesaurus der Provenienzbegriffe
pref label: Einlage: Haar
  type: Label
  rank: preferred
broader: Einlage
broader transitive: Einlage

Einlage: Lesezeichen
type: Concept
created: 2022-12-01
issued: 2022-12-01
modified: 2025-12-03
publisher: Deutsche Nationalbibliothek
definition: Künstlerisch oder als Werbeträger gestaltetes Lesezeichen; nicht benutzt für Papierschnipsel oder Eselsohren.
in scheme: T-PRO Thesaurus der Provenienzbegriffe
pref label: Einlage: Lesezeichen
  type: Label
  rank: preferred
broader: Einlage
broader transitive: Einlage

Einlage: Pflanze
type: Concept
created: 2022-12-01
issued: 2022-12-01
modified: 2025-12-03
publisher: Deutsche Nationalbibliothek
definition: Pflanze oder Pflanzenteile
in scheme: T-PRO Thesaurus der Provenienzbegriffe
pref label: Einlage: Pflanze
  type: Label
  rank: preferred
broader: Einlage
broader transitive: Einlage

Einlage: Zettel: Zeitungsausschnitt
type: Concept
created: 2022-12-01
issued: 2022-12-01
modified: 2025-12-03
publisher: Deutsche Nationalbibliothek
definition: Ausschnitt (auch Ausriss oder Einzelseite) aus Zeitung oder Zeitschrift
in scheme: T-PRO Thesaurus der Provenienzbegriffe
pref label: Einlage: Zettel: Zeitungsausschnitt
  type: Label
  rank: preferred
broader: Einlage: Zettel
broader transitive: Einlage
broader transitive: Einlage: Zettel

Einlage: Zettel
type: Concept
created: 2022-12-01
issued: 2022-12-01
modified: 2025-12-03
publisher: Deutsche Nationalbibliothek
definition: Ausschnitt (auch Ausriss oder Einzelseite) aus Zeitung oder Zeitschrift
in scheme: T-PRO Thesaurus der Provenienzbegriffe
pref label: Einlage: Zettel
  type: Label
  rank: preferred
broader: Einlage
broader transitive: Einlage
narrower: Einlage: Zettel: Zeitungsausschnitt

Emblem
type: Concept
preferred label: devices @en
preferred label: emblème @fr
created: 2022-12-02
issued: 2022-12-02
modified: 2025-12-03
publisher: Deutsche Nationalbibliothek
definition: Sinnbild
in scheme: T-PRO Thesaurus der Provenienzbegriffe
top concept of: T-PRO Thesaurus der Provenienzbegriffe
pref label: Emblem
  type: Label
  rank: preferred
pref label: devices
  type: Label
  rank: normal
pref label: emblème
  type: Label
  rank: normal

NS-Raubgut
type: Concept
created: 2022-12-02
issued: 2022-12-02
modified: 2025-12-03
publisher: Deutsche Nationalbibliothek
definition: NS-verfolgungsbedingt entzogenes Vermögen
in scheme: T-PRO Thesaurus der Provenienzbegriffe
pref label: NS-Raubgut
  type: Label
  rank: preferred
broader: Enteignung
broader transitive: Enteignung
narrower: NS-Raubgut: Verdacht

Säkularisationsgut
type: Concept
created: 2022-12-02
issued: 2022-12-02
modified: 2025-12-03
publisher: Deutsche Nationalbibliothek
definition: Vermögen aus der staatlichen Einziehung oder Nutzung kirchlicher Besitztümer
in scheme: T-PRO Thesaurus der Provenienzbegriffe
pref label: Säkularisationsgut
  type: Label
  rank: preferred
broader: Enteignung
broader transitive: Enteignung

Etikett: Buchbinder
type: Concept
preferred label: binders' tickets @en
created: 2022-12-02
issued: 2022-12-02
modified: 2025-12-03
publisher: Deutsche Nationalbibliothek
definition: Zettel mit Firmennamen, der z.B. auf der Innenseite der Buchdeckel aufgeklebt ist; oft kombiniert mit Nummer, Preis und Datum.
in scheme: T-PRO Thesaurus der Provenienzbegriffe
pref label: Etikett: Buchbinder
  type: Label
  rank: preferred
pref label: binders' tickets
  type: Label
  rank: normal
broader: Etikett
broader transitive: Etikett

Etikett
type: Concept
preferred label: labels @en
preferred label: vignettes @fr
created: 2022-12-02
issued: 2022-12-02
modified: 2025-12-03
publisher: Deutsche Nationalbibliothek
definition: Anhänger, Aufkleber jeder Art.
in scheme: T-PRO Thesaurus der Provenienzbegriffe
top concept of: T-PRO Thesaurus der Provenienzbegriffe
pref label: Etikett
  type: Label
  rank: preferred
pref label: labels
  type: Label
  rank: normal
pref label: vignettes
  type: Label
  rank: normal
narrower: Etikett: Buchbinder
narrower: Etikett: Buchbinderin
narrower: Etikett: Buchhändler
narrower: Etikett: Buchhändlerin

Etikett: Buchbinderin
type: Concept
preferred label: binders' tickets @en
created: 2022-12-02
issued: 2022-12-02
modified: 2025-12-03
publisher: Deutsche Nationalbibliothek
definition: Zettel mit Firmennamen, der z.B. auf der Innenseite der Buchdeckel aufgeklebt ist; oft kombiniert mit Nummer, Preis und Datum.
in scheme: T-PRO Thesaurus der Provenienzbegriffe
pref label: Etikett: Buchbinderin
  type: Label
  rank: preferred
pref label: binders' tickets
  type: Label
  rank: normal
broader: Etikett
broader transitive: Etikett

Etikett: Buchhändler
type: Concept
preferred label: booksellers' labels @en
created: 2022-12-02
issued: 2022-12-02
modified: 2025-12-03
publisher: Deutsche Nationalbibliothek
definition: Zettel mit Firmennamen, der z.B. auf der Innenseite der Buchdeckel aufgeklebt ist; oft kombiniert mit Preis und Datum.
in scheme: T-PRO Thesaurus der Provenienzbegriffe
pref label: Etikett: Buchhändler
  type: Label
  rank: preferred
pref label: booksellers' labels
  type: Label
  rank: normal
broader: Etikett
broader transitive: Etikett

Etikett: Buchhändlerin
type: Concept
preferred label: booksellers' labels @en
created: 2022-12-02
issued: 2022-12-02
modified: 2025-12-03
publisher: Deutsche Nationalbibliothek
definition: Zettel mit Firmennamen, der z.B. auf der Innenseite der Buchdeckel aufgeklebt ist; oft kombiniert mit Preis und Datum.
in scheme: T-PRO Thesaurus der Provenienzbegriffe
pref label: Etikett: Buchhändlerin
  type: Label
  rank: preferred
pref label: booksellers' labels
  type: Label
  rank: normal
broader: Etikett
broader transitive: Etikett

Exemplar: Autor
type: Concept
preferred label: authors' copies @en
preferred label: envoi de l'auteur @fr
created: 2022-12-02
issued: 2022-12-02
modified: 2025-12-03
publisher: Deutsche Nationalbibliothek
definition:
  literal form: Exemplar, das vom Autor benutzt worden ist (z.B. für Korrekturen) oder das Teil seiner Privatbibliothek war; oft kombiniert mit Autogramm, Initiale, Datum. Der Begriff wird nicht für Exemplare gebraucht, die vom Autor einfach nur gewidmet oder verschenkt worden sind.
in scheme: T-PRO Thesaurus der Provenienzbegriffe
top concept of: T-PRO Thesaurus der Provenienzbegriffe
pref label: Exemplar: Autor
  type: Label
  rank: preferred
pref label: authors' copies
  type: Label
  rank: normal
pref label: envoi de l'auteur
  type: Label
  rank: normal

Exemplar: Autorin
type: Concept
preferred label: authors' copies @en
preferred label: envoi de l'auteur @fr
created: 2022-12-02
issued: 2022-12-02
modified: 2025-12-03
publisher: Deutsche Nationalbibliothek
definition:
  literal form: Exemplar, das von dem Autor benutzt worden ist (z.B. für Korrekturen) oder das Teil seiner Privatbibliothek war; oft kombiniert mit Autogramm, Initiale, Datum. Der Begriff wird nicht für Exemplare gebraucht, die vom Autor einfach nur gewidmet oder verschenkt worden sind.
in scheme: T-PRO Thesaurus der Provenienzbegriffe
top concept of: T-PRO Thesaurus der Provenienzbegriffe
pref label: Exemplar: Autorin
  type: Label
  rank: preferred
pref label: authors' copies
  type: Label
  rank: normal
pref label: envoi de l'auteur
  type: Label
  rank: normal

Exemplar: Donator
type: Concept
preferred label: donors' copies @en
preferred label: ex-dono imprimé @fr
created: 2022-12-02
issued: 2022-12-02
modified: 2025-12-03
publisher: Deutsche Nationalbibliothek
in scheme: T-PRO Thesaurus der Provenienzbegriffe
top concept of: T-PRO Thesaurus der Provenienzbegriffe
pref label: Exemplar: Donator
  type: Label
  rank: preferred
pref label: donors' copies
  type: Label
  rank: normal
pref label: ex-dono imprimé
  type: Label
  rank: normal
alternative label: ex-legato imprimé @fr
example: Exemplar, das der Vorbesitzer (Donator) verschenkt, gespendet oder gestiftet hat; nicht verwendet für Absender von Beleg- und Tauschexemplaren. Anm.: Institutionen werden als "Donator" bezeichnet.
alt label: ex-legato imprimé
  type: Label
  rank: preferred

Exemplar: Donatorin
type: Concept
preferred label: donors' copies @en
preferred label: ex-dono imprimé @fr
created: 2022-12-02
issued: 2022-12-02
modified: 2025-12-03
publisher: Deutsche Nationalbibliothek
definition: Exemplar, das der Vorbesitzerin (Donatorin) verschenkt, gespendet oder gestiftet hat; nicht verwendet für Absender von Beleg- und Tauschexemplaren. Anm.: Institutionen werden als "Donator" bezeichnet.
in scheme: T-PRO Thesaurus der Provenienzbegriffe
top concept of: T-PRO Thesaurus der Provenienzbegriffe
pref label: Exemplar: Donatorin
  type: Label
  rank: preferred
pref label: donors' copies
  type: Label
  rank: normal
pref label: ex-dono imprimé
  type: Label
  rank: normal
alternative label: ex-legato imprimé @fr
alt label: ex-legato imprimé
  type: Label
  rank: preferred

Exemplar: Widmungsempfänger
type: Concept
preferred label: dedicatees' copies @en
created: 2022-12-02
issued: 2022-12-02
modified: 2025-12-03
publisher: Deutsche Nationalbibliothek
definition: Exemplar der Person oder Institution, der das Exemplar gewidmet worden ist. Anm.: Institutionen werden als "-empfänger" bezeichnet.
in scheme: T-PRO Thesaurus der Provenienzbegriffe
top concept of: T-PRO Thesaurus der Provenienzbegriffe
pref label: Exemplar: Widmungsempfänger
  type: Label
  rank: preferred
pref label: dedicatees' copies
  type: Label
  rank: normal

Exemplar: Widmungsempfängerin
type: Concept
preferred label: dedicatees' copies @en
created: 2022-12-02
issued: 2022-12-02
modified: 2025-12-03
publisher: Deutsche Nationalbibliothek
definition: Exemplar der Person oder Institution, der das Exemplar gewidmet worden ist. Anm.: Institutionen werden als "-empfängerin" bezeichnet.
in scheme: T-PRO Thesaurus der Provenienzbegriffe
top concept of: T-PRO Thesaurus der Provenienzbegriffe
pref label: Exemplar: Widmungsempfängerin
  type: Label
  rank: preferred
pref label: dedicatees' copies
  type: Label
  rank: normal

Exlibris
type: Concept
preferred label: bookplates @en
preferred label: ex-libris @fr
created: 2022-12-02
issued: 2022-12-02
modified: 2025-12-03
publisher: Deutsche Nationalbibliothek
definition: Auf der Innenseite des vorderen Buchdeckels aufgeklebter Zettel oder aufgedruckter Stempel; oft kombiniert mit Autogramm, Emblem, Initiale, Monogramm, Motto, Wappen.
in scheme: T-PRO Thesaurus der Provenienzbegriffe
top concept of: T-PRO Thesaurus der Provenienzbegriffe
pref label: Exlibris
  type: Label
  rank: preferred
pref label: bookplates
  type: Label
  rank: normal
pref label: ex-libris
  type: Label
  rank: normal

Extra-Ausstattung
type: Concept
preferred label: extra-illustrated copies @en
created: 2022-12-02
issued: 2022-12-02
modified: 2025-12-03
publisher: Deutsche Nationalbibliothek
definition: Zusammenfassende Bezeichnung für Illustrationen (z.B. ausgeschnittene Initialen, Abbildungen), die in das Exemplar eingeklebt oder eingeheftet worden sind und es so zu einem Unikat machen.
in scheme: T-PRO Thesaurus der Provenienzbegriffe
top concept of: T-PRO Thesaurus der Provenienzbegriffe
pref label: Extra-Ausstattung
  type: Label
  rank: preferred
pref label: extra-illustrated copies
  type: Label
  rank: normal

Genealogische Notiz
type: Concept
preferred label: genealogical notes @en
preferred label: notes généalogiques @fr
created: 2022-12-02
issued: 2022-12-02
modified: 2025-12-03
publisher: Deutsche Nationalbibliothek
definition: Informationen über Herkunft und Verwandtschaftsverhältnisse (einzelne Personen und Familien), oft in tabellarischen Übersichten als Stammtafeln dargestellt.
in scheme: T-PRO Thesaurus der Provenienzbegriffe
pref label: Genealogische Notiz
  type: Label
  rank: preferred
pref label: genealogical notes
  type: Label
  rank: normal
pref label: notes généalogiques
  type: Label
  rank: normal
broader: Notiz
broader transitive: Notiz

Notiz
type: Concept
created: 2022-12-02
issued: 2022-12-02
modified: 2025-12-03
publisher: Deutsche Nationalbibliothek
definition: Eintragung auf dem Vorsatzblatt oder eingeschossenen Blättern, z.B. Inhaltsverzeichnis
in scheme: T-PRO Thesaurus der Provenienzbegriffe
top concept of: T-PRO Thesaurus der Provenienzbegriffe
pref label: Notiz
  type: Label
  rank: preferred
narrower: Genealogische Notiz

Grafisches Zeichen
type: Concept
created: 2022-12-02
issued: 2022-12-02
modified: 2025-12-03
publisher: Deutsche Nationalbibliothek
definition: Vom Vorbesitzer zur Kennzeichnung des Exemplars (nicht einzelner Textstellen) angebrachtes Zeichen aus grafischen Elementen, z.B. Dreieck
in scheme: T-PRO Thesaurus der Provenienzbegriffe
top concept of: T-PRO Thesaurus der Provenienzbegriffe
pref label: Grafisches Zeichen
  type: Label
  rank: preferred

Handzeichnung
type: Concept
created: 2022-12-02
issued: 2022-12-02
modified: 2025-12-03
publisher: Deutsche Nationalbibliothek
definition: Karikatur, Strichzeichnung
in scheme: T-PRO Thesaurus der Provenienzbegriffe
top concept of: T-PRO Thesaurus der Provenienzbegriffe
pref label: Handzeichnung
  type: Label
  rank: preferred

Initiale
type: Concept
preferred label: initiales @fr
preferred label: initials @en
created: 2022-12-02
issued: 2022-12-02
modified: 2025-12-03
publisher: Deutsche Nationalbibliothek
definition: Anfangsbuchstabe/n eines Namens. Oft kombiniert mit Einband (DEF bis 30.09.2014: Handschriftlicher Anfangsbuchstabe eines Namens)
in scheme: T-PRO Thesaurus der Provenienzbegriffe
top concept of: T-PRO Thesaurus der Provenienzbegriffe
pref label: Initiale
  type: Label
  rank: preferred
pref label: initials
  type: Label
  rank: normal
pref label: initiales
  type: Label
  rank: normal

Kolonialgut
type: Concept
created: 2022-12-02
issued: 2022-12-02
modified: 2025-12-03
publisher: Deutsche Nationalbibliothek
definition: Sammlungsgut aus kolonialem Kontext.
in scheme: T-PRO Thesaurus der Provenienzbegriffe
top concept of: T-PRO Thesaurus der Provenienzbegriffe
pref label: Kolonialgut
  type: Label
  rank: preferred

Makulatur
type: Concept
preferred label: fragments imprimés @fr
preferred label: spoilage @en
created: 2022-12-02
issued: 2022-12-02
modified: 2025-12-03
publisher: Deutsche Nationalbibliothek
definition: Unbrauchbar gewordenes, bedrucktes oder beschriebenes Papier oder Pergament, das als Einbandmaterial verwendet wurde.
in scheme: T-PRO Thesaurus der Provenienzbegriffe
top concept of: T-PRO Thesaurus der Provenienzbegriffe
pref label: Makulatur
  type: Label
  rank: preferred
pref label: spoilage
  type: Label
  rank: normal
pref label: fragments imprimés
  type: Label
  rank: normal
alternative label: fragments manuscrits @fr
alt label: fragments manuscrits
  type: Label
  rank: preferred

Marginalie
type: Concept
preferred label: annotations marginales @fr
preferred label: marginalia @en
created: 2022-12-02
issued: 2022-12-02
modified: 2025-12-03
publisher: Deutsche Nationalbibliothek
definition: Anmerkung (nicht nur Merkzeichen) am Rand einer Seite
in scheme: T-PRO Thesaurus der Provenienzbegriffe
top concept of: T-PRO Thesaurus der Provenienzbegriffe
pref label: Marginalie
  type: Label
  rank: preferred
pref label: marginalia
  type: Label
  rank: normal
pref label: annotations marginales
  type: Label
  rank: normal

Merkzeichen
type: Concept
preferred label: fists @en
created: 2022-12-02
issued: 2022-12-02
modified: 2025-12-03
publisher: Deutsche Nationalbibliothek
definition: Zeichen, mit denen der Vorbesitzer Textstellen markiert hat, z.B. Unter- und Anstreichung, hinweisende Hand, Chiffre.
in scheme: T-PRO Thesaurus der Provenienzbegriffe
top concept of: T-PRO Thesaurus der Provenienzbegriffe
pref label: Merkzeichen
  type: Label
  rank: preferred
pref label: fists
  type: Label
  rank: normal

Monogramm
type: Concept
preferred label: monogramme @fr
preferred label: monograms @en
created: 2022-12-02
issued: 2022-12-02
modified: 2025-12-03
publisher: Deutsche Nationalbibliothek
definition: Namenszeichen aus künstlerisch gestalteten oder verschlungenen Buchstaben.
in scheme: T-PRO Thesaurus der Provenienzbegriffe
top concept of: T-PRO Thesaurus der Provenienzbegriffe
pref label: Monogramm
  type: Label
  rank: preferred
pref label: monograms
  type: Label
  rank: normal
pref label: monogramme
  type: Label
  rank: normal

Motto
type: Concept
preferred label: devise @fr
preferred label: mottoes @en
created: 2022-12-02
issued: 2022-12-02
modified: 2025-12-03
publisher: Deutsche Nationalbibliothek
definition: Devise, Leitspruch, Sinnspruch
in scheme: T-PRO Thesaurus der Provenienzbegriffe
top concept of: T-PRO Thesaurus der Provenienzbegriffe
pref label: Motto
  type: Label
  rank: preferred
pref label: mottoes
  type: Label
  rank: normal
pref label: devise
  type: Label
  rank: normal

NS-Raubgut: Verdacht
type: Concept
created: 2022-12-02
issued: 2022-12-02
modified: 2025-12-03
publisher: Deutsche Nationalbibliothek
definition: Verdacht auf NS-verfolgungsbedingten Entzug
in scheme: T-PRO Thesaurus der Provenienzbegriffe
pref label: NS-Raubgut: Verdacht
  type: Label
  rank: preferred
broader: NS-Raubgut
broader transitive: Enteignung
broader transitive: NS-Raubgut

Nummer
type: Concept
preferred label: numbers @en
created: 2022-12-02
issued: 2022-12-02
modified: 2025-12-03
publisher: Deutsche Nationalbibliothek
definition: Ziffern, Nummern jeder Art, z.B. Zugangsnummer, Auktionsposten
in scheme: T-PRO Thesaurus der Provenienzbegriffe
top concept of: T-PRO Thesaurus der Provenienzbegriffe
pref label: Nummer
  type: Label
  rank: preferred
pref label: numbers
  type: Label
  rank: normal
narrower: Zugangsnummer

Zugangsnummer
type: Concept
preferred label: accession numbers @en
preferred label: numéro d'inventaire @fr
created: 2022-12-02
issued: 2022-12-02
modified: 2025-12-03
publisher: Deutsche Nationalbibliothek
definition: Im Zusammenhang mit der Inventarisierung vergebene Nummer der im Rechnungsjahr erworbenen Medien. Die Nummer wird im Zugangsbuch einer Bibliothek und gelegentlich auch im Buchexemplar eingetragen
in scheme: T-PRO Thesaurus der Provenienzbegriffe
pref label: Zugangsnummer
  type: Label
  rank: preferred
pref label: accession numbers
  type: Label
  rank: normal
pref label: numéro d'inventaire
  type: Label
  rank: normal
broader: Nummer
broader transitive: Nummer

Porträt
type: Concept
preferred label: portrait @en
created: 2022-12-02
issued: 2022-12-02
modified: 2025-12-03
publisher: Deutsche Nationalbibliothek
definition: Künstlerische Darstellung einer oder mehrerer Personen, z.B. Fotografie, Relief, Zeichnung
in scheme: T-PRO Thesaurus der Provenienzbegriffe
top concept of: T-PRO Thesaurus der Provenienzbegriffe
pref label: Porträt
  type: Label
  rank: preferred
pref label: portrait
  type: Label
  rank: normal
pref label: portrait
  type: Label
  rank: normal

Preis
type: Concept
preferred label: prices @en
preferred label: prix du livre @fr
created: 2022-12-02
issued: 2022-12-02
modified: 2025-12-03
publisher: Deutsche Nationalbibliothek
definition: Angaben zu Kaufpreis oder Bindekosten
in scheme: T-PRO Thesaurus der Provenienzbegriffe
top concept of: T-PRO Thesaurus der Provenienzbegriffe
pref label: Preis
  type: Label
  rank: preferred
pref label: prices
  type: Label
  rank: normal
pref label: prix du livre
  type: Label
  rank: normal

Restitution
type: Concept
created: 2022-12-02
issued: 2022-12-02
modified: 2025-12-03
publisher: Deutsche Nationalbibliothek
definition: Erstattung oder Rückgabe geraubter, enteigneter und zwangsverkaufter Kulturgüter
in scheme: T-PRO Thesaurus der Provenienzbegriffe
top concept of: T-PRO Thesaurus der Provenienzbegriffe
pref label: Restitution
  type: Label
  rank: preferred

Restitutionsexemplar
type: Concept
preferred label: exemplaire de restitution @fr
created: 2022-12-02
issued: 2022-12-02
modified: 2025-12-03
publisher: Deutsche Nationalbibliothek
definition: Buchexemplar, das im Zuge einer Restitution an den rechtmäßigen Eigentümer zurückgegeben worden ist
in scheme: T-PRO Thesaurus der Provenienzbegriffe
top concept of: T-PRO Thesaurus der Provenienzbegriffe
pref label: Restitutionsexemplar
  type: Label
  rank: preferred
pref label: exemplaire de restitution
  type: Label
  rank: normal

Rezensionsexemplar
type: Concept
created: 2022-12-02
issued: 2022-12-02
modified: 2025-12-03
publisher: Deutsche Nationalbibliothek
definition: Exemplar, das dem Vorbesitzer für eine Rezension zur Verfügung gestellt worden ist und z.B. durch einen Stempel als Rezensionsexemplar gekennzeichnet worden ist
in scheme: T-PRO Thesaurus der Provenienzbegriffe
top concept of: T-PRO Thesaurus der Provenienzbegriffe
pref label: Rezensionsexemplar
  type: Label
  rank: preferred

Siegel
type: Concept
preferred label: seals @en
created: 2022-12-02
issued: 2022-12-02
modified: 2025-12-03
publisher: Deutsche Nationalbibliothek
definition: Siegelabdruck jeder Art
in scheme: T-PRO Thesaurus der Provenienzbegriffe
top concept of: T-PRO Thesaurus der Provenienzbegriffe
pref label: Siegel
  type: Label
  rank: preferred
pref label: seals
  type: Label
  rank: normal

Signatur
type: Concept
preferred label: shelf marks @en
created: 2022-12-02
issued: 2022-12-02
modified: 2025-12-03
publisher: Deutsche Nationalbibliothek
definition: Alte Standortnummer des Exemplars in der Bibliothek des Vorbesitzers
in scheme: T-PRO Thesaurus der Provenienzbegriffe
top concept of: T-PRO Thesaurus der Provenienzbegriffe
pref label: Signatur
  type: Label
  rank: preferred
pref label: shelf marks
  type: Label
  rank: normal

Stempel: Buchbinder
type: Concept
created: 2022-12-02
issued: 2022-12-02
modified: 2025-12-03
publisher: Deutsche Nationalbibliothek
definition: Stempelabdruck mit Firmennamen, z.B. auf dem Einband oder der Innenseite des Buchdeckels
in scheme: T-PRO Thesaurus der Provenienzbegriffe
pref label: Stempel: Buchbinder
  type: Label
  rank: preferred
broader: Stempel
broader transitive: Stempel

Stempel: Buchbinderin
type: Concept
created: 2022-12-02
issued: 2022-12-02
modified: 2025-12-03
publisher: Deutsche Nationalbibliothek
definition: Stempelabdruck mit Firmennamen, z.B. auf dem Einband oder der Innenseite des Buchdeckels
in scheme: T-PRO Thesaurus der Provenienzbegriffe
pref label: Stempel: Buchbinderin
  type: Label
  rank: preferred
broader: Stempel
broader transitive: Stempel

Stempel: Buchhändler
type: Concept
created: 2022-12-02
issued: 2022-12-02
modified: 2025-12-03
publisher: Deutsche Nationalbibliothek
definition: Stempelabdruck mit Firmennamen, z.B. auf dem Titelblatt oder der Innenseite des Buchdeckels
in scheme: T-PRO Thesaurus der Provenienzbegriffe
pref label: Stempel: Buchhändler
  type: Label
  rank: preferred
broader: Stempel
broader transitive: Stempel

Stempel: Buchhändlerin
type: Concept
created: 2022-12-02
issued: 2022-12-02
modified: 2025-12-03
publisher: Deutsche Nationalbibliothek
definition: Stempelabdruck mit Firmennamen, z.B. auf dem Titelblatt oder der Innenseite des Buchdeckels
in scheme: T-PRO Thesaurus der Provenienzbegriffe
pref label: Stempel: Buchhändlerin
  type: Label
  rank: preferred
broader: Stempel
broader transitive: Stempel

Tauschexemplar
type: Concept
created: 2022-12-02
issued: 2022-12-02
modified: 2025-12-03
publisher: Deutsche Nationalbibliothek
definition: Exemplar, das von einer Institution durch Tausch erworben worden ist
in scheme: T-PRO Thesaurus der Provenienzbegriffe
top concept of: T-PRO Thesaurus der Provenienzbegriffe
pref label: Tauschexemplar
  type: Label
  rank: preferred

Tektur
type: Concept
created: 2022-12-02
issued: 2022-12-02
modified: 2025-12-03
publisher: Deutsche Nationalbibliothek
definition: Schwärzung, Überklebung
in scheme: T-PRO Thesaurus der Provenienzbegriffe
top concept of: T-PRO Thesaurus der Provenienzbegriffe
pref label: Tektur
  type: Label
  rank: preferred

Tilgung
type: Concept
created: 2022-12-02
issued: 2022-12-02
modified: 2025-12-03
publisher: Deutsche Nationalbibliothek
definition: Fehlstelle oder herausgelöstes Blatt, die auf die Provenienz hinweisen
in scheme: T-PRO Thesaurus der Provenienzbegriffe
top concept of: T-PRO Thesaurus der Provenienzbegriffe
pref label: Tilgung
  type: Label
  rank: preferred

Wappen
type: Concept
preferred label: armes @fr
preferred label: coats of arms @en
created: 2022-12-02
issued: 2022-12-02
modified: 2025-12-03
publisher: Deutsche Nationalbibliothek
definition: Wappen jeder Art; oft kombiniert mit Einband, Exlibris, Stempel
in scheme: T-PRO Thesaurus der Provenienzbegriffe
top concept of: T-PRO Thesaurus der Provenienzbegriffe
pref label: Wappen
  type: Label
  rank: preferred
pref label: coats of arms
  type: Label
  rank: normal
pref label: armes
  type: Label
  rank: normal

Widmung: Autor
type: Concept
preferred label: authors' presentation inscriptions @en
created: 2022-12-02
issued: 2022-12-02
modified: 2025-12-03
publisher: Deutsche Nationalbibliothek
definition: Handschriftliche oder individuelle gedruckte Zueignung des Autors, z.B. auf dem Schmutztitel oder einer Einlage; oft kombiniert mit Autogramm, Initiale, Datum
in scheme: T-PRO Thesaurus der Provenienzbegriffe
pref label: Widmung: Autor
  type: Label
  rank: preferred
pref label: authors' presentation inscriptions
  type: Label
  rank: normal
broader: Widmung
broader transitive: Widmung

Widmung
type: Concept
preferred label: ex-dono manuscrit @fr
preferred label: presentation inscriptions @en
created: 2022-12-02
issued: 2022-12-02
modified: 2025-12-03
publisher: Deutsche Nationalbibliothek
definition: Handschriftliche oder individuelle gedruckte Zueignung jeder Art, z.B. auf dem Schmutztitel oder einer Einlage; oft kombiniert mit Autogramm, Initiale, Datum
in scheme: T-PRO Thesaurus der Provenienzbegriffe
top concept of: T-PRO Thesaurus der Provenienzbegriffe
pref label: Widmung
  type: Label
  rank: preferred
pref label: presentation inscriptions
  type: Label
  rank: normal
pref label: ex-dono manuscrit
  type: Label
  rank: normal
narrower: Widmung: Autor
narrower: Widmung: Autorin
alternative label: presentation bindings @en
alternative label: presentation insertions @en
alternative label: presentation leaves @en
alt label: presentation insertions
  type: Label
  rank: preferred
alt label: presentation leaves
  type: Label
  rank: normal
alt label: presentation bindings
  type: Label
  rank: normal

Widmung: Autorin
type: Concept
preferred label: authors' presentation inscriptions @en
created: 2022-12-02
issued: 2022-12-02
modified: 2025-12-03
publisher: Deutsche Nationalbibliothek
definition: Handschriftliche oder individuelle gedruckte Zueignung des Autors, z.B. auf dem Schmutztitel oder einer Einlage; oft kombiniert mit Autogramm, Initiale, Datum
in scheme: T-PRO Thesaurus der Provenienzbegriffe
pref label: Widmung: Autorin
  type: Label
  rank: preferred
pref label: authors' presentation inscriptions
  type: Label
  rank: normal
broader: Widmung
broader transitive: Widmung

Zensur
type: Concept
created: 2022-12-02
issued: 2022-12-02
modified: 2025-12-03
publisher: Deutsche Nationalbibliothek
definition: Kontrolle des Publikationsprozesses durch staatliche bzw. kirchliche Zensurorgane. Oft kombiniert mit Stempel.
in scheme: T-PRO Thesaurus der Provenienzbegriffe
top concept of: T-PRO Thesaurus der Provenienzbegriffe
pref label: Zensur
  type: Label
  rank: preferred

Zensurexemplar
type: Concept
preferred label: marques de censure @fr
created: 2022-12-02
issued: 2022-12-02
modified: 2025-12-03
publisher: Deutsche Nationalbibliothek
definition: Exemplar, das aufgrund von Zensurvorschriften nur eingeschränkt oder nicht für die Benutzung zur Verfügung stand
in scheme: T-PRO Thesaurus der Provenienzbegriffe
top concept of: T-PRO Thesaurus der Provenienzbegriffe
pref label: Zensurexemplar
  type: Label
  rank: preferred
pref label: marques de censure
  type: Label
  rank: normal