Creative Commons Namensnennung 4.0
notation: CC BY 4.0
preferred label: Creative Commons Attribution 4.0 @en

Konservierungs- und Restaurierungsfachthesaurus für archäologische Kulturgüter
type: list
type: ConceptScheme
notation: archlink_conservationthesaurus
license: Creative Commons Namensnennung 4.0

Bast
type: Concept
notation: A2159C
created: 2026-01-30
issued: 2026-01-30
modified: 2026-02-04
publisher: Leibniz-Zentrum für Archäologie (LEIZA)
alternative label: Rindenbast
broader: pflanzliche Fasern
broader transitive: pflanzliche Fasern
broader transitive: Material
broader transitive: [Untersuchungsergebnisse]
broader transitive: Zustandserfassung
broader transitive: Objektuntersuchung
broader transitive: organisches Material
broader transitive: Materialien pflanzlichen Ursprungs
broader transitive: Materialbestimmung
definition: natürliche, lange Fasern pflanzlicher Herkunft, die auf Rinden, Stengeln, Blättern oder Fruchtschalen gewonnen werden.
in scheme: Konservierungs- und Restaurierungsfachthesaurus für archäologische Kulturgüter
alt label: Rindenbast
  type: Label
  rank: preferred
pref label: Bast
  type: Label
  rank: preferred

pflanzliche Fasern
type: Concept
notation: DD9C25
preferred label: plant fibres @en
created: 2026-01-30
issued: 2026-01-30
modified: 2026-02-04
publisher: Leibniz-Zentrum für Archäologie (LEIZA)
alternative label: Pflanzenfasern
broader: Materialien pflanzlichen Ursprungs
broader transitive: Material
broader transitive: [Untersuchungsergebnisse]
broader transitive: Zustandserfassung
broader transitive: Objektuntersuchung
broader transitive: Materialbestimmung
broader transitive: organisches Material
broader transitive: Materialien pflanzlichen Ursprungs
in scheme: Konservierungs- und Restaurierungsfachthesaurus für archäologische Kulturgüter
alt label: Pflanzenfasern
  type: Label
  rank: preferred
pref label: pflanzliche Fasern
  type: Label
  rank: preferred
pref label: plant fibres
  type: Label
  rank: normal
definition: Natürliche Fasern, die aus pflanzlichem Material gewonnen und für verschiedene Anwendungen, wie Textilien, Seilen, Körben, Schnüren oder Matten, verwendet wurden.
narrower: Bast
narrower: Baumwolle
narrower: Jute
narrower: Flachs
narrower: Hanf
narrower: Papyrus
narrower: Kapok
narrower: Stroh

Material
type: Concept
notation: B51DAF
created: 2026-01-30
issued: 2026-01-30
modified: 2026-02-04
publisher: Leibniz-Zentrum für Archäologie (LEIZA)
broader: Materialbestimmung
broader transitive: Materialbestimmung
broader transitive: [Untersuchungsergebnisse]
broader transitive: Zustandserfassung
broader transitive: Objektuntersuchung
definition: Material aus dem das Objekt besteht.
in scheme: Konservierungs- und Restaurierungsfachthesaurus für archäologische Kulturgüter
pref label: Material
  type: Label
  rank: preferred
alternative label: Objektmaterial
narrower: Metall
narrower: organisches Material
narrower: silikatisches Material
alt label: Objektmaterial
  type: Label
  rank: preferred

[Untersuchungsergebnisse]
type: Concept
type: NonIndexingConcept
type: GuideTerm
notation: BC5B57
preferred label: examination results @en
created: 2026-01-30
issued: 2026-01-30
modified: 2026-02-04
publisher: Leibniz-Zentrum für Archäologie (LEIZA)
alternative label: Diagnose
broader: Objektuntersuchung
broader transitive: Zustandserfassung
broader transitive: Objektuntersuchung
definition: strukturierender Sammelbegriff für die Benennung der bei der Objektuntersuchung festgestellten Beobachtungen und Auswertungen hinsichtlich der Gesamtbeschaffenheit des Objektes und dessen Ursache
in scheme: Konservierungs- und Restaurierungsfachthesaurus für archäologische Kulturgüter
narrower: Technologische Auswertung
narrower: Schadensphänomen
narrower: Schadenssursache
narrower: Materialbestimmung
narrower: Zustandsbeschreibung
alt label: Diagnose
  type: Label
  rank: preferred
pref label: [Untersuchungsergebnisse]
  type: Label
  rank: preferred
pref label: examination results
  type: Label
  rank: normal

Zustandserfassung
type: Concept
notation: C4BCF8
preferred label: Condition assessment @en
created: 2026-01-30
issued: 2026-01-30
modified: 2026-02-04
publisher: Leibniz-Zentrum für Archäologie (LEIZA)
alternative label: Zustandserhebung
definition: methodische Untersuchung zur Ermittlung und Einschätzung des Erhaltungszustandes eines Objektes zu einem definierten Zeitpunkt
in scheme: Konservierungs- und Restaurierungsfachthesaurus für archäologische Kulturgüter
narrower: Objektuntersuchung
narrower: Erhaltungszustand
narrower: Bisherige Lagerung
alt label: Zustandserhebung
  type: Label
  rank: preferred
pref label: Zustandserfassung
  type: Label
  rank: preferred
pref label: Condition assessment
  type: Label
  rank: normal
top concept of: Konservierungs- und Restaurierungsfachthesaurus für archäologische Kulturgüter

Objektuntersuchung
type: Concept
notation: CA1BC5
preferred label: examination @en
created: 2026-01-30
issued: 2026-01-30
modified: 2026-02-04
publisher: Leibniz-Zentrum für Archäologie (LEIZA)
broader: Zustandserfassung
broader transitive: Zustandserfassung
definition: Beschaffung und Sammlung von Informationen über den Zustand eines Objektes, anhand derer das Restaurierungs-/Konservierungskonzept und/oder die weiteren Lagerungs- und Handhabungsempefehlungen formuliert werden
definition:
  literal form: Beschaffung und Sammlung von Informationen über den Zustand eines Objektes, anhand derer das Restaurierungs-/Konservierungskonzept und/oder die weiteren Lagerungs- und Handhabungsempefehlungen formuliert werden
in scheme: Konservierungs- und Restaurierungsfachthesaurus für archäologische Kulturgüter
narrower: [Untersuchungsergebnisse]
narrower: [Untersuchungsgerät]
narrower: [Untersuchungsmethode]
pref label: Objektuntersuchung
  type: Label
  rank: preferred
pref label: examination
  type: Label
  rank: normal

organisches Material
type: Concept
notation: CD3341
preferred label: organic @en
created: 2026-01-30
issued: 2026-01-30
modified: 2026-02-04
publisher: Leibniz-Zentrum für Archäologie (LEIZA)
broader: Material
broader transitive: Material
broader transitive: [Untersuchungsergebnisse]
broader transitive: Zustandserfassung
broader transitive: Objektuntersuchung
broader transitive: Materialbestimmung
definition: Allgemeiner Sammelbegriff für natürlich von Organismen gebildete Stoffe meist tierisch- oder pflanzlichen Ursprungs.
in scheme: Konservierungs- und Restaurierungsfachthesaurus für archäologische Kulturgüter
pref label: organisches Material
  type: Label
  rank: preferred
pref label: organic
  type: Label
  rank: normal
narrower: Materialien tierischen Ursprungs
narrower: Materialien pflanzlichen Ursprungs
narrower: Kaustobiolith
alternative label: Organik
alternative label: biologisches Material
alt label: Organik
  type: Label
  rank: preferred
alt label: biologisches Material
  type: Label
  rank: normal

Materialien pflanzlichen Ursprungs
type: Concept
notation: F3G8D1
created: 2026-01-30
issued: 2026-01-30
modified: 2026-02-04
publisher: Leibniz-Zentrum für Archäologie (LEIZA)
broader: organisches Material
broader transitive: Material
broader transitive: [Untersuchungsergebnisse]
broader transitive: Zustandserfassung
broader transitive: Objektuntersuchung
broader transitive: organisches Material
broader transitive: Materialbestimmung
definition: Überbegriff für Materialien die aus Pflanzen gewonnen werden.
in scheme: Konservierungs- und Restaurierungsfachthesaurus für archäologische Kulturgüter
pref label: Materialien pflanzlichen Ursprungs
  type: Label
  rank: preferred
narrower: Holz
narrower: Rinde
narrower: pflanzliche Fasern
narrower: Samen

Materialbestimmung
type: Concept
notation: GD172G
created: 2026-01-30
issued: 2026-01-30
modified: 2026-02-04
publisher: Leibniz-Zentrum für Archäologie (LEIZA)
broader: [Untersuchungsergebnisse]
broader transitive: [Untersuchungsergebnisse]
broader transitive: Zustandserfassung
broader transitive: Objektuntersuchung
definition: Identifizierung des (der) Material(ien), aus dem (denen) das Objekt besteht.
in scheme: Konservierungs- und Restaurierungsfachthesaurus für archäologische Kulturgüter
narrower: Material
pref label: Materialbestimmung
  type: Label
  rank: preferred

Baumwolle
type: Concept
notation: A5G856
preferred label: cotton @en
created: 2026-01-30
issued: 2026-01-30
modified: 2026-02-04
publisher: Leibniz-Zentrum für Archäologie (LEIZA)
alternative label: Baumwollfaser
broader: pflanzliche Fasern
broader transitive: pflanzliche Fasern
broader transitive: Material
broader transitive: [Untersuchungsergebnisse]
broader transitive: Zustandserfassung
broader transitive: Objektuntersuchung
broader transitive: organisches Material
broader transitive: Materialien pflanzlichen Ursprungs
broader transitive: Materialbestimmung
definition: natürliche, einzellige Fasern aus den Samen der Baumwollpflanze (Gossypium)
in scheme: Konservierungs- und Restaurierungsfachthesaurus für archäologische Kulturgüter
alt label: Baumwollfaser
  type: Label
  rank: preferred
pref label: Baumwolle
  type: Label
  rank: preferred
pref label: cotton
  type: Label
  rank: normal

Holz
type: Concept
notation: A9A858
created: 2026-01-30
issued: 2026-01-30
modified: 2026-02-04
publisher: Leibniz-Zentrum für Archäologie (LEIZA)
broader: Materialien pflanzlichen Ursprungs
broader transitive: Material
broader transitive: [Untersuchungsergebnisse]
broader transitive: Zustandserfassung
broader transitive: Objektuntersuchung
broader transitive: organisches Material
broader transitive: Materialien pflanzlichen Ursprungs
broader transitive: Materialbestimmung
definition: natürliches Material, nachwachsender Rohstoff; die Hauptbestandteile von Holz sind Cellulose, Hemicellulose und Lignin, während des Wachstums werden Extraktstoffe und Mineralien in den Zellen eingelagert. Holz ist aufgrund seiner Festigkeit, Vielseitigkeit und Verfügbarkeit ein wichtiger Rohstoff für Bau-, Möbel- und Kunsthandwerksanwendungen.
definition:
  literal form: natürliches Material, nachwachsender Rohstoff; die Hauptbestandteile von Holz sind Cellulose, Hemicellulose und Lignin, während des Wachstums werden Extraktstoffe und Mineralien in den Zellen eingelagert. Holz ist aufgrund seiner Festigkeit, Vielseitigkeit und Verfügbarkeit ein wichtiger Rohstoff für Bau-, Möbel- und Kunsthandwerksanwendungen.
in scheme: Konservierungs- und Restaurierungsfachthesaurus für archäologische Kulturgüter
pref label: Holz
  type: Label
  rank: preferred
narrower: rezentes Holz
narrower: archäologisches Holz
narrower: [Holzart]

rezentes Holz
type: Concept
notation: C47769
created: 2026-01-30
issued: 2026-01-30
modified: 2026-02-04
publisher: Leibniz-Zentrum für Archäologie (LEIZA)
broader: Holz
broader transitive: Material
broader transitive: [Untersuchungsergebnisse]
broader transitive: Zustandserfassung
broader transitive: Objektuntersuchung
broader transitive: organisches Material
broader transitive: Materialien pflanzlichen Ursprungs
broader transitive: Materialbestimmung
broader transitive: Holz
definition: Holz, das frisch geschlagen oder abgelagert ist, jedoch im Vergleich zu archäologischem Holz noch keinen nennenswerten Abbauprozessen ausgesetzt war
in scheme: Konservierungs- und Restaurierungsfachthesaurus für archäologische Kulturgüter
pref label: rezentes Holz
  type: Label
  rank: preferred

archäologisches Holz
type: Concept
notation: C947B5
preferred label: wet-wood @en
created: 2026-01-30
issued: 2026-01-30
modified: 2026-02-04
publisher: Leibniz-Zentrum für Archäologie (LEIZA)
alternative label: Nassholz
broader: Holz
broader transitive: Holz
broader transitive: Material
broader transitive: [Untersuchungsergebnisse]
broader transitive: Zustandserfassung
broader transitive: Objektuntersuchung
broader transitive: organisches Material
broader transitive: Materialien pflanzlichen Ursprungs
broader transitive: Materialbestimmung
definition: Holz aus archäologischem Kontext. Damit sich Holz während der Bodenlagerung erhält, sind wassergesättigte und sauerstoffarme Bodenbedingungen nötig. Während Holz als organisches Material unter normalen Bedingungen in relativ kurzer Zeit verrottet, indem die chemischen Bestandteile von Mikroorganismen wie Pilzen und Bakterien sowie tierischen Schädlingen angegriffen und zersetzt werden, wird die Holzsubstanz unter sauerstofffreien oder zumindest sauerstoffreduzierten Bedingungen nur von anaeroben Bakterien zersetzt. Bei den Zersetzungsprozessen werden Cellulose und Hemicellulose nach und nach abgebaut, während das Ligningerüst oftmals weitestgehend erhalten bleibt. Die geschädigten und geschwächten Zellen werden durch Wasser ausgefüllt und sorgt dafür, dass die ursprüngliche Form des Holzartefakt erhalten bleibt.
definition:
  literal form: Holz aus archäologischem Kontext. Damit sich Holz während der Bodenlagerung erhält, sind wassergesättigte und sauerstoffarme Bodenbedingungen nötig. Während Holz als organisches Material unter normalen Bedingungen in relativ kurzer Zeit verrottet, indem die chemischen Bestandteile von Mikroorganismen wie Pilzen und Bakterien sowie tierischen Schädlingen angegriffen und zersetzt werden, wird die Holzsubstanz unter sauerstofffreien oder zumindest sauerstoffreduzierten Bedingungen nur von anaeroben Bakterien zersetzt. Bei den Zersetzungsprozessen werden Cellulose und Hemicellulose nach und nach abgebaut, während das Ligningerüst oftmals weitestgehend erhalten bleibt. Die geschädigten und geschwächten Zellen werden durch Wasser ausgefüllt und sorgt dafür, dass die ursprüngliche Form des Holzartefakt erhalten bleibt.
in scheme: Konservierungs- und Restaurierungsfachthesaurus für archäologische Kulturgüter
alt label: Nassholz
  type: Label
  rank: preferred
pref label: archäologisches Holz
  type: Label
  rank: preferred
pref label: wet-wood
  type: Label
  rank: normal

[Holzart]
type: Concept
type: NonIndexingConcept
type: GuideTerm
notation: DFG875
created: 2026-01-30
issued: 2026-01-30
modified: 2026-02-04
publisher: Leibniz-Zentrum für Archäologie (LEIZA)
broader: Holz
broader transitive: Holz
broader transitive: Material
broader transitive: [Untersuchungsergebnisse]
broader transitive: Zustandserfassung
broader transitive: Objektuntersuchung
broader transitive: organisches Material
broader transitive: Materialien pflanzlichen Ursprungs
broader transitive: Materialbestimmung
definition: Stützwort zur Thesaurus-Strukturierung, das die nachfolgenden Begriffe als Arten von Holz klassifiziert
in scheme: Konservierungs- und Restaurierungsfachthesaurus für archäologische Kulturgüter
pref label: [Holzart]
  type: Label
  rank: preferred
narrower: Nadelholz
narrower: Laubholz

Jute
type: Concept
notation: AG4634
created: 2026-01-30
issued: 2026-01-30
modified: 2026-02-04
publisher: Leibniz-Zentrum für Archäologie (LEIZA)
broader: pflanzliche Fasern
broader transitive: pflanzliche Fasern
broader transitive: Material
broader transitive: [Untersuchungsergebnisse]
broader transitive: Zustandserfassung
broader transitive: Objektuntersuchung
broader transitive: organisches Material
broader transitive: Materialien pflanzlichen Ursprungs
broader transitive: Materialbestimmung
definition: natürliche Stengelfaser, die aus den Pflanzen der Corchorusarten (Corchorus capsularis und Corchorus olitorius) gewonnen wird.
in scheme: Konservierungs- und Restaurierungsfachthesaurus für archäologische Kulturgüter
pref label: Jute
  type: Label
  rank: preferred

Rinde
type: Concept
notation: C2FCA7
preferred label: bark @en
created: 2026-01-30
issued: 2026-01-30
modified: 2026-02-04
publisher: Leibniz-Zentrum für Archäologie (LEIZA)
broader: Materialien pflanzlichen Ursprungs
broader transitive: Material
broader transitive: [Untersuchungsergebnisse]
broader transitive: Zustandserfassung
broader transitive: Objektuntersuchung
broader transitive: organisches Material
broader transitive: Materialien pflanzlichen Ursprungs
broader transitive: Materialbestimmung
definition: natürliches Material, welches als äußerste Schicht die holzigen Teile von Bäumen bedeckt.
in scheme: Konservierungs- und Restaurierungsfachthesaurus für archäologische Kulturgüter
pref label: Rinde
  type: Label
  rank: preferred
pref label: bark
  type: Label
  rank: normal

Hanf
type: Concept
notation: C3AF5A
preferred label: hemp @en
created: 2026-01-30
issued: 2026-01-30
modified: 2026-02-04
publisher: Leibniz-Zentrum für Archäologie (LEIZA)
broader: pflanzliche Fasern
broader transitive: pflanzliche Fasern
broader transitive: Material
broader transitive: [Untersuchungsergebnisse]
broader transitive: Zustandserfassung
broader transitive: Objektuntersuchung
broader transitive: organisches Material
broader transitive: Materialien pflanzlichen Ursprungs
broader transitive: Materialbestimmung
definition: natürliche Stengelfaser, gewonnen aus dem Bast der Hanfpflanze (Cannabis sativa) durch verschiedene Bearbeitungsschritte
in scheme: Konservierungs- und Restaurierungsfachthesaurus für archäologische Kulturgüter
pref label: Hanf
  type: Label
  rank: preferred
pref label: hemp
  type: Label
  rank: normal

Papyrus
type: Concept
notation: D53ADA
created: 2026-01-30
issued: 2026-01-30
modified: 2026-02-04
publisher: Leibniz-Zentrum für Archäologie (LEIZA)
broader: pflanzliche Fasern
broader transitive: pflanzliche Fasern
broader transitive: Material
broader transitive: [Untersuchungsergebnisse]
broader transitive: Zustandserfassung
broader transitive: Objektuntersuchung
broader transitive: organisches Material
broader transitive: Materialien pflanzlichen Ursprungs
broader transitive: Materialbestimmung
in scheme: Konservierungs- und Restaurierungsfachthesaurus für archäologische Kulturgüter
pref label: Papyrus
  type: Label
  rank: preferred

Kapok
type: Concept
notation: G8533D
created: 2026-01-30
issued: 2026-01-30
modified: 2026-02-04
publisher: Leibniz-Zentrum für Archäologie (LEIZA)
broader: pflanzliche Fasern
broader transitive: pflanzliche Fasern
broader transitive: Material
broader transitive: [Untersuchungsergebnisse]
broader transitive: Zustandserfassung
broader transitive: Objektuntersuchung
broader transitive: organisches Material
broader transitive: Materialien pflanzlichen Ursprungs
broader transitive: Materialbestimmung
definition: aus den Samenhülsen des Kapokbaumes bestehende natürliche Fasern
in scheme: Konservierungs- und Restaurierungsfachthesaurus für archäologische Kulturgüter
pref label: Kapok
  type: Label
  rank: preferred

Stroh
type: Concept
notation: GFDB57
preferred label: straw @en
created: 2026-01-30
issued: 2026-01-30
modified: 2026-02-04
publisher: Leibniz-Zentrum für Archäologie (LEIZA)
broader: pflanzliche Fasern
broader transitive: pflanzliche Fasern
broader transitive: Material
broader transitive: [Untersuchungsergebnisse]
broader transitive: Zustandserfassung
broader transitive: Objektuntersuchung
broader transitive: organisches Material
broader transitive: Materialien pflanzlichen Ursprungs
broader transitive: Materialbestimmung
definition: getrocknete Halme pflanzlicher Fasern, die für eine Vielzahl unterschiedlicher Zwecke verwendet werden, z.B. zum Weben, Flechten oder als Magerungsmittel für Ton
in scheme: Konservierungs- und Restaurierungsfachthesaurus für archäologische Kulturgüter
pref label: Stroh
  type: Label
  rank: preferred
pref label: straw
  type: Label
  rank: normal

Kiefernholz
type: Concept
notation: A73FD7
created: 2026-01-30
issued: 2026-01-30
modified: 2026-02-04
publisher: Leibniz-Zentrum für Archäologie (LEIZA)
alternative label: Pinus silvestris
broader: Nadelholz
broader transitive: Nadelholz
broader transitive: Holz
broader transitive: Material
broader transitive: [Untersuchungsergebnisse]
broader transitive: Zustandserfassung
broader transitive: Objektuntersuchung
broader transitive: organisches Material
broader transitive: [Holzart]
broader transitive: Materialien pflanzlichen Ursprungs
broader transitive: Materialbestimmung
definition: Holz von der Kiefer, einem in Europa weit verbreiteten Nadelbaum. Das Holz zeichnet sich durch eine gelblich bis rötlichweiße Färbung aus, die im Laufe der Zeit bis rötlich-braun nachdunkelt, sowie eine kräftige und dekorative Maserung. Kiefernholz ist sehr harzreich und verströmt beim Bearbeiten einen typischen, aromatischen Duft. Es lässt sich mit den gängigen Holzwerkzeugen gut bearbeiten und wird daher für vielerlei Verwendungen (u.A. für Möbel, Türen, Fenster, Fußböden und als Funierholz) genutzt.
definition:
  literal form: Holz von der Kiefer, einem in Europa weit verbreiteten Nadelbaum. Das Holz zeichnet sich durch eine gelblich bis rötlichweiße Färbung aus, die im Laufe der Zeit bis rötlich-braun nachdunkelt, sowie eine kräftige und dekorative Maserung. Kiefernholz ist sehr harzreich und verströmt beim Bearbeiten einen typischen, aromatischen Duft. Es lässt sich mit den gängigen Holzwerkzeugen gut bearbeiten und wird daher für vielerlei Verwendungen (u.A. für Möbel, Türen, Fenster, Fußböden und als Funierholz) genutzt.
in scheme: Konservierungs- und Restaurierungsfachthesaurus für archäologische Kulturgüter
alt label: Pinus silvestris
  type: Label
  rank: preferred
pref label: Kiefernholz
  type: Label
  rank: preferred

Nadelholz
type: Concept
notation: FC3FD6
created: 2026-01-30
issued: 2026-01-30
modified: 2026-02-04
publisher: Leibniz-Zentrum für Archäologie (LEIZA)
broader: [Holzart]
broader transitive: Holz
broader transitive: Material
broader transitive: [Untersuchungsergebnisse]
broader transitive: Zustandserfassung
broader transitive: Objektuntersuchung
broader transitive: organisches Material
broader transitive: [Holzart]
broader transitive: Materialien pflanzlichen Ursprungs
broader transitive: Materialbestimmung
definition: Von Bäumen der botanischen Gruppe der Gymnospermen (Nadelbäume) gewonnenes Holz. Eine einzige Art von Zellen, die Tracheiden, übernimmt sowohl die Stabilitäts- als auch die Wassertransportfunktion, was dem Nadelholz einen relativ einfachen und regelmäßigen Zellaufbau verleiht. Dank ihrer Anpassung an kurze Vegetationsperioden können Nadelbäume auch in Regionen mit langen, kalten Wintern oder in großen Höhen überleben, wo Laubbäume nicht mehr wachsen.
definition:
  literal form: Von Bäumen der botanischen Gruppe der Gymnospermen (Nadelbäume) gewonnenes Holz. Eine einzige Art von Zellen, die Tracheiden, übernimmt sowohl die Stabilitäts- als auch die Wassertransportfunktion, was dem Nadelholz einen relativ einfachen und regelmäßigen Zellaufbau verleiht. Dank ihrer Anpassung an kurze Vegetationsperioden können Nadelbäume auch in Regionen mit langen, kalten Wintern oder in großen Höhen überleben, wo Laubbäume nicht mehr wachsen.
in scheme: Konservierungs- und Restaurierungsfachthesaurus für archäologische Kulturgüter
pref label: Nadelholz
  type: Label
  rank: preferred
narrower: Kiefernholz
narrower: Lärchenholz
narrower: Tannenholz
narrower: Fichtenholz
narrower: Eibenholz

Laubholz
type: Concept
notation: B7DD6B
created: 2026-01-30
issued: 2026-01-30
modified: 2026-02-04
publisher: Leibniz-Zentrum für Archäologie (LEIZA)
broader: [Holzart]
broader transitive: Holz
broader transitive: Material
broader transitive: [Untersuchungsergebnisse]
broader transitive: Zustandserfassung
broader transitive: Objektuntersuchung
broader transitive: organisches Material
broader transitive: [Holzart]
broader transitive: Materialien pflanzlichen Ursprungs
broader transitive: Materialbestimmung
definition: Von Bäumen der botanischen Gruppe der Dikotyledonen (Laubbäume) gewonnenes Holz, mit artspezifischen Ausprägungen des Zellbaues aus Gefäßen, Libriformfasern, Tracheiden und Parenchymzellen.
in scheme: Konservierungs- und Restaurierungsfachthesaurus für archäologische Kulturgüter
pref label: Laubholz
  type: Label
  rank: preferred
narrower: ringporiges Laubholz
narrower: zerstreutporiges Laubholz

ringporiges Laubholz
type: Concept
notation: D39191
created: 2026-01-30
issued: 2026-01-30
modified: 2026-02-04
publisher: Leibniz-Zentrum für Archäologie (LEIZA)
broader: Laubholz
broader transitive: Holz
broader transitive: Material
broader transitive: [Untersuchungsergebnisse]
broader transitive: Zustandserfassung
broader transitive: Objektuntersuchung
broader transitive: organisches Material
broader transitive: [Holzart]
broader transitive: Materialien pflanzlichen Ursprungs
broader transitive: Materialbestimmung
broader transitive: Laubholz
definition: Laubholz, das große Tracheen/Gefäße im Frühholz und deutlich kleinere im Spätholz ausbildet. Im Querschnitt von ringporigem Laubholz sind deutlich ringförmige Strukturen sichtbar
in scheme: Konservierungs- und Restaurierungsfachthesaurus für archäologische Kulturgüter
pref label: ringporiges Laubholz
  type: Label
  rank: preferred
narrower: Eschenholz
narrower: Eichenholz
narrower: Ulmenholz

zerstreutporiges Laubholz
type: Concept
notation: DAA3F9
created: 2026-01-30
issued: 2026-01-30
modified: 2026-02-04
publisher: Leibniz-Zentrum für Archäologie (LEIZA)
broader: Laubholz
broader transitive: Holz
broader transitive: Material
broader transitive: Laubholz
broader transitive: [Untersuchungsergebnisse]
broader transitive: Zustandserfassung
broader transitive: Objektuntersuchung
broader transitive: organisches Material
broader transitive: [Holzart]
broader transitive: Materialien pflanzlichen Ursprungs
broader transitive: Materialbestimmung
in scheme: Konservierungs- und Restaurierungsfachthesaurus für archäologische Kulturgüter
pref label: zerstreutporiges Laubholz
  type: Label
  rank: preferred
definition: Laubholz, bei dem die Gefäße/Tracheen gleichmäßig und ohne klare Anordnung über einen gesamten Jahrring verteilt im Holz vorkommen. Anders als bei ringporigen Hölzern, bei denen große Gefäße im Frühholz und kleinere im Spätholz auftreten, gibt es bei zerstreutporigen Hölzern keinen großen Unterschied in der Größe oder Verteilung der Gefäße zwischen Früh- und Spätholz.
definition:
  literal form: Laubholz, bei dem die Gefäße/Tracheen gleichmäßig und ohne klare Anordnung über einen gesamten Jahrring verteilt im Holz vorkommen. Anders als bei ringporigen Hölzern, bei denen große Gefäße im Frühholz und kleinere im Spätholz auftreten, gibt es bei zerstreutporigen Hölzern keinen großen Unterschied in der Größe oder Verteilung der Gefäße zwischen Früh- und Spätholz.
narrower: Obstholz
narrower: Lindenholz
narrower: Pappelholz
narrower: Buchenholz
narrower: Birkenholz
narrower: Ahornholz
narrower: Erlenholz
narrower: Buchsbaumholz
narrower: Haselholz
narrower: Weidenholz

Eschenholz
type: Concept
notation: DBG8AD
created: 2026-01-30
issued: 2026-01-30
modified: 2026-02-04
publisher: Leibniz-Zentrum für Archäologie (LEIZA)
alternative label: Fraxinus excelsior
broader: ringporiges Laubholz
broader transitive: Holz
broader transitive: Material
broader transitive: Laubholz
broader transitive: [Untersuchungsergebnisse]
broader transitive: Zustandserfassung
broader transitive: Objektuntersuchung
broader transitive: organisches Material
broader transitive: [Holzart]
broader transitive: Materialien pflanzlichen Ursprungs
broader transitive: Materialbestimmung
broader transitive: ringporiges Laubholz
in scheme: Konservierungs- und Restaurierungsfachthesaurus für archäologische Kulturgüter
alt label: Fraxinus excelsior
  type: Label
  rank: preferred
pref label: Eschenholz
  type: Label
  rank: preferred
definition: Holz der Esche. Das Holz zeigt eine gelblich-weiße bis rötliche Färbung auf, die im Laufe der Zeit hellbraun nachdunkeln kann. Zum Teil zeigen sich auch unregelmäßig gestreifte oder wolkige Färbungen, mit nicht immer deutlichen Splint- und Kernholzgrenzen. Es ist ein relativ weiches Holz, mit jedoch guter Festigkeit und Biegsamkeit, welches sich sowohl manuell als auch maschinell gut bearbeiten lässt
definition:
  literal form: Holz der Esche. Das Holz zeigt eine gelblich-weiße bis rötliche Färbung auf, die im Laufe der Zeit hellbraun nachdunkeln kann. Zum Teil zeigen sich auch unregelmäßig gestreifte oder wolkige Färbungen, mit nicht immer deutlichen Splint- und Kernholzgrenzen. Es ist ein relativ weiches Holz, mit jedoch guter Festigkeit und Biegsamkeit, welches sich sowohl manuell als auch maschinell gut bearbeiten lässt

Eichenholz
type: Concept
notation: FG3BCD
preferred label: oak @en
created: 2026-01-30
issued: 2026-01-30
modified: 2026-02-04
publisher: Leibniz-Zentrum für Archäologie (LEIZA)
alternative label: Quercus species
broader: ringporiges Laubholz
broader transitive: Holz
broader transitive: Material
broader transitive: Laubholz
broader transitive: [Untersuchungsergebnisse]
broader transitive: Zustandserfassung
broader transitive: Objektuntersuchung
broader transitive: organisches Material
broader transitive: [Holzart]
broader transitive: Materialien pflanzlichen Ursprungs
broader transitive: Materialbestimmung
broader transitive: ringporiges Laubholz
in scheme: Konservierungs- und Restaurierungsfachthesaurus für archäologische Kulturgüter
alt label: Quercus species
  type: Label
  rank: preferred
pref label: Eichenholz
  type: Label
  rank: preferred
pref label: oak
  type: Label
  rank: normal
definition: Holz aus Eichenbäumen. Das Holz der verschiedenen Eichenbäumen ist im allgemeinen als starkes und strapazierfähiges Holz zu beschreiben, welches eine üblicherweise hellbraune bis gelblich-braun/rötliche Färbung aufweist. Die Maserung verläuft häufig in markanten, wellenförmigen/gespiegelten Formen. Die mechanische Bearbeitbarkeit hängt im Detail von der jeweiligen Eichenart ab, ist insgesamt jedoch als gut zu beschreiben.
definition:
  literal form: Holz aus Eichenbäumen. Das Holz der verschiedenen Eichenbäumen ist im allgemeinen als starkes und strapazierfähiges Holz zu beschreiben, welches eine üblicherweise hellbraune bis gelblich-braun/rötliche Färbung aufweist. Die Maserung verläuft häufig in markanten, wellenförmigen/gespiegelten Formen. Die mechanische Bearbeitbarkeit hängt im Detail von der jeweiligen Eichenart ab, ist insgesamt jedoch als gut zu beschreiben.

Ulmenholz
type: Concept
notation: G2C131
created: 2026-01-30
issued: 2026-01-30
modified: 2026-02-04
publisher: Leibniz-Zentrum für Archäologie (LEIZA)
alternative label: Ulmus campestris
broader: ringporiges Laubholz
broader transitive: Holz
broader transitive: Material
broader transitive: Laubholz
broader transitive: [Untersuchungsergebnisse]
broader transitive: Zustandserfassung
broader transitive: Objektuntersuchung
broader transitive: organisches Material
broader transitive: [Holzart]
broader transitive: Materialien pflanzlichen Ursprungs
broader transitive: Materialbestimmung
broader transitive: ringporiges Laubholz
in scheme: Konservierungs- und Restaurierungsfachthesaurus für archäologische Kulturgüter
alt label: Ulmus campestris
  type: Label
  rank: preferred
pref label: Ulmenholz
  type: Label
  rank: preferred
definition: Holz der Ulme. Ulmenholz zeichnet sich durch eine charakteristische Farbpalette aus, die von gelblich-braun bis dunkelbraun reicht, oft mit einem rötlichen Schimmer. Die Maserung ist häufig markant und wellenförmig, gelegentlich mit unregelmäßigen Streifen. Splint- und Kernholz sind meist deutlich voneinander abgegrenzt, wobei das Kernholz härter und widerstandsfähiger ist. Es handelt sich um ein mittelschweres bis schweres Holz, das eine gute Elastizität und Zähigkeit aufweist. Die Bearbeitbarkeit ist insgesamt gut, sowohl von Hand als auch maschinell.
definition:
  literal form: Holz der Ulme. Ulmenholz zeichnet sich durch eine charakteristische Farbpalette aus, die von gelblich-braun bis dunkelbraun reicht, oft mit einem rötlichen Schimmer. Die Maserung ist häufig markant und wellenförmig, gelegentlich mit unregelmäßigen Streifen. Splint- und Kernholz sind meist deutlich voneinander abgegrenzt, wobei das Kernholz härter und widerstandsfähiger ist. Es handelt sich um ein mittelschweres bis schweres Holz, das eine gute Elastizität und Zähigkeit aufweist. Die Bearbeitbarkeit ist insgesamt gut, sowohl von Hand als auch maschinell.

Lärchenholz
type: Concept
notation: F5GA47
created: 2026-01-30
issued: 2026-01-30
modified: 2026-02-04
publisher: Leibniz-Zentrum für Archäologie (LEIZA)
alternative label: Larix decidua
broader: Nadelholz
broader transitive: Nadelholz
broader transitive: Holz
broader transitive: Material
broader transitive: [Untersuchungsergebnisse]
broader transitive: Zustandserfassung
broader transitive: Objektuntersuchung
broader transitive: organisches Material
broader transitive: [Holzart]
broader transitive: Materialien pflanzlichen Ursprungs
broader transitive: Materialbestimmung
definition: Holz von der Lärche, mit gelblichweißer bis rötlichweißer Färbung des Splintholzes und rötlichbraun bis dunkelrotbraun nachdunkelndem Kernholz. Die Textur des Holzes zeigt eine auffallende und sehr dekorative Maßerung sowie eine dichte und feste Struktur. Lärchenholz besitzt eine hohe Widerstandsfähigkeit gegenüber Witterungseinflüssen und eine gute manuelle und maschinelle Verarbeitbarkeit, was es besonders für die Verwendung im Außenbereich als Fensterrahmen, Türen aber auch für den Brückenbau oder für Schwellen, Fässer und Paneelen geeignet macht.
definition:
  literal form: Holz von der Lärche, mit gelblichweißer bis rötlichweißer Färbung des Splintholzes und rötlichbraun bis dunkelrotbraun nachdunkelndem Kernholz. Die Textur des Holzes zeigt eine auffallende und sehr dekorative Maßerung sowie eine dichte und feste Struktur. Lärchenholz besitzt eine hohe Widerstandsfähigkeit gegenüber Witterungseinflüssen und eine gute manuelle und maschinelle Verarbeitbarkeit, was es besonders für die Verwendung im Außenbereich als Fensterrahmen, Türen aber auch für den Brückenbau oder für Schwellen, Fässer und Paneelen geeignet macht.
in scheme: Konservierungs- und Restaurierungsfachthesaurus für archäologische Kulturgüter
alt label: Larix decidua
  type: Label
  rank: preferred
pref label: Lärchenholz
  type: Label
  rank: preferred

Tannenholz
type: Concept
notation: FCA7DA
created: 2026-01-30
issued: 2026-01-30
modified: 2026-02-04
publisher: Leibniz-Zentrum für Archäologie (LEIZA)
alternative label: Abies alba
broader: Nadelholz
broader transitive: Nadelholz
broader transitive: Holz
broader transitive: Material
broader transitive: [Untersuchungsergebnisse]
broader transitive: Zustandserfassung
broader transitive: Objektuntersuchung
broader transitive: organisches Material
broader transitive: [Holzart]
broader transitive: Materialien pflanzlichen Ursprungs
broader transitive: Materialbestimmung
definition: Holz aus der Tanne, mit heller, oft weißlich-gelber bis rötlichweißer Färbung und grauem Schimmer. Es besitzt eine relativ gleichmäßige Textug und zeigt eine dezente, weniger markante Maserung im Vergleich zu anderen Hölzern. Das Holz ist verhältnismäßig leicht, harzarm und zeichnet sich durch eine moderate Festigkeit sowie eine mäßige Widerstandsfähigkeit gegenüber Witterungseinflüssen aus. Es eignet sich gut für die Verarbeitung mit Hand- und Maschinenwerkzeugen. Aufgrund dieser Eigenschaften wird es hauptsächlich für den Innenbau, für Möbel, Holzverkleidungen oder Behältnisse verwendet.
definition:
  literal form: Holz aus der Tanne, mit heller, oft weißlich-gelber bis rötlichweißer Färbung und grauem Schimmer. Es besitzt eine relativ gleichmäßige Textug und zeigt eine dezente, weniger markante Maserung im Vergleich zu anderen Hölzern. Das Holz ist verhältnismäßig leicht, harzarm und zeichnet sich durch eine moderate Festigkeit sowie eine mäßige Widerstandsfähigkeit gegenüber Witterungseinflüssen aus. Es eignet sich gut für die Verarbeitung mit Hand- und Maschinenwerkzeugen. Aufgrund dieser Eigenschaften wird es hauptsächlich für den Innenbau, für Möbel, Holzverkleidungen oder Behältnisse verwendet.
in scheme: Konservierungs- und Restaurierungsfachthesaurus für archäologische Kulturgüter
alt label: Abies alba
  type: Label
  rank: preferred
pref label: Tannenholz
  type: Label
  rank: preferred

Fichtenholz
type: Concept
notation: G2944B
created: 2026-01-30
issued: 2026-01-30
modified: 2026-02-04
publisher: Leibniz-Zentrum für Archäologie (LEIZA)
alternative label: Picea abies
broader: Nadelholz
broader transitive: Nadelholz
broader transitive: Holz
broader transitive: Material
broader transitive: [Untersuchungsergebnisse]
broader transitive: Zustandserfassung
broader transitive: Objektuntersuchung
broader transitive: organisches Material
broader transitive: [Holzart]
broader transitive: Materialien pflanzlichen Ursprungs
broader transitive: Materialbestimmung
definition: Holz von der Fichte, einem der häufigsten Nadelbäume in Europa. Fichtenholz zeichnet sich durch sein helles, gelblich- bis rötlichweißes und relativ weiches Holz mit feiner Struktur aus. Es lässt sich mit verschiedenen Werkzeugen und Techniken gut bearbeiten, zeigt jedoch eine geringe Dauerhaftigkeit, da es pilz- und insektenanfällig und nicht witterungsfest ist.
definition:
  literal form: Holz von der Fichte, einem der häufigsten Nadelbäume in Europa. Fichtenholz zeichnet sich durch sein helles, gelblich- bis rötlichweißes und relativ weiches Holz mit feiner Struktur aus. Es lässt sich mit verschiedenen Werkzeugen und Techniken gut bearbeiten, zeigt jedoch eine geringe Dauerhaftigkeit, da es pilz- und insektenanfällig und nicht witterungsfest ist.
in scheme: Konservierungs- und Restaurierungsfachthesaurus für archäologische Kulturgüter
alt label: Picea abies
  type: Label
  rank: preferred
pref label: Fichtenholz
  type: Label
  rank: preferred

Eibenholz
type: Concept
notation: G356D5
preferred label: yew @en
created: 2026-01-30
issued: 2026-01-30
modified: 2026-02-04
publisher: Leibniz-Zentrum für Archäologie (LEIZA)
alternative label: Taxus baccata
broader: Nadelholz
broader transitive: Nadelholz
broader transitive: Holz
broader transitive: Material
broader transitive: [Untersuchungsergebnisse]
broader transitive: Zustandserfassung
broader transitive: Objektuntersuchung
broader transitive: organisches Material
broader transitive: [Holzart]
broader transitive: Materialien pflanzlichen Ursprungs
broader transitive: Materialbestimmung
definition: Holz der Eibe. Eibenholz zeigte eine gelb bis gold-braune Färbung, oft mit rötlich- violettem Schimmer und eine feine, gleichmäßige Maserung. Charakteristisch sind seine hohe Elastizität, Härte sowie Dichte, wobei es noch gut drechsel- und schnitzbare ist.
definition:
  literal form: Holz der Eibe. Eibenholz zeigte eine gelb bis gold-braune Färbung, oft mit rötlich- violettem Schimmer und eine feine, gleichmäßige Maserung. Charakteristisch sind seine hohe Elastizität, Härte sowie Dichte, wobei es noch gut drechsel- und schnitzbare ist.
in scheme: Konservierungs- und Restaurierungsfachthesaurus für archäologische Kulturgüter
alt label: Taxus baccata
  type: Label
  rank: preferred
pref label: Eibenholz
  type: Label
  rank: preferred
pref label: yew
  type: Label
  rank: normal

Obstholz
type: Concept
notation: ABBFB5
created: 2026-01-30
issued: 2026-01-30
modified: 2026-02-04
publisher: Leibniz-Zentrum für Archäologie (LEIZA)
broader: zerstreutporiges Laubholz
broader transitive: Material
broader transitive: [Untersuchungsergebnisse]
broader transitive: Zustandserfassung
broader transitive: Objektuntersuchung
broader transitive: organisches Material
broader transitive: Materialbestimmung
broader transitive: Holz
broader transitive: zerstreutporiges Laubholz
broader transitive: Laubholz
broader transitive: [Holzart]
broader transitive: Materialien pflanzlichen Ursprungs
in scheme: Konservierungs- und Restaurierungsfachthesaurus für archäologische Kulturgüter
pref label: Obstholz
  type: Label
  rank: preferred
alternative label: Prunus species
alt label: Prunus species
  type: Label
  rank: preferred

Lindenholz
type: Concept
notation: B44F39
created: 2026-01-30
issued: 2026-01-30
modified: 2026-02-04
publisher: Leibniz-Zentrum für Archäologie (LEIZA)
broader: zerstreutporiges Laubholz
broader transitive: Material
broader transitive: [Untersuchungsergebnisse]
broader transitive: Zustandserfassung
broader transitive: Objektuntersuchung
broader transitive: organisches Material
broader transitive: Materialbestimmung
broader transitive: Holz
broader transitive: zerstreutporiges Laubholz
broader transitive: Laubholz
broader transitive: [Holzart]
broader transitive: Materialien pflanzlichen Ursprungs
in scheme: Konservierungs- und Restaurierungsfachthesaurus für archäologische Kulturgüter
pref label: Lindenholz
  type: Label
  rank: preferred
alternative label: Tilia species
definition: Holz der Linde, mit einer hellen, weißlich, gelblichen bis rötlichen Färbung, mit unter auch leicht bräunlich oder grünlich gestreift oder gefleckt. Das weiche Holz lässt sich besonders gut schnitzen und drechseln und wird daher häufig für die Bildhauerei sowie für Schnitz- und Drechselarbeiten im Modellbau verwendet.
definition:
  literal form: Holz der Linde, mit einer hellen, weißlich, gelblichen bis rötlichen Färbung, mit unter auch leicht bräunlich oder grünlich gestreift oder gefleckt. Das weiche Holz lässt sich besonders gut schnitzen und drechseln und wird daher häufig für die Bildhauerei sowie für Schnitz- und Drechselarbeiten im Modellbau verwendet.
alt label: Tilia species
  type: Label
  rank: preferred

Pappelholz
type: Concept
notation: B5C86F
created: 2026-01-30
issued: 2026-01-30
modified: 2026-02-04
publisher: Leibniz-Zentrum für Archäologie (LEIZA)
broader: zerstreutporiges Laubholz
broader transitive: Material
broader transitive: [Untersuchungsergebnisse]
broader transitive: Zustandserfassung
broader transitive: Objektuntersuchung
broader transitive: organisches Material
broader transitive: Materialbestimmung
broader transitive: Holz
broader transitive: zerstreutporiges Laubholz
broader transitive: Laubholz
broader transitive: [Holzart]
broader transitive: Materialien pflanzlichen Ursprungs
in scheme: Konservierungs- und Restaurierungsfachthesaurus für archäologische Kulturgüter
pref label: Pappelholz
  type: Label
  rank: preferred
alternative label: Populus species
definition: Holz der Pappel, mit weißlich, gelblich bis hell-grün-bräunlicher Färbung, in Marknähe auch rötlich. Pappelholz ist ein sehr leichtes und weiches Holz, das sich gut mit verschiedenen Werkzeugen bearbeiten lässt. Bei Pappelholz ist es dabei besonders wichtig scharf geschliffene Werkzeuge zu verwenden, da die Oberfläche durch Reaktionsholzbildung oft filzig und rauh erscheinen kann. Aufgrund seiner geringen Festigkeit und der mittelmäßigen Dauerhaftigkeit/Witterungsbeständigkeit wird Pappelholz vor allem als Funierholz für Sperrholzprodukte oder als Konstruktionsholz geringer bis mittlerer Belastung im Innenbereich verwendet.
definition:
  literal form: Holz der Pappel, mit weißlich, gelblich bis hell-grün-bräunlicher Färbung, in Marknähe auch rötlich. Pappelholz ist ein sehr leichtes und weiches Holz, das sich gut mit verschiedenen Werkzeugen bearbeiten lässt. Bei Pappelholz ist es dabei besonders wichtig scharf geschliffene Werkzeuge zu verwenden, da die Oberfläche durch Reaktionsholzbildung oft filzig und rauh erscheinen kann. Aufgrund seiner geringen Festigkeit und der mittelmäßigen Dauerhaftigkeit/Witterungsbeständigkeit wird Pappelholz vor allem als Funierholz für Sperrholzprodukte oder als Konstruktionsholz geringer bis mittlerer Belastung im Innenbereich verwendet.
alt label: Populus species
  type: Label
  rank: preferred

Buchenholz
type: Concept
notation: B93452
created: 2026-01-30
issued: 2026-01-30
modified: 2026-02-04
publisher: Leibniz-Zentrum für Archäologie (LEIZA)
alternative label: Fagus sylvatica
broader: zerstreutporiges Laubholz
broader transitive: Holz
broader transitive: Material
broader transitive: Laubholz
broader transitive: zerstreutporiges Laubholz
broader transitive: [Untersuchungsergebnisse]
broader transitive: Zustandserfassung
broader transitive: Objektuntersuchung
broader transitive: organisches Material
broader transitive: [Holzart]
broader transitive: Materialien pflanzlichen Ursprungs
broader transitive: Materialbestimmung
in scheme: Konservierungs- und Restaurierungsfachthesaurus für archäologische Kulturgüter
alt label: Fagus sylvatica
  type: Label
  rank: preferred
pref label: Buchenholz
  type: Label
  rank: preferred

Birkenholz
type: Concept
notation: BGG879
preferred label: birch @en
created: 2026-01-30
issued: 2026-01-30
modified: 2026-02-04
publisher: Leibniz-Zentrum für Archäologie (LEIZA)
alternative label: Betula species
broader: zerstreutporiges Laubholz
broader transitive: Holz
broader transitive: Material
broader transitive: Laubholz
broader transitive: zerstreutporiges Laubholz
broader transitive: [Untersuchungsergebnisse]
broader transitive: Zustandserfassung
broader transitive: Objektuntersuchung
broader transitive: organisches Material
broader transitive: [Holzart]
broader transitive: Materialien pflanzlichen Ursprungs
broader transitive: Materialbestimmung
in scheme: Konservierungs- und Restaurierungsfachthesaurus für archäologische Kulturgüter
alt label: Betula species
  type: Label
  rank: preferred
pref label: Birkenholz
  type: Label
  rank: preferred
pref label: birch
  type: Label
  rank: normal
definition: Holz aus der Birke. Birkenholz ist ein gelblichweißes, rötlichweißes bis hellbräunliches, mittelschweres Holz mit einer feinen Maserung. Es zeigt eine gute Elatizität und Zähigkeit und lässt sich gut manuell und maschinell mit verschiedenen Werkzeugen bearbeiten.
definition:
  literal form: Holz aus der Birke. Birkenholz ist ein gelblichweißes, rötlichweißes bis hellbräunliches, mittelschweres Holz mit einer feinen Maserung. Es zeigt eine gute Elatizität und Zähigkeit und lässt sich gut manuell und maschinell mit verschiedenen Werkzeugen bearbeiten.

Ahornholz
type: Concept
notation: CAD229
preferred label: maple @en
created: 2026-01-30
issued: 2026-01-30
modified: 2026-02-04
publisher: Leibniz-Zentrum für Archäologie (LEIZA)
alternative label: Acer campestre
broader: zerstreutporiges Laubholz
broader transitive: Holz
broader transitive: Material
broader transitive: Laubholz
broader transitive: zerstreutporiges Laubholz
broader transitive: [Untersuchungsergebnisse]
broader transitive: Zustandserfassung
broader transitive: Objektuntersuchung
broader transitive: organisches Material
broader transitive: [Holzart]
broader transitive: Materialien pflanzlichen Ursprungs
broader transitive: Materialbestimmung
in scheme: Konservierungs- und Restaurierungsfachthesaurus für archäologische Kulturgüter
alt label: Acer campestre
  type: Label
  rank: preferred
pref label: Ahornholz
  type: Label
  rank: preferred
pref label: maple
  type: Label
  rank: normal
definition: Holz des Ahornbaumes. Ahornholz ist ein schweres, hartes Holz, das eine helle, weiß bis gelbliche, im frisch geschlagenen Zustand auch rötliche Färbung sowie eine feine, gleichmäßige Maserung aufweist. Es zeigt eine glatte und feinporige Textur, hohe Elastizität und Biegefestigkeit sowie gute Bearbeitbarkeit mit verschiedenen Werkzeugen.
definition:
  literal form: Holz des Ahornbaumes. Ahornholz ist ein schweres, hartes Holz, das eine helle, weiß bis gelbliche, im frisch geschlagenen Zustand auch rötliche Färbung sowie eine feine, gleichmäßige Maserung aufweist. Es zeigt eine glatte und feinporige Textur, hohe Elastizität und Biegefestigkeit sowie gute Bearbeitbarkeit mit verschiedenen Werkzeugen.

Erlenholz
type: Concept
notation: F1BD88
preferred label: alder @en
created: 2026-01-30
issued: 2026-01-30
modified: 2026-02-04
publisher: Leibniz-Zentrum für Archäologie (LEIZA)
alternative label: Alnus glutinosa
broader: zerstreutporiges Laubholz
broader transitive: Holz
broader transitive: Material
broader transitive: Laubholz
broader transitive: zerstreutporiges Laubholz
broader transitive: [Untersuchungsergebnisse]
broader transitive: Zustandserfassung
broader transitive: Objektuntersuchung
broader transitive: organisches Material
broader transitive: [Holzart]
broader transitive: Materialien pflanzlichen Ursprungs
broader transitive: Materialbestimmung
in scheme: Konservierungs- und Restaurierungsfachthesaurus für archäologische Kulturgüter
alt label: Alnus glutinosa
  type: Label
  rank: preferred
pref label: Erlenholz
  type: Label
  rank: preferred
pref label: alder
  type: Label
  rank: normal
definition: Holz der Erlen. Das leichte bis mittelschwere Holz zeigt direkt nach dem Fällen eine rötlich- orange Färbung, die durch die Oxidation mit Luftsauerstoff allmählich rötlichweiß bis rötlichbraun nachdunkelt. Die Maserung ist fein und schlicht und das Holz von geringer Härte, wodurch es mit allen Werkzeugen gut bearbeitbar ist.
definition:
  literal form: Holz der Erlen. Das leichte bis mittelschwere Holz zeigt direkt nach dem Fällen eine rötlich- orange Färbung, die durch die Oxidation mit Luftsauerstoff allmählich rötlichweiß bis rötlichbraun nachdunkelt. Die Maserung ist fein und schlicht und das Holz von geringer Härte, wodurch es mit allen Werkzeugen gut bearbeitbar ist.

Buchsbaumholz
type: Concept
notation: FA1B26
created: 2026-01-30
issued: 2026-01-30
modified: 2026-02-04
publisher: Leibniz-Zentrum für Archäologie (LEIZA)
alternative label: Buxus sempervirens
broader: zerstreutporiges Laubholz
broader transitive: Holz
broader transitive: Material
broader transitive: Laubholz
broader transitive: zerstreutporiges Laubholz
broader transitive: [Untersuchungsergebnisse]
broader transitive: Zustandserfassung
broader transitive: Objektuntersuchung
broader transitive: organisches Material
broader transitive: [Holzart]
broader transitive: Materialien pflanzlichen Ursprungs
broader transitive: Materialbestimmung
in scheme: Konservierungs- und Restaurierungsfachthesaurus für archäologische Kulturgüter
alt label: Buxus sempervirens
  type: Label
  rank: preferred
pref label: Buchsbaumholz
  type: Label
  rank: preferred
definition: Holz des immergrünen Buxbaumes mit charakteristisch gelblich- weißer bis hellbrauner Färbung. Aufgrund der außergewöhnlichen Härte, hohen Dichte sowie feinen, homogenen Textur mit glatter Oberfläche traditionell unter anderem verwendet für technische und wissenschaftliche Geräte, Maschinen- und Musikinstrumente sowie Drechslerarbeiten.
definition:
  literal form: Holz des immergrünen Buxbaumes mit charakteristisch gelblich- weißer bis hellbrauner Färbung. Aufgrund der außergewöhnlichen Härte, hohen Dichte sowie feinen, homogenen Textur mit glatter Oberfläche traditionell unter anderem verwendet für technische und wissenschaftliche Geräte, Maschinen- und Musikinstrumente sowie Drechslerarbeiten.

Haselholz
type: Concept
notation: GAG81G
created: 2026-01-30
issued: 2026-01-30
modified: 2026-02-04
publisher: Leibniz-Zentrum für Archäologie (LEIZA)
alternative label: Corylus avellana
broader: zerstreutporiges Laubholz
broader transitive: Holz
broader transitive: Material
broader transitive: Laubholz
broader transitive: zerstreutporiges Laubholz
broader transitive: [Untersuchungsergebnisse]
broader transitive: Zustandserfassung
broader transitive: Objektuntersuchung
broader transitive: organisches Material
broader transitive: [Holzart]
broader transitive: Materialien pflanzlichen Ursprungs
broader transitive: Materialbestimmung
in scheme: Konservierungs- und Restaurierungsfachthesaurus für archäologische Kulturgüter
alt label: Corylus avellana
  type: Label
  rank: preferred
pref label: Haselholz
  type: Label
  rank: preferred

Weidenholz
type: Concept
notation: GG1CG9
created: 2026-01-30
issued: 2026-01-30
modified: 2026-02-04
publisher: Leibniz-Zentrum für Archäologie (LEIZA)
broader: zerstreutporiges Laubholz
broader transitive: Material
broader transitive: [Untersuchungsergebnisse]
broader transitive: Zustandserfassung
broader transitive: Objektuntersuchung
broader transitive: organisches Material
broader transitive: Materialbestimmung
broader transitive: Holz
broader transitive: zerstreutporiges Laubholz
broader transitive: Laubholz
broader transitive: [Holzart]
broader transitive: Materialien pflanzlichen Ursprungs
in scheme: Konservierungs- und Restaurierungsfachthesaurus für archäologische Kulturgüter
pref label: Weidenholz
  type: Label
  rank: preferred
alternative label: Salix species
alt label: Salix species
  type: Label
  rank: preferred

Keramik
type: Concept
notation: A11ACA
preferred label: ceramic @en
created: 2026-01-30
issued: 2026-01-30
modified: 2026-02-04
publisher: Leibniz-Zentrum für Archäologie (LEIZA)
broader: silikatisches Material
broader transitive: silikatisches Material
broader transitive: Material
broader transitive: [Untersuchungsergebnisse]
broader transitive: Zustandserfassung
broader transitive: Objektuntersuchung
broader transitive: Materialbestimmung
definition: anorganischer, nicht-metallischer, durch das Brennen von Ton hergestelltes Material. Ton stellt einen weit verbreiteten Werkstoff da, der im feuchten Zustand gut plastisch formbar ist und sich beim Brennen zur mehr oder weniger festen Keramik umwandelt. Ton besteht aus verschiedenen Tonmineralen (z.B. Kaolinit, Montmorillonit und Illit), Zuschlagstoffen - sog. Magerungsmitteln - wie Sand, Kalk, Ziegelmehl, Stroh, Häcksel, Tierhaare, Knochenasche oder Muscheln und Wasser. Objekte aus Keramik wurden bereits vor tausenden von Jahren von vielen Kulturen für verschiedenste Verwendungszwecke angefertigt.
definition:
  literal form: anorganischer, nicht-metallischer, durch das Brennen von Ton hergestelltes Material. Ton stellt einen weit verbreiteten Werkstoff da, der im feuchten Zustand gut plastisch formbar ist und sich beim Brennen zur mehr oder weniger festen Keramik umwandelt. Ton besteht aus verschiedenen Tonmineralen (z.B. Kaolinit, Montmorillonit und Illit), Zuschlagstoffen - sog. Magerungsmitteln - wie Sand, Kalk, Ziegelmehl, Stroh, Häcksel, Tierhaare, Knochenasche oder Muscheln und Wasser. Objekte aus Keramik wurden bereits vor tausenden von Jahren von vielen Kulturen für verschiedenste Verwendungszwecke angefertigt.
in scheme: Konservierungs- und Restaurierungsfachthesaurus für archäologische Kulturgüter
narrower: Feinkeramik
narrower: Grobkeramik
pref label: Keramik
  type: Label
  rank: preferred
pref label: ceramic
  type: Label
  rank: normal

Kohle
type: Concept
notation: A4A374
created: 2026-01-30
issued: 2026-01-30
modified: 2026-02-04
publisher: Leibniz-Zentrum für Archäologie (LEIZA)
broader: Kaustobiolith
broader transitive: Kaustobiolith
broader transitive: Material
broader transitive: [Untersuchungsergebnisse]
broader transitive: Zustandserfassung
broader transitive: Objektuntersuchung
broader transitive: organisches Material
broader transitive: Materialbestimmung
in scheme: Konservierungs- und Restaurierungsfachthesaurus für archäologische Kulturgüter
pref label: Kohle
  type: Label
  rank: preferred

Kaustobiolith
type: Concept
notation: G76A78
created: 2026-01-30
issued: 2026-01-30
modified: 2026-02-04
publisher: Leibniz-Zentrum für Archäologie (LEIZA)
broader: organisches Material
broader transitive: Material
broader transitive: [Untersuchungsergebnisse]
broader transitive: Zustandserfassung
broader transitive: Objektuntersuchung
broader transitive: organisches Material
broader transitive: Materialbestimmung
in scheme: Konservierungs- und Restaurierungsfachthesaurus für archäologische Kulturgüter
pref label: Kaustobiolith
  type: Label
  rank: preferred
definition: Überbegriff für verfestigten Anreicherungen von organischen Kohlenstoffverbindungen (oder reinem Kohlenstoff) aus Überresten von Pflanzen und Tieren. Sie entstehen durch Umwandlung der organischen Materialien unter hohem Druck und Temperatur über geologische Zeiträume hinweg. Teilweise werden die Kaustobiolithe aufgrund ihrer Entstehungsart auch den sedimentären Gesteinen zugeordnet. Eine besondere Eigenschaft der Kaustobiolithe, die sie von den meisten "klassischen" Gesteinen unterscheidet, ist ihre Brennbarkeit.
definition:
  literal form: Überbegriff für verfestigten Anreicherungen von organischen Kohlenstoffverbindungen (oder reinem Kohlenstoff) aus Überresten von Pflanzen und Tieren. Sie entstehen durch Umwandlung der organischen Materialien unter hohem Druck und Temperatur über geologische Zeiträume hinweg. Teilweise werden die Kaustobiolithe aufgrund ihrer Entstehungsart auch den sedimentären Gesteinen zugeordnet. Eine besondere Eigenschaft der Kaustobiolithe, die sie von den meisten "klassischen" Gesteinen unterscheidet, ist ihre Brennbarkeit.
narrower: Kohle
narrower: Gagat
narrower: Sapropelit
narrower: Pech

Gagat
type: Concept
notation: A5B5B2
created: 2026-01-30
issued: 2026-01-30
modified: 2026-02-04
publisher: Leibniz-Zentrum für Archäologie (LEIZA)
broader: Kaustobiolith
broader transitive: Kaustobiolith
broader transitive: Material
broader transitive: [Untersuchungsergebnisse]
broader transitive: Zustandserfassung
broader transitive: Objektuntersuchung
broader transitive: organisches Material
broader transitive: Materialbestimmung
in scheme: Konservierungs- und Restaurierungsfachthesaurus für archäologische Kulturgüter
pref label: Gagat
  type: Label
  rank: preferred
alternative label: Jet
definition: aus in Faulschlamm eingebetteten Hölzern entstandene besonders dichte und homogene Kohleart. Die Farbigkeit ist in der Regel von einem tiefen, samtigen schwarz, die Oberfläche glänzend und gut polierbar.
definition:
  literal form: aus in Faulschlamm eingebetteten Hölzern entstandene besonders dichte und homogene Kohleart. Die Farbigkeit ist in der Regel von einem tiefen, samtigen schwarz, die Oberfläche glänzend und gut polierbar.
alt label: Jet
  type: Label
  rank: preferred

Sapropelit
type: Concept
notation: AAG733
created: 2026-01-30
issued: 2026-01-30
modified: 2026-02-04
publisher: Leibniz-Zentrum für Archäologie (LEIZA)
broader: Kaustobiolith
broader transitive: Kaustobiolith
broader transitive: Material
broader transitive: [Untersuchungsergebnisse]
broader transitive: Zustandserfassung
broader transitive: Objektuntersuchung
broader transitive: organisches Material
broader transitive: Materialbestimmung
in scheme: Konservierungs- und Restaurierungsfachthesaurus für archäologische Kulturgüter
pref label: Sapropelit
  type: Label
  rank: preferred
definition: aus verfestigten Faulschlämmen bestehende Biomineralien. Ihre Entstehung erfolgt unter natürlichen Bedingungen in ehemals nährstoffreichen Gewässern und Sümpfen, wobei organisches Material bei Abwesenheit von Sauerstoff biochemisch umgewandelt wird.
definition:
  literal form: aus verfestigten Faulschlämmen bestehende Biomineralien. Ihre Entstehung erfolgt unter natürlichen Bedingungen in ehemals nährstoffreichen Gewässern und Sümpfen, wobei organisches Material bei Abwesenheit von Sauerstoff biochemisch umgewandelt wird.

Mineral
type: Concept
notation: BGC9F3
preferred label: mineral @en
created: 2026-01-30
issued: 2026-01-30
modified: 2026-02-04
publisher: Leibniz-Zentrum für Archäologie (LEIZA)
broader: silikatisches Material
broader transitive: Material
broader transitive: [Untersuchungsergebnisse]
broader transitive: Zustandserfassung
broader transitive: Objektuntersuchung
broader transitive: silikatisches Material
broader transitive: Materialbestimmung
definition: anorganischer, chemisch und physikalisch homogener Festkörper, mit meist kristalliner Struktur. Minerale entstehend durch natürliche, geologische Prozesse und zeichnen sich durch unterschiedliche charakterisierende Eigenschaften aus.
definition:
  literal form: anorganischer, chemisch und physikalisch homogener Festkörper, mit meist kristalliner Struktur. Minerale entstehend durch natürliche, geologische Prozesse und zeichnen sich durch unterschiedliche charakterisierende Eigenschaften aus.
in scheme: Konservierungs- und Restaurierungsfachthesaurus für archäologische Kulturgüter
pref label: Mineral
  type: Label
  rank: preferred
pref label: mineral
  type: Label
  rank: normal
narrower: Quarz
narrower: Lapislazuli
narrower: Korund
narrower: Malachit
narrower: Feldspat
narrower: Dolomit (Mineral)
narrower: Granat
narrower: Gips (Mineral)
narrower: Jadeit
narrower: Beryll
narrower: Tonminerale
narrower: Amphibol
narrower: Fluorit

Pech
type: Concept
notation: D467F2
created: 2026-01-30
issued: 2026-01-30
modified: 2026-02-04
publisher: Leibniz-Zentrum für Archäologie (LEIZA)
broader: Kaustobiolith
broader transitive: Kaustobiolith
broader transitive: Material
broader transitive: [Untersuchungsergebnisse]
broader transitive: Zustandserfassung
broader transitive: Objektuntersuchung
broader transitive: organisches Material
broader transitive: Materialbestimmung
in scheme: Konservierungs- und Restaurierungsfachthesaurus für archäologische Kulturgüter
pref label: Pech
  type: Label
  rank: preferred
definition: zähflüssiges bis festes, harzbasiertes Material von braun bis schwarzer Färbung, das durch Destillation von Holz oder fossilen Harzen gewonnen wird. Es wurde in der Antike häufig als Dichtmittel, Klebstoff oder Beschichtungsmaterial verwendet, beispielsweise für Gefäße, Werkzeuge oder Schiffsplanken. Aufgrund seiner organischen Zusammensetzung liefert Pech wichtige Informationen über die damaligen Rohstoffquellen und Techniken, wobei seine Erhaltung und Analyse besondere konservatorische Maßnahmen erfordert.
definition:
  literal form: zähflüssiges bis festes, harzbasiertes Material von braun bis schwarzer Färbung, das durch Destillation von Holz oder fossilen Harzen gewonnen wird. Es wurde in der Antike häufig als Dichtmittel, Klebstoff oder Beschichtungsmaterial verwendet, beispielsweise für Gefäße, Werkzeuge oder Schiffsplanken. Aufgrund seiner organischen Zusammensetzung liefert Pech wichtige Informationen über die damaligen Rohstoffquellen und Techniken, wobei seine Erhaltung und Analyse besondere konservatorische Maßnahmen erfordert.

Gestein
type: Concept
notation: D866AD
preferred label: stone @en
created: 2026-01-30
issued: 2026-01-30
modified: 2026-02-04
publisher: Leibniz-Zentrum für Archäologie (LEIZA)
broader: silikatisches Material
broader transitive: Material
broader transitive: [Untersuchungsergebnisse]
broader transitive: Zustandserfassung
broader transitive: Objektuntersuchung
broader transitive: silikatisches Material
broader transitive: Materialbestimmung
definition: mehr oder weniger verfestigter Werkstoff aus mikroskopisch heterogenen Gemengen von Mineralen, Gesteinsbruchstücken, organischen und/oder anorganischen Ausscheidungen und Wasser (Kristallwasser). Hauptgemengeteile bilden Minerale wie Silikate (Feldspat, Quarz, Glimmer, etc.) und Karbonate (Calcit, Dolomit, etc.). Stein findet im Bereich historischer Kulturgüter in der Verwendung als Statuen, Schmuck, Gefäßen, und Bauteilen. Je nach Zusammensetzung sind Gesteine mehr oder weniger anfällig für umgebungsbedingten Zerfall, so können z.B. Schadstoffe aus der Luft ebenso wie Salze und andere Bodenbestandteile Zerfallsprozesse an der Oberfläche von Steinobjekten hervorrufen.
definition:
  literal form: mehr oder weniger verfestigter Werkstoff aus mikroskopisch heterogenen Gemengen von Mineralen, Gesteinsbruchstücken, organischen und/oder anorganischen Ausscheidungen und Wasser (Kristallwasser). Hauptgemengeteile bilden Minerale wie Silikate (Feldspat, Quarz, Glimmer, etc.) und Karbonate (Calcit, Dolomit, etc.). Stein findet im Bereich historischer Kulturgüter in der Verwendung als Statuen, Schmuck, Gefäßen, und Bauteilen. Je nach Zusammensetzung sind Gesteine mehr oder weniger anfällig für umgebungsbedingten Zerfall, so können z.B. Schadstoffe aus der Luft ebenso wie Salze und andere Bodenbestandteile Zerfallsprozesse an der Oberfläche von Steinobjekten hervorrufen.
in scheme: Konservierungs- und Restaurierungsfachthesaurus für archäologische Kulturgüter
pref label: Gestein
  type: Label
  rank: preferred
pref label: stone
  type: Label
  rank: normal
narrower: Metamorphit
narrower: Sedimentgestein
narrower: Magmatit
alternative label: Stein
alt label: Stein
  type: Label
  rank: preferred

Glas
type: Concept
notation: DA2D73
preferred label: glas @en
created: 2026-01-30
issued: 2026-01-30
modified: 2026-02-04
publisher: Leibniz-Zentrum für Archäologie (LEIZA)
broader: silikatisches Material
broader transitive: silikatisches Material
broader transitive: Material
broader transitive: [Untersuchungsergebnisse]
broader transitive: Zustandserfassung
broader transitive: Objektuntersuchung
broader transitive: Materialbestimmung
definition: anorganischer, amorpher Feststoff, der durch schnelles Abkühlen einer Schmelze ohne Kristallisation erzeugt wird. Gläser bestehen in der Regel aus Glasbildner (Quarzsand (SIO2)), Flussmittel (z.B. Soda (NA2O) oder Pottasche (K2O)) und Stabilisatoren (z.B. Calciumoxid (CaO) oder Calciumcarbonat (CaCO3)).
definition:
  literal form: anorganischer, amorpher Feststoff, der durch schnelles Abkühlen einer Schmelze ohne Kristallisation erzeugt wird. Gläser bestehen in der Regel aus Glasbildner (Quarzsand (SIO2)), Flussmittel (z.B. Soda (NA2O) oder Pottasche (K2O)) und Stabilisatoren (z.B. Calciumoxid (CaO) oder Calciumcarbonat (CaCO3)).
in scheme: Konservierungs- und Restaurierungsfachthesaurus für archäologische Kulturgüter
pref label: Glas
  type: Label
  rank: preferred
pref label: glas
  type: Label
  rank: normal

Biomineral
type: Concept
notation: F1BA31
created: 2026-01-30
issued: 2026-01-30
modified: 2026-02-04
publisher: Leibniz-Zentrum für Archäologie (LEIZA)
broader: silikatisches Material
broader transitive: silikatisches Material
broader transitive: Material
broader transitive: [Untersuchungsergebnisse]
broader transitive: Zustandserfassung
broader transitive: Objektuntersuchung
broader transitive: Materialbestimmung
definition: Überbegriff für mineralisches Material, das von lebenden Organismen gebildet wird. Aus chemischer Sicht handelt es sich dabei um anorganische Substanzen und Kristallstrukturen wir Kalziumkarbonat, Kalziumphosphat oder Siliziumdioxid. Diese werden von lebenden Organismen in biologischen Prozessen synthetisiert und in ihr Gewebe eingebaut. Dabei erfüllen die Biominerale spezifische Funktionen, wie den Schutz oder die Stabilität der Gewebestrukturen. Obwohl sie biologischen Ursprungs sind, werden Biominerale aufgrund ihrer chemischen Zusammensetzung und ihrer Eigenschaften den silikatischen bzw. mineralischen Materialien zugeorndet.
definition:
  literal form: Überbegriff für mineralisches Material, das von lebenden Organismen gebildet wird. Aus chemischer Sicht handelt es sich dabei um anorganische Substanzen und Kristallstrukturen wir Kalziumkarbonat, Kalziumphosphat oder Siliziumdioxid. Diese werden von lebenden Organismen in biologischen Prozessen synthetisiert und in ihr Gewebe eingebaut. Dabei erfüllen die Biominerale spezifische Funktionen, wie den Schutz oder die Stabilität der Gewebestrukturen. Obwohl sie biologischen Ursprungs sind, werden Biominerale aufgrund ihrer chemischen Zusammensetzung und ihrer Eigenschaften den silikatischen bzw. mineralischen Materialien zugeorndet.
in scheme: Konservierungs- und Restaurierungsfachthesaurus für archäologische Kulturgüter
narrower: Muschel
narrower: Perlmutt
narrower: Geweih
narrower: Zahn
narrower: Bein
narrower: Schnecke
narrower: Schildpatt
narrower: Koralle
narrower: Bernstein
narrower: Horn
narrower: Perle
pref label: Biomineral
  type: Label
  rank: preferred

silikatisches Material
type: Concept
notation: GB6DF3
created: 2026-01-30
issued: 2026-01-30
modified: 2026-02-04
publisher: Leibniz-Zentrum für Archäologie (LEIZA)
broader: Material
broader transitive: Material
broader transitive: [Untersuchungsergebnisse]
broader transitive: Zustandserfassung
broader transitive: Objektuntersuchung
broader transitive: Materialbestimmung
in scheme: Konservierungs- und Restaurierungsfachthesaurus für archäologische Kulturgüter
pref label: silikatisches Material
  type: Label
  rank: preferred
alternative label: Silikat
alternative label: mineralisches Materialien
definition: Oberbegriff für eine Vielzahl von nichtmetallischen, anorganischen Werkstoffen, die aus Silikaten bestehen oder aus diesen gewonnen werden.
definition: Oberbegriff für eine Vielzahl von nichtmetallischen, anorganischen Werkstoffen, die aus Silikaten bestehen oder aus diesen gewonnen werden.
  source: Jochem Wolters, Der Gold- und Silberschmied. Band 1 - Werkstoffe und Materialien (Stuttgart 1989)
    pagination: S. 136, 218 - 222
alt label: mineralisches Materialien
  type: Label
  rank: preferred
alt label: Silikat
  type: Label
  rank: normal
narrower: Keramik
narrower: Mineral
narrower: Gestein
narrower: Glas
narrower: Biomineral

Feinkeramik
type: Concept
notation: DG279C
created: 2026-01-30
issued: 2026-01-30
modified: 2026-02-04
publisher: Leibniz-Zentrum für Archäologie (LEIZA)
broader: Keramik
broader transitive: Keramik
broader transitive: silikatisches Material
broader transitive: Material
broader transitive: [Untersuchungsergebnisse]
broader transitive: Zustandserfassung
broader transitive: Objektuntersuchung
broader transitive: Materialbestimmung
definition: keramische Erzeugnisse mit einer dichten und feinen Scherbenstruktur, die in der Regel durch die Verwendung fein aufbereiteter und gemahlener Tone erzielt wird.
in scheme: Konservierungs- und Restaurierungsfachthesaurus für archäologische Kulturgüter
narrower: Steinzeug
narrower: Irdenware
narrower: Porzellan
narrower: Steingut
pref label: Feinkeramik
  type: Label
  rank: preferred

Grobkeramik
type: Concept
notation: FC776B
created: 2026-01-30
issued: 2026-01-30
modified: 2026-02-04
publisher: Leibniz-Zentrum für Archäologie (LEIZA)
broader: Keramik
broader transitive: Keramik
broader transitive: silikatisches Material
broader transitive: Material
broader transitive: [Untersuchungsergebnisse]
broader transitive: Zustandserfassung
broader transitive: Objektuntersuchung
broader transitive: Materialbestimmung
definition: keramische Erzeugnisse mit einer grobkörnigen, oft porösen Scherbenstruktur, die durch die Verwendung von Ton mit sichtbaren Mineral- oder Magerungsbestandteilen entsteht.
in scheme: Konservierungs- und Restaurierungsfachthesaurus für archäologische Kulturgüter
pref label: Grobkeramik
  type: Label
  rank: preferred

Steinzeug
type: Concept
notation: A38966
created: 2026-01-30
issued: 2026-01-30
modified: 2026-02-04
publisher: Leibniz-Zentrum für Archäologie (LEIZA)
broader: Feinkeramik
broader transitive: Keramik
broader transitive: silikatisches Material
broader transitive: Material
broader transitive: [Untersuchungsergebnisse]
broader transitive: Zustandserfassung
broader transitive: Objektuntersuchung
broader transitive: Materialbestimmung
broader transitive: Feinkeramik
in scheme: Konservierungs- und Restaurierungsfachthesaurus für archäologische Kulturgüter
pref label: Steinzeug
  type: Label
  rank: preferred

Muschel
type: Concept
notation: A3D91B
preferred label: shell @en
created: 2026-01-30
issued: 2026-01-30
modified: 2026-02-04
publisher: Leibniz-Zentrum für Archäologie (LEIZA)
alternative label: Muschelschale
broader: Biomineral
broader transitive: Biomineral
broader transitive: Material
broader transitive: [Untersuchungsergebnisse]
broader transitive: Zustandserfassung
broader transitive: Objektuntersuchung
broader transitive: silikatisches Material
broader transitive: Materialbestimmung
in scheme: Konservierungs- und Restaurierungsfachthesaurus für archäologische Kulturgüter
alt label: Muschelschale
  type: Label
  rank: preferred
pref label: Muschel
  type: Label
  rank: preferred
pref label: shell
  type: Label
  rank: normal

Elfenbein
type: Concept
notation: AG55BC
preferred label: ivory @en
created: 2026-01-30
issued: 2026-01-30
modified: 2026-02-04
publisher: Leibniz-Zentrum für Archäologie (LEIZA)
broader: Bein
broader transitive: Material
broader transitive: [Untersuchungsergebnisse]
broader transitive: Zustandserfassung
broader transitive: Objektuntersuchung
broader transitive: silikatisches Material
broader transitive: Materialbestimmung
broader transitive: Bein
broader transitive: Biomineral
definition: Zahnsubstanz, das als Werkstoff aus den Stoßzähnen des Elefanten und seiner Vorfahren (Mastodon, Mammut) gewonnen wird. Im allgemeinen Sprachgebrauch wird auch eine Reihe weitere, in Aussehen und Struktur ähnlicher Materialien (Walrosszahn, Nilpferdzahn, Narwahlzahn, etc.) als Elfenbein bezeichnet. Elfenbein ist in der Regel von cremeweißer Farbe, mit Schwankungen ins gelblich, grünlich, rötlich oder bräunliche, und weist eine charakteristische Maserung auf. Im Gegensatz zu Knochen weist Elfenbein einen niedrigeren Mineralgehalt auf, was sich in einer höheren Elastizität, Bruchfestigkeit, Polierfähigkeit und geringerer Sprödigkeit im Vergleich zu Knochenmaterial zeigt.
definition:
  literal form: Zahnsubstanz, das als Werkstoff aus den Stoßzähnen des Elefanten und seiner Vorfahren (Mastodon, Mammut) gewonnen wird. Im allgemeinen Sprachgebrauch wird auch eine Reihe weitere, in Aussehen und Struktur ähnlicher Materialien (Walrosszahn, Nilpferdzahn, Narwahlzahn, etc.) als Elfenbein bezeichnet. Elfenbein ist in der Regel von cremeweißer Farbe, mit Schwankungen ins gelblich, grünlich, rötlich oder bräunliche, und weist eine charakteristische Maserung auf. Im Gegensatz zu Knochen weist Elfenbein einen niedrigeren Mineralgehalt auf, was sich in einer höheren Elastizität, Bruchfestigkeit, Polierfähigkeit und geringerer Sprödigkeit im Vergleich zu Knochenmaterial zeigt.
in scheme: Konservierungs- und Restaurierungsfachthesaurus für archäologische Kulturgüter
pref label: Elfenbein
  type: Label
  rank: preferred
pref label: ivory
  type: Label
  rank: normal
narrower: modernes Elfenbein
narrower: fossiles Elfenbein

Perlmutt
type: Concept
notation: AG8F3A
created: 2026-01-30
issued: 2026-01-30
modified: 2026-02-04
publisher: Leibniz-Zentrum für Archäologie (LEIZA)
broader: Biomineral
broader transitive: Biomineral
broader transitive: Material
broader transitive: [Untersuchungsergebnisse]
broader transitive: Zustandserfassung
broader transitive: Objektuntersuchung
broader transitive: silikatisches Material
broader transitive: Materialbestimmung
in scheme: Konservierungs- und Restaurierungsfachthesaurus für archäologische Kulturgüter
pref label: Perlmutt
  type: Label
  rank: preferred
definition: Material, welches an der Schaleninnenseite von Perlmuscheln, manchen Schneckenarten und weiteren Kopffüßlern gebildet wird. Die Farbigkeit des Perlmutts variiert stark je nach Herkunft. Perlmutt wurde in der Antike hauptsächlich in Form von Mosaik- und Einlegearbeiten verwendet, aber auch für Knöpfe und Kleinplastiken.
definition:
  literal form: Material, welches an der Schaleninnenseite von Perlmuscheln, manchen Schneckenarten und weiteren Kopffüßlern gebildet wird. Die Farbigkeit des Perlmutts variiert stark je nach Herkunft. Perlmutt wurde in der Antike hauptsächlich in Form von Mosaik- und Einlegearbeiten verwendet, aber auch für Knöpfe und Kleinplastiken.

Geweih
type: Concept
notation: B2F655
preferred label: antlers @en
created: 2026-01-30
issued: 2026-01-30
modified: 2026-02-04
publisher: Leibniz-Zentrum für Archäologie (LEIZA)
broader: Biomineral
broader transitive: Material
broader transitive: [Untersuchungsergebnisse]
broader transitive: Zustandserfassung
broader transitive: Objektuntersuchung
broader transitive: Materialbestimmung
broader transitive: Biomineral
broader transitive: silikatisches Material
in scheme: Konservierungs- und Restaurierungsfachthesaurus für archäologische Kulturgüter
pref label: Geweih
  type: Label
  rank: preferred
pref label: antlers
  type: Label
  rank: normal

Zahn
type: Concept
notation: B59296
preferred label: tooth @en
created: 2026-01-30
issued: 2026-01-30
modified: 2026-02-04
publisher: Leibniz-Zentrum für Archäologie (LEIZA)
broader: Biomineral
broader transitive: Biomineral
broader transitive: Material
broader transitive: [Untersuchungsergebnisse]
broader transitive: Zustandserfassung
broader transitive: Objektuntersuchung
broader transitive: silikatisches Material
broader transitive: Materialbestimmung
in scheme: Konservierungs- und Restaurierungsfachthesaurus für archäologische Kulturgüter
pref label: Zahn
  type: Label
  rank: preferred
pref label: tooth
  type: Label
  rank: normal
definition: biologisches Material, aus Dentin, Zahnschmelz und manchmal Zement. Es ist hart, langlebig und verhältnismäßig resistent gegen Verwitterung, wodurch es häufig in archäologischen Funden wie Schmuck, Werkzeugen oder Resten von Tieren und Menschen erhalten bleibt. Zahn kann durch Form, Farbe und Wachstumsmuster individuelle oder artspezifische Merkmale aufweisen und ist ein wichtiger Träger biologischer sowie kultureller Informationen.
definition:
  literal form: biologisches Material, aus Dentin, Zahnschmelz und manchmal Zement. Es ist hart, langlebig und verhältnismäßig resistent gegen Verwitterung, wodurch es häufig in archäologischen Funden wie Schmuck, Werkzeugen oder Resten von Tieren und Menschen erhalten bleibt. Zahn kann durch Form, Farbe und Wachstumsmuster individuelle oder artspezifische Merkmale aufweisen und ist ein wichtiger Träger biologischer sowie kultureller Informationen.
narrower: Tierzahn
narrower: Menschenzahn

Bein
type: Concept
notation: B626A3
preferred label: bone @en
created: 2026-01-30
issued: 2026-01-30
modified: 2026-02-04
publisher: Leibniz-Zentrum für Archäologie (LEIZA)
broader: Biomineral
broader transitive: silikatisches Material
broader transitive: Material
broader transitive: [Untersuchungsergebnisse]
broader transitive: Zustandserfassung
broader transitive: Objektuntersuchung
broader transitive: Materialbestimmung
broader transitive: Biomineral
in scheme: Konservierungs- und Restaurierungsfachthesaurus für archäologische Kulturgüter
narrower: Elfenbein
pref label: Bein
  type: Label
  rank: preferred
pref label: bone
  type: Label
  rank: normal
alternative label: Knochen
alt label: Knochen
  type: Label
  rank: preferred

Schnecke
type: Concept
notation: B69747
preferred label: snail @en
created: 2026-01-30
issued: 2026-01-30
modified: 2026-02-04
publisher: Leibniz-Zentrum für Archäologie (LEIZA)
alternative label: Schneckenhaus
broader: Biomineral
broader transitive: Biomineral
broader transitive: Material
broader transitive: [Untersuchungsergebnisse]
broader transitive: Zustandserfassung
broader transitive: Objektuntersuchung
broader transitive: silikatisches Material
broader transitive: Materialbestimmung
in scheme: Konservierungs- und Restaurierungsfachthesaurus für archäologische Kulturgüter
alt label: Schneckenhaus
  type: Label
  rank: preferred
pref label: Schnecke
  type: Label
  rank: preferred
pref label: snail
  type: Label
  rank: normal

Schildpatt
type: Concept
notation: B69F1G
created: 2026-01-30
issued: 2026-01-30
modified: 2026-02-04
publisher: Leibniz-Zentrum für Archäologie (LEIZA)
broader: Biomineral
broader transitive: Material
broader transitive: [Untersuchungsergebnisse]
broader transitive: Zustandserfassung
broader transitive: Objektuntersuchung
broader transitive: Materialbestimmung
broader transitive: Biomineral
broader transitive: silikatisches Material
definition: Werkstoff in Form von Hornplatten aus dem Panzer von Schildkröten. Je nachdem ob das Schildpatt aus dem Rückenpanzer oder dem Bauchpanzer gewonnen wurde, ergeben sich unterschiedliche Farbgestaltung. Eine gelbe, rötliche bis rotbraune, gefalmmte Zeichnung auf grünlichem bis schwarzbräunlichem Grund zeugt von der Herkunft aus dem Rückenpanzer, während eine dunkle Zeichnung auf gelben Grund aus dem Bauchpanzer stammt. Im Gegensatz zu Horn ist Schildpatt von geringerer Dichte und Lichtbrechung, größerer Sprödigkeit und es fehlt die typische faserige Struktur, wie sie im Horn zu finden ist.
definition:
  literal form: Werkstoff in Form von Hornplatten aus dem Panzer von Schildkröten. Je nachdem ob das Schildpatt aus dem Rückenpanzer oder dem Bauchpanzer gewonnen wurde, ergeben sich unterschiedliche Farbgestaltung. Eine gelbe, rötliche bis rotbraune, gefalmmte Zeichnung auf grünlichem bis schwarzbräunlichem Grund zeugt von der Herkunft aus dem Rückenpanzer, während eine dunkle Zeichnung auf gelben Grund aus dem Bauchpanzer stammt. Im Gegensatz zu Horn ist Schildpatt von geringerer Dichte und Lichtbrechung, größerer Sprödigkeit und es fehlt die typische faserige Struktur, wie sie im Horn zu finden ist.
in scheme: Konservierungs- und Restaurierungsfachthesaurus für archäologische Kulturgüter
pref label: Schildpatt
  type: Label
  rank: preferred

Koralle
type: Concept
notation: B77128
preferred label: coral @en
created: 2026-01-30
issued: 2026-01-30
modified: 2026-02-04
publisher: Leibniz-Zentrum für Archäologie (LEIZA)
broader: Biomineral
broader transitive: Material
broader transitive: [Untersuchungsergebnisse]
broader transitive: Zustandserfassung
broader transitive: Objektuntersuchung
broader transitive: Materialbestimmung
broader transitive: Biomineral
broader transitive: silikatisches Material
in scheme: Konservierungs- und Restaurierungsfachthesaurus für archäologische Kulturgüter
pref label: Koralle
  type: Label
  rank: preferred
pref label: coral
  type: Label
  rank: normal

Bernstein
type: Concept
notation: B8B69D
preferred label: amber @en
created: 2026-01-30
issued: 2026-01-30
modified: 2026-02-04
publisher: Leibniz-Zentrum für Archäologie (LEIZA)
broader: Biomineral
broader transitive: Material
broader transitive: [Untersuchungsergebnisse]
broader transitive: Zustandserfassung
broader transitive: Objektuntersuchung
broader transitive: silikatisches Material
broader transitive: Materialbestimmung
broader transitive: Biomineral
definition: Fossiles Harz von prähistorischen Bäumen, das über Millionen von Jahren polymerisiert und mineralisiert wurde. Als archäologisches Objekt ist Bernstein besonders wertvoll, da er oft organische Einschlüsse wie Insekten oder Pflanzen enthält, die wichtige Informationen über die Umwelt und Lebensbedingungen früherer Epochen liefern.
definition:
  literal form: Fossiles Harz von prähistorischen Bäumen, das über Millionen von Jahren polymerisiert und mineralisiert wurde. Als archäologisches Objekt ist Bernstein besonders wertvoll, da er oft organische Einschlüsse wie Insekten oder Pflanzen enthält, die wichtige Informationen über die Umwelt und Lebensbedingungen früherer Epochen liefern.
in scheme: Konservierungs- und Restaurierungsfachthesaurus für archäologische Kulturgüter
pref label: Bernstein
  type: Label
  rank: preferred
pref label: amber
  type: Label
  rank: normal

Horn
type: Concept
notation: BBC26F
created: 2026-01-30
issued: 2026-01-30
modified: 2026-02-04
publisher: Leibniz-Zentrum für Archäologie (LEIZA)
broader: Biomineral
broader transitive: Material
broader transitive: [Untersuchungsergebnisse]
broader transitive: Zustandserfassung
broader transitive: Objektuntersuchung
broader transitive: Materialbestimmung
broader transitive: Biomineral
broader transitive: silikatisches Material
definition: Werkstoff aus hauptsächlich tierischem Keratin. Im engeren Sinne wird mit dem Begriff hauptsächlich das Tierhorn, in Form der spitz zulaufenden Hornzapfen auf dem Schädel mancher Säugetiere, gemeint, wobei unter Umständen auch anderer aus Keratin tierischen Ursprungs bestehende Materialien (tierische Klauen, Hufe, Schnäbel, Schuppen, etc.) damit bezeichnet werden. Typische Hornträger sind Rinder, Schafen und Ziegen. Je nach Tier, Rasse und/oder Herkunft zeigt Horn eine unterschiedliche Färbung, Transparenz und Größe. Aufgrund seiner guten Bearbeitbarkeit und ästhetischen Erscheinungsbild wird Horn bereits seit der Antike für vielerlei Gegenstände verarbeitet (u.A. Kämme, Messerhefte, Löffel, Figuren, Perlen, Knöpfe, Armreife, etc.)
definition:
  literal form: Werkstoff aus hauptsächlich tierischem Keratin. Im engeren Sinne wird mit dem Begriff hauptsächlich das Tierhorn, in Form der spitz zulaufenden Hornzapfen auf dem Schädel mancher Säugetiere, gemeint, wobei unter Umständen auch anderer aus Keratin tierischen Ursprungs bestehende Materialien (tierische Klauen, Hufe, Schnäbel, Schuppen, etc.) damit bezeichnet werden. Typische Hornträger sind Rinder, Schafen und Ziegen. Je nach Tier, Rasse und/oder Herkunft zeigt Horn eine unterschiedliche Färbung, Transparenz und Größe. Aufgrund seiner guten Bearbeitbarkeit und ästhetischen Erscheinungsbild wird Horn bereits seit der Antike für vielerlei Gegenstände verarbeitet (u.A. Kämme, Messerhefte, Löffel, Figuren, Perlen, Knöpfe, Armreife, etc.)
in scheme: Konservierungs- und Restaurierungsfachthesaurus für archäologische Kulturgüter
pref label: Horn
  type: Label
  rank: preferred

Irdenware
type: Concept
notation: CB19D3
created: 2026-01-30
issued: 2026-01-30
modified: 2026-02-04
publisher: Leibniz-Zentrum für Archäologie (LEIZA)
broader: Feinkeramik
broader transitive: Keramik
broader transitive: silikatisches Material
broader transitive: Material
broader transitive: [Untersuchungsergebnisse]
broader transitive: Zustandserfassung
broader transitive: Objektuntersuchung
broader transitive: Materialbestimmung
broader transitive: Feinkeramik
definition: keramische Materialgruppe mit porösen, meist erdfarbenen Scherben, die bei vergleichsweise niedrigen Temperaturen (ca. 600- 1100°C) gebrannt wird. Aufgrund der niedrigen Brenntemperatur und der daraus resultierenden Offenporigkeit, zeigt Irdenware eine relativ hohe Wasseraufnahmefähigkeit. Aus diesem Grund wird sie häufig mit Engoben oder Glasuren versehen, um die Oberfläche zu verdichten und die Verwendungseigenschaften zu verbessern. Irdenware umfasst verschiedene Keramikwaren wie Terrakotta, Fayence oder Majolika.
definition:
  literal form: keramische Materialgruppe mit porösen, meist erdfarbenen Scherben, die bei vergleichsweise niedrigen Temperaturen (ca. 600- 1100°C) gebrannt wird. Aufgrund der niedrigen Brenntemperatur und der daraus resultierenden Offenporigkeit, zeigt Irdenware eine relativ hohe Wasseraufnahmefähigkeit. Aus diesem Grund wird sie häufig mit Engoben oder Glasuren versehen, um die Oberfläche zu verdichten und die Verwendungseigenschaften zu verbessern. Irdenware umfasst verschiedene Keramikwaren wie Terrakotta, Fayence oder Majolika.
in scheme: Konservierungs- und Restaurierungsfachthesaurus für archäologische Kulturgüter
pref label: Irdenware
  type: Label
  rank: preferred

Porzellan
type: Concept
notation: CF41GC
created: 2026-01-30
issued: 2026-01-30
modified: 2026-02-04
publisher: Leibniz-Zentrum für Archäologie (LEIZA)
broader: Feinkeramik
broader transitive: Keramik
broader transitive: silikatisches Material
broader transitive: Material
broader transitive: [Untersuchungsergebnisse]
broader transitive: Zustandserfassung
broader transitive: Objektuntersuchung
broader transitive: Materialbestimmung
broader transitive: Feinkeramik
in scheme: Konservierungs- und Restaurierungsfachthesaurus für archäologische Kulturgüter
pref label: Porzellan
  type: Label
  rank: preferred

Steingut
type: Concept
notation: CG154B
created: 2026-01-30
issued: 2026-01-30
modified: 2026-02-04
publisher: Leibniz-Zentrum für Archäologie (LEIZA)
broader: Feinkeramik
broader transitive: Keramik
broader transitive: silikatisches Material
broader transitive: Material
broader transitive: [Untersuchungsergebnisse]
broader transitive: Zustandserfassung
broader transitive: Objektuntersuchung
broader transitive: Materialbestimmung
broader transitive: Feinkeramik
in scheme: Konservierungs- und Restaurierungsfachthesaurus für archäologische Kulturgüter
pref label: Steingut
  type: Label
  rank: preferred

Perle
type: Concept
notation: F9D2A8
created: 2026-01-30
issued: 2026-01-30
modified: 2026-02-04
publisher: Leibniz-Zentrum für Archäologie (LEIZA)
broader: Biomineral
broader transitive: Biomineral
broader transitive: Material
broader transitive: [Untersuchungsergebnisse]
broader transitive: Zustandserfassung
broader transitive: Objektuntersuchung
broader transitive: silikatisches Material
broader transitive: Materialbestimmung
in scheme: Konservierungs- und Restaurierungsfachthesaurus für archäologische Kulturgüter
pref label: Perle
  type: Label
  rank: preferred
narrower: Süßwasserperle
narrower: Salzwasserperle

Silberlegierung
type: Concept
notation: AD789F
preferred label: silver alloy @en
created: 2026-01-30
issued: 2026-01-30
modified: 2026-02-04
publisher: Leibniz-Zentrum für Archäologie (LEIZA)
alternative label: Silberlegierungen
broader: Edelmetalllegierung
broader transitive: Edelmetalllegierung
broader transitive: Material
broader transitive: Metall
broader transitive: [Untersuchungsergebnisse]
broader transitive: Zustandserfassung
broader transitive: Objektuntersuchung
broader transitive: Metalllegierung
broader transitive: Materialbestimmung
definition: Legierung mit Silber als Hauptbestandteil. Reines Silber ist für viele Anwendungsbereiche zu weich, sodass es häufig mit anderen Metallen (vor allem Kupfer) legiert wird. Neben den Korrosionserscheinungen des reinen Silbers treten in Legierungssystemen weitere Korrosionen auf. So kann sich z.B. bei kupferhaltigen Silberlegierungen Kupfer-I-oxid und Kupfersulfid bilden.
definition:
  literal form: Legierung mit Silber als Hauptbestandteil. Reines Silber ist für viele Anwendungsbereiche zu weich, sodass es häufig mit anderen Metallen (vor allem Kupfer) legiert wird. Neben den Korrosionserscheinungen des reinen Silbers treten in Legierungssystemen weitere Korrosionen auf. So kann sich z.B. bei kupferhaltigen Silberlegierungen Kupfer-I-oxid und Kupfersulfid bilden.
in scheme: Konservierungs- und Restaurierungsfachthesaurus für archäologische Kulturgüter
alt label: Silberlegierungen
  type: Label
  rank: preferred
pref label: Silberlegierung
  type: Label
  rank: preferred
pref label: silver alloy
  type: Label
  rank: normal

Edelmetalllegierung
type: Concept
notation: G4AG5C
created: 2026-01-30
issued: 2026-01-30
modified: 2026-02-04
publisher: Leibniz-Zentrum für Archäologie (LEIZA)
broader: Metalllegierung
broader transitive: Material
broader transitive: Metall
broader transitive: [Untersuchungsergebnisse]
broader transitive: Zustandserfassung
broader transitive: Objektuntersuchung
broader transitive: Metalllegierung
broader transitive: Materialbestimmung
definition: Legierung, bei dem der Hauptbestandteil ein Edelmetall ist.
in scheme: Konservierungs- und Restaurierungsfachthesaurus für archäologische Kulturgüter
pref label: Edelmetalllegierung
  type: Label
  rank: preferred
narrower: Silberlegierung
narrower: Goldlegierung
narrower: Elektrum

Metall
type: Concept
notation: B5DD1A
preferred label: metal @en
preferred label: métal @fr
created: 2026-01-30
issued: 2026-01-30
modified: 2026-02-04
publisher: Leibniz-Zentrum für Archäologie (LEIZA)
broader: Material
broader transitive: Material
broader transitive: Materialbestimmung
broader transitive: [Untersuchungsergebnisse]
broader transitive: Zustandserfassung
broader transitive: Objektuntersuchung
definition: chemisches Element, das durch eine gute elektrische und thermische Leitfähigkeit, einen typischen Glanz sowie gute Formbarkeit mit spanlosen oder spangebenden Methoden gekennzeichnet ist. Die typischen metallischen Eigenschaften ergeben sich aus der charakteristischen Gitterstruktur des Atomaufbaus. Metalle werden bereits seit Jahrhunderten von Menschen systematisch gewonnen, bearbeitet und für Werkzeuge, Schmuck, Waffen und andere Zwecke verwendet. Sie spielen eine zentrale Rolle in der technologischen und kulturellen Entwicklung der Menschheit.
definition:
  literal form: chemisches Element, das durch eine gute elektrische und thermische Leitfähigkeit, einen typischen Glanz sowie gute Formbarkeit mit spanlosen oder spangebenden Methoden gekennzeichnet ist. Die typischen metallischen Eigenschaften ergeben sich aus der charakteristischen Gitterstruktur des Atomaufbaus. Metalle werden bereits seit Jahrhunderten von Menschen systematisch gewonnen, bearbeitet und für Werkzeuge, Schmuck, Waffen und andere Zwecke verwendet. Sie spielen eine zentrale Rolle in der technologischen und kulturellen Entwicklung der Menschheit.
in scheme: Konservierungs- und Restaurierungsfachthesaurus für archäologische Kulturgüter
pref label: Metall
  type: Label
  rank: preferred
pref label: metal
  type: Label
  rank: normal
pref label: métal
  type: Label
  rank: normal
alternative label: Metalle
narrower: reines Metall
narrower: Metalllegierung
alt label: Metalle
  type: Label
  rank: preferred

Metalllegierung
type: Concept
notation: F9GB13
preferred label: metal alloy @en
created: 2026-01-30
issued: 2026-01-30
modified: 2026-02-04
publisher: Leibniz-Zentrum für Archäologie (LEIZA)
alternative label: Legierung
broader: Metall
broader transitive: Material
broader transitive: Metall
broader transitive: [Untersuchungsergebnisse]
broader transitive: Zustandserfassung
broader transitive: Objektuntersuchung
broader transitive: Materialbestimmung
definition: Gemenge aus mindestens zwei verschiedenen chemischen Elementen, wobei eines davon ein Metall ist. Durch das gezielte Zusammenschmelzen von Metallen werden Legierungen mit spezifischen Eigenschaften wie verbesserte Festigkeit, Korrosionsbeständigkeit oder Verarbeitbarkeit hergestellt. Im festen/abgekühlten Zustand können diese Legierungsbestandteile nicht ohne weiteres mit physikalischen Methoden getrennt werden. Benannt werden Legierungen nach dem mengenmäßig überwiegend enthaltenen Metall.
definition:
  literal form: Gemenge aus mindestens zwei verschiedenen chemischen Elementen, wobei eines davon ein Metall ist. Durch das gezielte Zusammenschmelzen von Metallen werden Legierungen mit spezifischen Eigenschaften wie verbesserte Festigkeit, Korrosionsbeständigkeit oder Verarbeitbarkeit hergestellt. Im festen/abgekühlten Zustand können diese Legierungsbestandteile nicht ohne weiteres mit physikalischen Methoden getrennt werden. Benannt werden Legierungen nach dem mengenmäßig überwiegend enthaltenen Metall.
in scheme: Konservierungs- und Restaurierungsfachthesaurus für archäologische Kulturgüter
alt label: Legierung
  type: Label
  rank: preferred
pref label: Metalllegierung
  type: Label
  rank: preferred
pref label: metal alloy
  type: Label
  rank: normal
narrower: Edelmetalllegierung
narrower: Unedelmetallegierung

Unedelmetall
type: Concept
notation: BBF566
preferred label: base metal @en
created: 2026-01-30
issued: 2026-01-30
modified: 2026-02-04
publisher: Leibniz-Zentrum für Archäologie (LEIZA)
broader: reines Metall
broader transitive: [Untersuchungsergebnisse]
broader transitive: Zustandserfassung
broader transitive: Objektuntersuchung
broader transitive: Material
broader transitive: Metall
broader transitive: reines Metall
broader transitive: Materialbestimmung
in scheme: Konservierungs- und Restaurierungsfachthesaurus für archäologische Kulturgüter
pref label: Unedelmetall
  type: Label
  rank: preferred
pref label: base metal
  type: Label
  rank: normal
alternative label: unedle Metalle
alternative label: unedles Metall
definition: Sammelbegriff für Metalle, mit negativem Normalpotenzial. Sie neigen, aufgrund ihres hohen Lösungsdrucks, unter Normalbedingungen zur chemischen Reaktion mit ihrer Umgebung. Objekte aus unedlen Metallen zeigen im archäologischen Kontext daher in der Regel mehr oder weniger starke Korrosionserscheinungen.
definition:
  literal form: Sammelbegriff für Metalle, mit negativem Normalpotenzial. Sie neigen, aufgrund ihres hohen Lösungsdrucks, unter Normalbedingungen zur chemischen Reaktion mit ihrer Umgebung. Objekte aus unedlen Metallen zeigen im archäologischen Kontext daher in der Regel mehr oder weniger starke Korrosionserscheinungen.
alt label: unedles Metall
  type: Label
  rank: preferred
alt label: unedle Metalle
  type: Label
  rank: normal
narrower: Buntmetall
narrower: Eisen

Goldlegierung
type: Concept
notation: DC5B2B
preferred label: gold alloy @en
created: 2026-01-30
issued: 2026-01-30
modified: 2026-02-04
publisher: Leibniz-Zentrum für Archäologie (LEIZA)
alternative label: Goldlegierungen
broader: Edelmetalllegierung
broader transitive: Edelmetalllegierung
broader transitive: Material
broader transitive: Metall
broader transitive: [Untersuchungsergebnisse]
broader transitive: Zustandserfassung
broader transitive: Objektuntersuchung
broader transitive: Metalllegierung
broader transitive: Materialbestimmung
definition: Legierung mit Gold als Hauptbestandteil. Da reines Gold relativ weich ist, wird es zur Verbesserung der Härte und Beständigkeit mit anderen Metallen (hauptsächlich Kupfer und Silber) legiert. Kongruent zu reinen Goldobjekten sind auch an Objekten aus Goldlegierungen kaum materialbedingte konservatorische Maßnahmen notwendig. Je nach Höhe des Anteils an unedleren Bestandteilen kann es jedoch zu oberflächlicher Verfärbung kommen.
definition:
  literal form: Legierung mit Gold als Hauptbestandteil. Da reines Gold relativ weich ist, wird es zur Verbesserung der Härte und Beständigkeit mit anderen Metallen (hauptsächlich Kupfer und Silber) legiert. Kongruent zu reinen Goldobjekten sind auch an Objekten aus Goldlegierungen kaum materialbedingte konservatorische Maßnahmen notwendig. Je nach Höhe des Anteils an unedleren Bestandteilen kann es jedoch zu oberflächlicher Verfärbung kommen.
in scheme: Konservierungs- und Restaurierungsfachthesaurus für archäologische Kulturgüter
alt label: Goldlegierungen
  type: Label
  rank: preferred
pref label: Goldlegierung
  type: Label
  rank: preferred
pref label: gold alloy
  type: Label
  rank: normal

reines Metall
type: Concept
notation: F7D3DB
created: 2026-01-30
issued: 2026-01-30
modified: 2026-02-04
publisher: Leibniz-Zentrum für Archäologie (LEIZA)
broader: Metall
broader transitive: Material
broader transitive: Materialbestimmung
broader transitive: [Untersuchungsergebnisse]
broader transitive: Zustandserfassung
broader transitive: Objektuntersuchung
broader transitive: Metall
definition: Metall, welches nahezu ausschließlich aus einer Atomart besteht und nur sehr geringe Mengen an anderen Elementen enthält. Jedes Reinmetall besitzt charakteristische physikalische und chemische Eigenschaften, wie eine spezifische Dichte, Härte, Schmelztemperatur und chemische Aktivität, das es von anderen Metallen unterscheidet.
definition:
  literal form: Metall, welches nahezu ausschließlich aus einer Atomart besteht und nur sehr geringe Mengen an anderen Elementen enthält. Jedes Reinmetall besitzt charakteristische physikalische und chemische Eigenschaften, wie eine spezifische Dichte, Härte, Schmelztemperatur und chemische Aktivität, das es von anderen Metallen unterscheidet.
in scheme: Konservierungs- und Restaurierungsfachthesaurus für archäologische Kulturgüter
pref label: reines Metall
  type: Label
  rank: preferred
alternative label: Reinmetall
narrower: Unedelmetall
narrower: Edelmetall
alt label: Reinmetall
  type: Label
  rank: preferred

Elektrum
type: Concept
notation: F9F6DG
preferred label: electrum @en
preferred label: électrum @fr
created: 2026-01-30
issued: 2026-01-30
modified: 2026-02-04
publisher: Leibniz-Zentrum für Archäologie (LEIZA)
alternative label: Elektron
broader: Edelmetalllegierung
broader transitive: Edelmetalllegierung
broader transitive: Material
broader transitive: Metall
broader transitive: [Untersuchungsergebnisse]
broader transitive: Zustandserfassung
broader transitive: Objektuntersuchung
broader transitive: Metalllegierung
broader transitive: Materialbestimmung
definition: natürlich vorkommende Legierung aus Gold und Silber, teils auch mit geringem Kupferanteil.
in scheme: Konservierungs- und Restaurierungsfachthesaurus für archäologische Kulturgüter
alt label: Elektron
  type: Label
  rank: preferred
pref label: Elektrum
  type: Label
  rank: preferred
pref label: electrum
  type: Label
  rank: normal
pref label: électrum
  type: Label
  rank: normal

Unedelmetallegierung
type: Concept
notation: FAG415
created: 2026-01-30
issued: 2026-01-30
modified: 2026-02-04
publisher: Leibniz-Zentrum für Archäologie (LEIZA)
broader: Metalllegierung
broader transitive: Material
broader transitive: Metall
broader transitive: [Untersuchungsergebnisse]
broader transitive: Zustandserfassung
broader transitive: Objektuntersuchung
broader transitive: Metalllegierung
broader transitive: Materialbestimmung
definition: Legierung, bei dem der Hauptbestandteil durch ein unedles Metall gebildet wird.
in scheme: Konservierungs- und Restaurierungsfachthesaurus für archäologische Kulturgüter
pref label: Unedelmetallegierung
  type: Label
  rank: preferred
narrower: Buntmetalllegierung
narrower: Eisenlegierung

Zinn
type: Concept
notation: G78BD6
preferred label: tin @en
created: 2026-01-30
issued: 2026-01-30
modified: 2026-02-04
publisher: Leibniz-Zentrum für Archäologie (LEIZA)
broader: Buntmetall
broader transitive: Material
broader transitive: Metall
broader transitive: [Untersuchungsergebnisse]
broader transitive: Zustandserfassung
broader transitive: Objektuntersuchung
broader transitive: Materialbestimmung
broader transitive: Unedelmetall
broader transitive: reines Metall
broader transitive: Buntmetall
definition: silberweißes, sehr weiches Metall mit dem chemischen Symbol Sn und der Ordnungszahl 50. Zinn wird hauptsächlich als Legierungsbestandteil (z.B. für (Zinn-)Bronze oder in Weichloten) verwendet, aber auch als reines Metall für die Herstellung von Geschirr und kleinen Kulturobjekten. Gegenüber Luftsauerstoff ist es weitgehend beständig, wird jedoch von Säuren (v.a. Salpetersäure) stark angegriffen. Bei der Lagerung von Zinnobjekten unterhalb 13°C tritt das Phänomen der sog. "Zinnpest" auf, bei der sich das stabile Zinn in α-Zinn umwandelt, was sich in Form von Flecken und Pusteln bemerktbar macht und schleichend zur vollständigen Verstörung des Zinnobjektes führt.
definition:
  literal form: silberweißes, sehr weiches Metall mit dem chemischen Symbol Sn und der Ordnungszahl 50. Zinn wird hauptsächlich als Legierungsbestandteil (z.B. für (Zinn-)Bronze oder in Weichloten) verwendet, aber auch als reines Metall für die Herstellung von Geschirr und kleinen Kulturobjekten. Gegenüber Luftsauerstoff ist es weitgehend beständig, wird jedoch von Säuren (v.a. Salpetersäure) stark angegriffen. Bei der Lagerung von Zinnobjekten unterhalb 13°C tritt das Phänomen der sog. "Zinnpest" auf, bei der sich das stabile Zinn in α-Zinn umwandelt, was sich in Form von Flecken und Pusteln bemerktbar macht und schleichend zur vollständigen Verstörung des Zinnobjektes führt.
in scheme: Konservierungs- und Restaurierungsfachthesaurus für archäologische Kulturgüter
pref label: Zinn
  type: Label
  rank: preferred
pref label: tin
  type: Label
  rank: normal

Buntmetall
type: Concept
notation: GB5BGF
preferred label: nonferrous metal @en
created: 2026-01-30
issued: 2026-01-30
modified: 2026-02-04
publisher: Leibniz-Zentrum für Archäologie (LEIZA)
broader: Unedelmetall
broader transitive: [Untersuchungsergebnisse]
broader transitive: Zustandserfassung
broader transitive: Objektuntersuchung
broader transitive: Material
broader transitive: Metall
broader transitive: Unedelmetall
broader transitive: reines Metall
broader transitive: Materialbestimmung
in scheme: Konservierungs- und Restaurierungsfachthesaurus für archäologische Kulturgüter
pref label: Buntmetall
  type: Label
  rank: preferred
pref label: nonferrous metal
  type: Label
  rank: normal
definition: Sammelbegriff für farbige Metalle, außer Eisen und Edelmetalle. Sie zeichnen sich durch ihre Farbvielfalt aus und wurden bereits seit der frühsten Menschheitsgeschichte für ihre spezifischen Eigenschaften wie Härte, Korrosionsbeständigkeit und elektrische Leitfähigkeit geschätzt.
definition:
  literal form: Sammelbegriff für farbige Metalle, außer Eisen und Edelmetalle. Sie zeichnen sich durch ihre Farbvielfalt aus und wurden bereits seit der frühsten Menschheitsgeschichte für ihre spezifischen Eigenschaften wie Härte, Korrosionsbeständigkeit und elektrische Leitfähigkeit geschätzt.
narrower: Kupfer
narrower: Zinn
narrower: Zink
narrower: Blei

Zinnbronze
type: Concept
notation: A6D8BF
created: 2026-01-30
issued: 2026-01-30
modified: 2026-02-04
publisher: Leibniz-Zentrum für Archäologie (LEIZA)
broader: Bronze
broader transitive: Bronze
broader transitive: Buntmetalllegierung
broader transitive: Material
broader transitive: Metall
broader transitive: [Untersuchungsergebnisse]
broader transitive: Zustandserfassung
broader transitive: Objektuntersuchung
broader transitive: Metalllegierung
broader transitive: Unedelmetallegierung
broader transitive: Kupferlegierung
broader transitive: Materialbestimmung
definition: Legierung aus Kupfer und Zinn, die je nach Gewichtsanteil der beiden Bestandteile unterschiedliche Eigenschaften aufweisen kann. Zinnbronzen mit höherem Kupfergehalt und Zinngehalten bis ca. 10% zeichenen sich durch eine gute Festigkeit und Umformbarkeit (Hämmer-, Walz und Schmiedbarkeit) aus, während Zinnbronzen mit einem höheren Zinngehalt an Härte und Dehnbarkeit aber auch Sprödigkeit zunehmen und daher hauptsächlich als Gusswerkstoff verwendet werden.
definition:
  literal form: Legierung aus Kupfer und Zinn, die je nach Gewichtsanteil der beiden Bestandteile unterschiedliche Eigenschaften aufweisen kann. Zinnbronzen mit höherem Kupfergehalt und Zinngehalten bis ca. 10% zeichenen sich durch eine gute Festigkeit und Umformbarkeit (Hämmer-, Walz und Schmiedbarkeit) aus, während Zinnbronzen mit einem höheren Zinngehalt an Härte und Dehnbarkeit aber auch Sprödigkeit zunehmen und daher hauptsächlich als Gusswerkstoff verwendet werden.
in scheme: Konservierungs- und Restaurierungsfachthesaurus für archäologische Kulturgüter
pref label: Zinnbronze
  type: Label
  rank: preferred

Bronze
type: Concept
notation: BF7D14
preferred label: bronze @en
created: 2026-01-30
issued: 2026-01-30
modified: 2026-02-04
publisher: Leibniz-Zentrum für Archäologie (LEIZA)
broader: Kupferlegierung
broader transitive: Buntmetalllegierung
broader transitive: Material
broader transitive: Metall
broader transitive: [Untersuchungsergebnisse]
broader transitive: Zustandserfassung
broader transitive: Objektuntersuchung
broader transitive: Metalllegierung
broader transitive: Unedelmetallegierung
broader transitive: Kupferlegierung
broader transitive: Materialbestimmung
definition: Kupferlegierung mit Zinn als zweiter Hauptbestandteil. Moderne Bronzen weisen in der Regel genormte Zusammensetzungen und gezielte Legierungsbestandteile auf. In historischen Bronzen finden sich, je nach Zeitstellung und Kultur, unter Umständen sehr unterschiedliche Zusammetzungen und andere Bestandteile, wie Zink, Silber, Blei, Antimon, Arsen, etc. Zur eindeutigen metallurgischen Bestimmung wird der Begriff Bronze häufig zusammen mit dem vorangestellten Hauptlegierungszusatz verwendet (Bleibronze, Arsenbronze, usw.). Bronze kann, je nach Legierungszusammensetzung, eine gelb-golde, rötliche bis weißliche Färbung aufweisen. Ebenso hängt die Verarbeitbarkeit maßgeblich von den Legierungszusammensetzten ab. Die Korrosionsanfälligkeit von Bronze entspricht im Wesentlichen der des Kupfers, wobei entsprechend der anderen Bestandteile weitere Korrosionserscheinungen auftreten können.
definition:
  literal form: Kupferlegierung mit Zinn als zweiter Hauptbestandteil. Moderne Bronzen weisen in der Regel genormte Zusammensetzungen und gezielte Legierungsbestandteile auf. In historischen Bronzen finden sich, je nach Zeitstellung und Kultur, unter Umständen sehr unterschiedliche Zusammetzungen und andere Bestandteile, wie Zink, Silber, Blei, Antimon, Arsen, etc. Zur eindeutigen metallurgischen Bestimmung wird der Begriff Bronze häufig zusammen mit dem vorangestellten Hauptlegierungszusatz verwendet (Bleibronze, Arsenbronze, usw.). Bronze kann, je nach Legierungszusammensetzung, eine gelb-golde, rötliche bis weißliche Färbung aufweisen. Ebenso hängt die Verarbeitbarkeit maßgeblich von den Legierungszusammensetzten ab. Die Korrosionsanfälligkeit von Bronze entspricht im Wesentlichen der des Kupfers, wobei entsprechend der anderen Bestandteile weitere Korrosionserscheinungen auftreten können.
in scheme: Konservierungs- und Restaurierungsfachthesaurus für archäologische Kulturgüter
pref label: bronze
  type: Label
  rank: normal
pref label: Bronze
  type: Label
  rank: preferred
narrower: Zinnbronze
narrower: Arsenbronze
narrower: Bleibronze
alternative label: Bronzen
alt label: Bronzen
  type: Label
  rank: preferred

Buntmetalllegierung
type: Concept
notation: A82D86
created: 2026-01-30
issued: 2026-01-30
modified: 2026-02-04
publisher: Leibniz-Zentrum für Archäologie (LEIZA)
broader: Unedelmetallegierung
broader transitive: Material
broader transitive: Metall
broader transitive: [Untersuchungsergebnisse]
broader transitive: Zustandserfassung
broader transitive: Objektuntersuchung
broader transitive: Metalllegierung
broader transitive: Unedelmetallegierung
broader transitive: Materialbestimmung
definition: Sammelbezeichnung für farbige Legierungen mit schweren Nichteisenmetallen als Hauptbestandsteile. Wird in der archäologischen Restaurierung häufig als allgemeiner Oberbegriff für kupferhaltige Objektwerkstoffe verwendet, solange keine eindeutige Materialanalyse durchgeführt wurde.
definition:
  literal form: Sammelbezeichnung für farbige Legierungen mit schweren Nichteisenmetallen als Hauptbestandsteile. Wird in der archäologischen Restaurierung häufig als allgemeiner Oberbegriff für kupferhaltige Objektwerkstoffe verwendet, solange keine eindeutige Materialanalyse durchgeführt wurde.
in scheme: Konservierungs- und Restaurierungsfachthesaurus für archäologische Kulturgüter
pref label: Buntmetalllegierung
  type: Label
  rank: preferred
narrower: Kupferlegierung
narrower: Zinklegierung
narrower: Bleilegierung
narrower: Zinnlegierung

Kupferlegierung
type: Concept
notation: FGB415
preferred label: copper alloy @en
created: 2026-01-30
issued: 2026-01-30
modified: 2026-02-04
publisher: Leibniz-Zentrum für Archäologie (LEIZA)
broader: Buntmetalllegierung
broader transitive: Buntmetalllegierung
broader transitive: Material
broader transitive: Metall
broader transitive: [Untersuchungsergebnisse]
broader transitive: Zustandserfassung
broader transitive: Objektuntersuchung
broader transitive: Metalllegierung
broader transitive: Unedelmetallegierung
broader transitive: Materialbestimmung
definition: Legierung mit Kupfer als Hauptbestandteil. Parallel zur Verwendung von reinem Kupfer, steht auch die Herstellung von Kupferlegierung am Beginn der historischen Metallverarbeitung der Menschheitsgeschichte. Aufgrund der reichen Verfügbarkeit, guten Verarbeitbarkeit und Verständigkeit wurde Kupfer für vielerlei Gegenstände (z.B. Schmuck, Waffen, Gefäße, etc.) verwendet.
definition:
  literal form: Legierung mit Kupfer als Hauptbestandteil. Parallel zur Verwendung von reinem Kupfer, steht auch die Herstellung von Kupferlegierung am Beginn der historischen Metallverarbeitung der Menschheitsgeschichte. Aufgrund der reichen Verfügbarkeit, guten Verarbeitbarkeit und Verständigkeit wurde Kupfer für vielerlei Gegenstände (z.B. Schmuck, Waffen, Gefäße, etc.) verwendet.
in scheme: Konservierungs- und Restaurierungsfachthesaurus für archäologische Kulturgüter
pref label: Kupferlegierung
  type: Label
  rank: preferred
pref label: copper alloy
  type: Label
  rank: normal
narrower: Bronze
narrower: Messing
narrower: Tombak
alternative label: Kupferlegierungen
alt label: Kupferlegierungen
  type: Label
  rank: preferred

Zinklegierung
type: Concept
notation: F15DFD
preferred label: zinc alloy @en
created: 2026-01-30
issued: 2026-01-30
modified: 2026-02-04
publisher: Leibniz-Zentrum für Archäologie (LEIZA)
broader: Buntmetalllegierung
broader transitive: Material
broader transitive: [Untersuchungsergebnisse]
broader transitive: Zustandserfassung
broader transitive: Objektuntersuchung
broader transitive: Materialbestimmung
broader transitive: Buntmetalllegierung
broader transitive: Metall
broader transitive: Metalllegierung
broader transitive: Unedelmetallegierung
definition: Legierung mit Zink als Hauptbestandteil.
in scheme: Konservierungs- und Restaurierungsfachthesaurus für archäologische Kulturgüter
pref label: Zinklegierung
  type: Label
  rank: preferred
pref label: zinc alloy
  type: Label
  rank: normal

Bleilegierung
type: Concept
notation: F387GB
preferred label: lead alloy @en
created: 2026-01-30
issued: 2026-01-30
modified: 2026-02-04
publisher: Leibniz-Zentrum für Archäologie (LEIZA)
broader: Buntmetalllegierung
broader transitive: Material
broader transitive: [Untersuchungsergebnisse]
broader transitive: Zustandserfassung
broader transitive: Objektuntersuchung
broader transitive: Materialbestimmung
broader transitive: Buntmetalllegierung
broader transitive: Metall
broader transitive: Metalllegierung
broader transitive: Unedelmetallegierung
definition: Legierung mit Blei als Hauptbestandteil.
in scheme: Konservierungs- und Restaurierungsfachthesaurus für archäologische Kulturgüter
pref label: Bleilegierung
  type: Label
  rank: preferred
pref label: lead alloy
  type: Label
  rank: normal

Zinnlegierung
type: Concept
notation: G6A358
preferred label: tin alloy @en
created: 2026-01-30
issued: 2026-01-30
modified: 2026-02-04
publisher: Leibniz-Zentrum für Archäologie (LEIZA)
broader: Buntmetalllegierung
broader transitive: Material
broader transitive: [Untersuchungsergebnisse]
broader transitive: Zustandserfassung
broader transitive: Objektuntersuchung
broader transitive: Materialbestimmung
broader transitive: Buntmetalllegierung
broader transitive: Metall
broader transitive: Metalllegierung
broader transitive: Unedelmetallegierung
definition: Legierung mit Zinn als Hauptbestandteil.
in scheme: Konservierungs- und Restaurierungsfachthesaurus für archäologische Kulturgüter
pref label: Zinnlegierung
  type: Label
  rank: preferred
pref label: tin alloy
  type: Label
  rank: normal

Messing
type: Concept
notation: A8B271
preferred label: brass @en
created: 2026-01-30
issued: 2026-01-30
modified: 2026-02-04
publisher: Leibniz-Zentrum für Archäologie (LEIZA)
broader: Kupferlegierung
broader transitive: Buntmetalllegierung
broader transitive: Material
broader transitive: Metall
broader transitive: [Untersuchungsergebnisse]
broader transitive: Zustandserfassung
broader transitive: Objektuntersuchung
broader transitive: Metalllegierung
broader transitive: Unedelmetallegierung
broader transitive: Kupferlegierung
broader transitive: Materialbestimmung
definition: Kupferlegierung mit mindestens 50% Kupfer und Zink als zweiten Hauptbestandteil in unterschiedlichen Massenanteilen. Weitere Legierungsbestandteile (z.B. Blei) können zur Einstellung bestimmter Eigenschaften zugegeben sein. Messing kann, je nach Legierungszusammensetzung, eine hellgelbe, goldene bis bräunliche Färbung aufweisen. Aus diesem Grund wird es unter anderem für Goldimitationen verwendet. Messing lässt sich sehr gut gießen, ebenso gut kalt verformen sowie spanlos und spanabhebend bearbeiten, wodurch es entsprechend für die Herstellung von gegossenen Gegenständen als auch getriebenen Gefäßen verwendet wird. Messing zeigt, ebenso wie Bronze, hauptsächlich Korrosionserscheinungen entsprechend des Hauptbestandteiles Kupfer.
definition:
  literal form: Kupferlegierung mit mindestens 50% Kupfer und Zink als zweiten Hauptbestandteil in unterschiedlichen Massenanteilen. Weitere Legierungsbestandteile (z.B. Blei) können zur Einstellung bestimmter Eigenschaften zugegeben sein. Messing kann, je nach Legierungszusammensetzung, eine hellgelbe, goldene bis bräunliche Färbung aufweisen. Aus diesem Grund wird es unter anderem für Goldimitationen verwendet. Messing lässt sich sehr gut gießen, ebenso gut kalt verformen sowie spanlos und spanabhebend bearbeiten, wodurch es entsprechend für die Herstellung von gegossenen Gegenständen als auch getriebenen Gefäßen verwendet wird. Messing zeigt, ebenso wie Bronze, hauptsächlich Korrosionserscheinungen entsprechend des Hauptbestandteiles Kupfer.
in scheme: Konservierungs- und Restaurierungsfachthesaurus für archäologische Kulturgüter
pref label: Messing
  type: Label
  rank: preferred
pref label: brass
  type: Label
  rank: normal

Tombak
type: Concept
notation: B93G16
preferred label: tombac @en
created: 2026-01-30
issued: 2026-01-30
modified: 2026-02-04
publisher: Leibniz-Zentrum für Archäologie (LEIZA)
broader: Kupferlegierung
broader transitive: Buntmetalllegierung
broader transitive: Material
broader transitive: Metall
broader transitive: [Untersuchungsergebnisse]
broader transitive: Zustandserfassung
broader transitive: Objektuntersuchung
broader transitive: Metalllegierung
broader transitive: Unedelmetallegierung
broader transitive: Kupferlegierung
broader transitive: Materialbestimmung
definition: Kupfer-Zink Legierung, mit hohem Kupferanteil (> 67%) . Ähnlich dem Messing, aber durch den höheren Kupferanteil von deutlich rötlicherer Farbe.
in scheme: Konservierungs- und Restaurierungsfachthesaurus für archäologische Kulturgüter
pref label: Tombak
  type: Label
  rank: preferred
pref label: tombac
  type: Label
  rank: normal

Eisenlegierung
type: Concept
notation: BC75G1
preferred label: iron alloy @en
created: 2026-01-30
issued: 2026-01-30
modified: 2026-02-04
publisher: Leibniz-Zentrum für Archäologie (LEIZA)
broader: Unedelmetallegierung
broader transitive: Material
broader transitive: Metall
broader transitive: [Untersuchungsergebnisse]
broader transitive: Zustandserfassung
broader transitive: Objektuntersuchung
broader transitive: Metalllegierung
broader transitive: Unedelmetallegierung
broader transitive: Materialbestimmung
definition: Legierung mit Eisen als Hauptbestandteil, die aufgrund ihrer Härte und Verfügbarkeit seit der Antike weit verbreitet für die Herstellung von Werkzeugen, Waffen und landwirtschaftlichen Geräten genutzt wurde. Die Entdeckung der Eisenherstellung (Verhüttung) stellt einen wichtigen Fortschritt in der technologischen Metallverarbeitung der Menschheitsgeschichte dar und beeinflusste maßgeblich die Entwicklung und Expansion antiker Kulturen. Eisenlegierungen sind äußerst korrosionsanfällig, wobei das Korrosionsgeschehen stark von der Legierungszusammensetzung und der Gefügestruktur abhängig ist.
definition:
  literal form: Legierung mit Eisen als Hauptbestandteil, die aufgrund ihrer Härte und Verfügbarkeit seit der Antike weit verbreitet für die Herstellung von Werkzeugen, Waffen und landwirtschaftlichen Geräten genutzt wurde. Die Entdeckung der Eisenherstellung (Verhüttung) stellt einen wichtigen Fortschritt in der technologischen Metallverarbeitung der Menschheitsgeschichte dar und beeinflusste maßgeblich die Entwicklung und Expansion antiker Kulturen. Eisenlegierungen sind äußerst korrosionsanfällig, wobei das Korrosionsgeschehen stark von der Legierungszusammensetzung und der Gefügestruktur abhängig ist.
in scheme: Konservierungs- und Restaurierungsfachthesaurus für archäologische Kulturgüter
pref label: Eisenlegierung
  type: Label
  rank: preferred
pref label: iron alloy
  type: Label
  rank: normal

Arsenbronze
type: Concept
notation: C1DGG5
created: 2026-01-30
issued: 2026-01-30
modified: 2026-02-04
publisher: Leibniz-Zentrum für Archäologie (LEIZA)
broader: Bronze
broader transitive: Bronze
broader transitive: Buntmetalllegierung
broader transitive: Material
broader transitive: Metall
broader transitive: [Untersuchungsergebnisse]
broader transitive: Zustandserfassung
broader transitive: Objektuntersuchung
broader transitive: Metalllegierung
broader transitive: Unedelmetallegierung
broader transitive: Kupferlegierung
broader transitive: Materialbestimmung
definition: antike Bronzelegierung aus Kupfer und Arsen
in scheme: Konservierungs- und Restaurierungsfachthesaurus für archäologische Kulturgüter
pref label: Arsenbronze
  type: Label
  rank: preferred

Bleibronze
type: Concept
notation: DG663G
created: 2026-01-30
issued: 2026-01-30
modified: 2026-02-04
publisher: Leibniz-Zentrum für Archäologie (LEIZA)
broader: Bronze
broader transitive: Bronze
broader transitive: Buntmetalllegierung
broader transitive: Material
broader transitive: Metall
broader transitive: [Untersuchungsergebnisse]
broader transitive: Zustandserfassung
broader transitive: Objektuntersuchung
broader transitive: Metalllegierung
broader transitive: Unedelmetallegierung
broader transitive: Kupferlegierung
broader transitive: Materialbestimmung
definition: Kupferlegierung aus ca. 60% Kupfer und dem Hauptlegierungsbestandteil Blei (bis zu 28%).
in scheme: Konservierungs- und Restaurierungsfachthesaurus für archäologische Kulturgüter
pref label: Bleibronze
  type: Label
  rank: preferred

Rohhaut
type: Concept
notation: A82C8C
preferred label: rawhide @en
created: 2026-01-30
issued: 2026-01-30
modified: 2026-02-04
publisher: Leibniz-Zentrum für Archäologie (LEIZA)
broader: Tierhaut
broader transitive: Tierhaut
broader transitive: Material
broader transitive: Kollagenhaltiges Material
broader transitive: [Untersuchungsergebnisse]
broader transitive: Zustandserfassung
broader transitive: Objektuntersuchung
broader transitive: organisches Material
broader transitive: Materialien tierischen Ursprungs
broader transitive: Materialbestimmung
definition: Von Fleisch und Haaren befreite und getrocknete, ungegerbte Tierhaut
in scheme: Konservierungs- und Restaurierungsfachthesaurus für archäologische Kulturgüter
pref label: Rohhaut
  type: Label
  rank: preferred
pref label: rawhide
  type: Label
  rank: normal

Tierhaut
type: Concept
notation: FCF757
preferred label: animal skin @en
created: 2026-01-30
issued: 2026-01-30
modified: 2026-02-04
publisher: Leibniz-Zentrum für Archäologie (LEIZA)
broader: Kollagenhaltiges Material
broader transitive: Material
broader transitive: Kollagenhaltiges Material
broader transitive: [Untersuchungsergebnisse]
broader transitive: Zustandserfassung
broader transitive: Objektuntersuchung
broader transitive: organisches Material
broader transitive: Materialien tierischen Ursprungs
broader transitive: Materialbestimmung
definition: organisches Material aus der vom Körper abgetrennten, äußersten Gewebehülle von Tieren, die durch verschiedene Verfahren haltbar und weiter verarbeitbar gemacht wurde.
in scheme: Konservierungs- und Restaurierungsfachthesaurus für archäologische Kulturgüter
pref label: Tierhaut
  type: Label
  rank: preferred
pref label: animal skin
  type: Label
  rank: normal
narrower: Rohhaut
narrower: Pergament
narrower: Leder

Kollagenhaltiges Material
type: Concept
notation: BA652F
preferred label: collagenous material @en
created: 2026-01-30
issued: 2026-01-30
modified: 2026-02-04
publisher: Leibniz-Zentrum für Archäologie (LEIZA)
broader: Materialien tierischen Ursprungs
broader transitive: Material
broader transitive: [Untersuchungsergebnisse]
broader transitive: Zustandserfassung
broader transitive: Objektuntersuchung
broader transitive: organisches Material
broader transitive: Materialien tierischen Ursprungs
broader transitive: Materialbestimmung
definition: Kollagenhaltiges tierisches Material
in scheme: Konservierungs- und Restaurierungsfachthesaurus für archäologische Kulturgüter
pref label: Kollagenhaltiges Material
  type: Label
  rank: preferred
pref label: collagenous material
  type: Label
  rank: normal
narrower: Tierhaut
narrower: Tierfell

Materialien tierischen Ursprungs
type: Concept
notation: F2A45F
preferred label: animal material @en
created: 2026-01-30
issued: 2026-01-30
modified: 2026-02-04
publisher: Leibniz-Zentrum für Archäologie (LEIZA)
broader: organisches Material
broader transitive: Material
broader transitive: [Untersuchungsergebnisse]
broader transitive: Zustandserfassung
broader transitive: Objektuntersuchung
broader transitive: organisches Material
broader transitive: Materialbestimmung
definition: Überbegriff für organische Materialien die aus verschiedenen Teilen eines Tieres hergestellt werden.
in scheme: Konservierungs- und Restaurierungsfachthesaurus für archäologische Kulturgüter
pref label: Materialien tierischen Ursprungs
  type: Label
  rank: preferred
pref label: animal material
  type: Label
  rank: normal
narrower: Kollagenhaltiges Material
narrower: Fasern tierischen Ursprungs

Fasern tierischen Ursprungs
type: Concept
notation: AB4988
created: 2026-01-30
issued: 2026-01-30
modified: 2026-02-04
publisher: Leibniz-Zentrum für Archäologie (LEIZA)
alternative label: Tierfaser
alternative label: tierische Faser
broader: Materialien tierischen Ursprungs
broader transitive: Material
broader transitive: [Untersuchungsergebnisse]
broader transitive: Zustandserfassung
broader transitive: Objektuntersuchung
broader transitive: organisches Material
broader transitive: Materialien tierischen Ursprungs
broader transitive: Materialbestimmung
definition: Natürliche Fasern, die aus den Haarfollikeln oder den Sekreten von Tieren gewonnen werden und basierend auf ihren jeweiligen Eigenschaften im kulturellen Kontext für verschiedene Anwendungen wie z.B. Kleidung, Fäden oder Dekor verarbeitet wurden.
definition:
  literal form: Natürliche Fasern, die aus den Haarfollikeln oder den Sekreten von Tieren gewonnen werden und basierend auf ihren jeweiligen Eigenschaften im kulturellen Kontext für verschiedene Anwendungen wie z.B. Kleidung, Fäden oder Dekor verarbeitet wurden.
in scheme: Konservierungs- und Restaurierungsfachthesaurus für archäologische Kulturgüter
alt label: Tierfaser
  type: Label
  rank: preferred
alt label: tierische Faser
  type: Label
  rank: normal
pref label: Fasern tierischen Ursprungs
  type: Label
  rank: preferred
narrower: Haar
narrower: Feder
narrower: Seide

Pergament
type: Concept
notation: B9C731
preferred label: parchment @en
created: 2026-01-30
issued: 2026-01-30
modified: 2026-02-04
publisher: Leibniz-Zentrum für Archäologie (LEIZA)
broader: Tierhaut
broader transitive: Tierhaut
broader transitive: Material
broader transitive: Kollagenhaltiges Material
broader transitive: [Untersuchungsergebnisse]
broader transitive: Zustandserfassung
broader transitive: Objektuntersuchung
broader transitive: organisches Material
broader transitive: Materialien tierischen Ursprungs
broader transitive: Materialbestimmung
definition: Von Haaren befreite und unter Spannung getrocknete sehr dünne Tierhaut, die aus einem Geflecht von Collagenfasern besteht und in den meisten Fällen von Schaf, Kalb oder Ziege gewonnen wurde. Durch mehrere Verarbeitungsschritte wie Kalken, enthaaren, Schaben und das Trocknen unter Spannung entsteht ein nahezu durchsichtiges, festes Material, welches zum Schreiben, Buchbinden oder für andere Zwecke verwendet wird.
definition:
  literal form: Von Haaren befreite und unter Spannung getrocknete sehr dünne Tierhaut, die aus einem Geflecht von Collagenfasern besteht und in den meisten Fällen von Schaf, Kalb oder Ziege gewonnen wurde. Durch mehrere Verarbeitungsschritte wie Kalken, enthaaren, Schaben und das Trocknen unter Spannung entsteht ein nahezu durchsichtiges, festes Material, welches zum Schreiben, Buchbinden oder für andere Zwecke verwendet wird.
in scheme: Konservierungs- und Restaurierungsfachthesaurus für archäologische Kulturgüter
pref label: Pergament
  type: Label
  rank: preferred
pref label: parchment
  type: Label
  rank: normal

Tierfell
type: Concept
notation: GG2137
preferred label: fur @en
created: 2026-01-30
issued: 2026-01-30
modified: 2026-02-04
publisher: Leibniz-Zentrum für Archäologie (LEIZA)
alternative label: Fell
broader: Kollagenhaltiges Material
broader transitive: Material
broader transitive: [Untersuchungsergebnisse]
broader transitive: Zustandserfassung
broader transitive: Objektuntersuchung
broader transitive: organisches Material
broader transitive: Materialien tierischen Ursprungs
broader transitive: Materialbestimmung
broader transitive: Kollagenhaltiges Material
definition: organisches Material aus der vom Körper abgetrennten, mit dichten Haaren besetzten Haut von Säugetieren.
in scheme: Konservierungs- und Restaurierungsfachthesaurus für archäologische Kulturgüter
alt label: Fell
  type: Label
  rank: preferred
pref label: Tierfell
  type: Label
  rank: preferred
pref label: fur
  type: Label
  rank: normal

Leder
type: Concept
notation: D73F9B
preferred label: leather @en
created: 2026-01-30
issued: 2026-01-30
modified: 2026-02-04
publisher: Leibniz-Zentrum für Archäologie (LEIZA)
broader: Tierhaut
broader transitive: Tierhaut
broader transitive: Material
broader transitive: Kollagenhaltiges Material
broader transitive: [Untersuchungsergebnisse]
broader transitive: Zustandserfassung
broader transitive: Objektuntersuchung
broader transitive: organisches Material
broader transitive: Materialien tierischen Ursprungs
broader transitive: Materialbestimmung
definition: Durch chemische Bearbeitung (Gerbung) haltbar gemachte Tierhaut. In der Antike und im Mittelalter wurde Leder vor allem für Schuhe, Kleidung und Behältnisse verwendet.
in scheme: Konservierungs- und Restaurierungsfachthesaurus für archäologische Kulturgüter
pref label: Leder
  type: Label
  rank: preferred
pref label: leather
  type: Label
  rank: normal

Kaninchenhaar
type: Concept
notation: A9AC1A
created: 2026-01-30
issued: 2026-01-30
modified: 2026-02-04
publisher: Leibniz-Zentrum für Archäologie (LEIZA)
alternative label: Kaninchen
broader: Tierhaar
broader transitive: Tierhaar
broader transitive: Fasern tierischen Ursprungs
broader transitive: Material
broader transitive: [Untersuchungsergebnisse]
broader transitive: Zustandserfassung
broader transitive: Objektuntersuchung
broader transitive: organisches Material
broader transitive: Materialien tierischen Ursprungs
broader transitive: Haar
broader transitive: Materialbestimmung
definition: tierische Fasern aus den Haaren des Haus- oder Wildkaninchens
in scheme: Konservierungs- und Restaurierungsfachthesaurus für archäologische Kulturgüter
alt label: Kaninchen
  type: Label
  rank: preferred
pref label: Kaninchenhaar
  type: Label
  rank: preferred

Tierhaar
type: Concept
notation: F8DFCG
created: 2026-01-30
issued: 2026-01-30
modified: 2026-02-04
publisher: Leibniz-Zentrum für Archäologie (LEIZA)
alternative label: Fell
alternative label: tierisches Haar
broader: Haar
broader transitive: Fasern tierischen Ursprungs
broader transitive: Material
broader transitive: [Untersuchungsergebnisse]
broader transitive: Zustandserfassung
broader transitive: Objektuntersuchung
broader transitive: organisches Material
broader transitive: Materialien tierischen Ursprungs
broader transitive: Haar
broader transitive: Materialbestimmung
definition: natürliches Material aus dem Fell, Pelz oder der Behaarung von Tieren.
in scheme: Konservierungs- und Restaurierungsfachthesaurus für archäologische Kulturgüter
alt label: tierisches Haar
  type: Label
  rank: preferred
alt label: Fell
  type: Label
  rank: normal
pref label: Tierhaar
  type: Label
  rank: preferred
narrower: Kaninchenhaar
narrower: Mohairwolle
narrower: Kaschmirwolle
narrower: Schweineborsten
narrower: Alpakawolle
narrower: Ziegenhaar
narrower: Wolle
narrower: Pferdehaar
narrower: Wildschweinborsten

Haar
type: Concept
notation: G899F5
preferred label: hair @en
created: 2026-01-30
issued: 2026-01-30
modified: 2026-02-04
publisher: Leibniz-Zentrum für Archäologie (LEIZA)
broader: Fasern tierischen Ursprungs
broader transitive: Fasern tierischen Ursprungs
broader transitive: Material
broader transitive: [Untersuchungsergebnisse]
broader transitive: Zustandserfassung
broader transitive: Objektuntersuchung
broader transitive: organisches Material
broader transitive: Materialien tierischen Ursprungs
broader transitive: Materialbestimmung
definition: Natürliche, faserartige Gebilde aus Keratin, die aus der Haut von Säugetieren wachsen.
in scheme: Konservierungs- und Restaurierungsfachthesaurus für archäologische Kulturgüter
pref label: Haar
  type: Label
  rank: preferred
pref label: hair
  type: Label
  rank: normal
narrower: Tierhaar
narrower: Menschenhaar

Mohairwolle
type: Concept
notation: AA47GG
created: 2026-01-30
issued: 2026-01-30
modified: 2026-02-04
publisher: Leibniz-Zentrum für Archäologie (LEIZA)
alternative label: Mohair
broader: Tierhaar
broader transitive: Tierhaar
broader transitive: Fasern tierischen Ursprungs
broader transitive: Material
broader transitive: [Untersuchungsergebnisse]
broader transitive: Zustandserfassung
broader transitive: Objektuntersuchung
broader transitive: organisches Material
broader transitive: Materialien tierischen Ursprungs
broader transitive: Haar
broader transitive: Materialbestimmung
definition: tierische Fasern aus der Wolle/den Haaren der Angoraziege
in scheme: Konservierungs- und Restaurierungsfachthesaurus für archäologische Kulturgüter
alt label: Mohair
  type: Label
  rank: preferred
pref label: Mohairwolle
  type: Label
  rank: preferred

Menschenhaar
type: Concept
notation: AA992C
preferred label: human hair @en
created: 2026-01-30
issued: 2026-01-30
modified: 2026-02-04
publisher: Leibniz-Zentrum für Archäologie (LEIZA)
alternative label: menschliches Haar
broader: Haar
broader transitive: Fasern tierischen Ursprungs
broader transitive: Material
broader transitive: [Untersuchungsergebnisse]
broader transitive: Zustandserfassung
broader transitive: Objektuntersuchung
broader transitive: organisches Material
broader transitive: Materialien tierischen Ursprungs
broader transitive: Haar
broader transitive: Materialbestimmung
definition: natürliches Material aus den Haaren des menschlichen Kopfes.
in scheme: Konservierungs- und Restaurierungsfachthesaurus für archäologische Kulturgüter
alt label: menschliches Haar
  type: Label
  rank: preferred
pref label: Menschenhaar
  type: Label
  rank: preferred
pref label: human hair
  type: Label
  rank: normal

Feder
type: Concept
notation: B6443F
preferred label: feather @en
created: 2026-01-30
issued: 2026-01-30
modified: 2026-02-04
publisher: Leibniz-Zentrum für Archäologie (LEIZA)
broader: Fasern tierischen Ursprungs
broader transitive: Fasern tierischen Ursprungs
broader transitive: Material
broader transitive: [Untersuchungsergebnisse]
broader transitive: Zustandserfassung
broader transitive: Objektuntersuchung
broader transitive: organisches Material
broader transitive: Materialien tierischen Ursprungs
broader transitive: Materialbestimmung
definition: tierische, oft bunte Keratinstruktur, welche aus der Haut von Vögen gebildet wird und als Federkleid die äußerste Hauptbedeckung von Vögeln bildet.
in scheme: Konservierungs- und Restaurierungsfachthesaurus für archäologische Kulturgüter
pref label: Feder
  type: Label
  rank: preferred
pref label: feather
  type: Label
  rank: normal

Seide
type: Concept
notation: F6F797
created: 2026-01-30
issued: 2026-01-30
modified: 2026-02-04
publisher: Leibniz-Zentrum für Archäologie (LEIZA)
broader: Fasern tierischen Ursprungs
broader transitive: Fasern tierischen Ursprungs
broader transitive: Material
broader transitive: [Untersuchungsergebnisse]
broader transitive: Zustandserfassung
broader transitive: Objektuntersuchung
broader transitive: organisches Material
broader transitive: Materialien tierischen Ursprungs
broader transitive: Materialbestimmung
definition: feine, glänzende Naturfaser, die aus den Kokons von Seidenspinnern, wie dem domestizierten Bombyx mori, ausgeschieden und zu Geweben verarbeitet wird.
in scheme: Konservierungs- und Restaurierungsfachthesaurus für archäologische Kulturgüter
pref label: Seide
  type: Label
  rank: preferred
narrower: Tussahseide
narrower: Muschelseide

Kaschmirwolle
type: Concept
notation: B576DA
created: 2026-01-30
issued: 2026-01-30
modified: 2026-02-04
publisher: Leibniz-Zentrum für Archäologie (LEIZA)
alternative label: Kaschmir
broader: Tierhaar
broader transitive: Tierhaar
broader transitive: Fasern tierischen Ursprungs
broader transitive: Material
broader transitive: [Untersuchungsergebnisse]
broader transitive: Zustandserfassung
broader transitive: Objektuntersuchung
broader transitive: organisches Material
broader transitive: Materialien tierischen Ursprungs
broader transitive: Haar
broader transitive: Materialbestimmung
definition: tierische Fasern aus der Wolle/den Haaren der Kaschmirziege
in scheme: Konservierungs- und Restaurierungsfachthesaurus für archäologische Kulturgüter
alt label: Kaschmir
  type: Label
  rank: preferred
pref label: Kaschmirwolle
  type: Label
  rank: preferred

Schweineborsten
type: Concept
notation: BG71D3
created: 2026-01-30
issued: 2026-01-30
modified: 2026-02-04
publisher: Leibniz-Zentrum für Archäologie (LEIZA)
broader: Tierhaar
broader transitive: Fasern tierischen Ursprungs
broader transitive: Material
broader transitive: [Untersuchungsergebnisse]
broader transitive: Zustandserfassung
broader transitive: Objektuntersuchung
broader transitive: organisches Material
broader transitive: Materialien tierischen Ursprungs
broader transitive: Materialbestimmung
broader transitive: Tierhaar
broader transitive: Haar
definition: tierische Fasern aus den borstigen Haaren des Hausschweines
in scheme: Konservierungs- und Restaurierungsfachthesaurus für archäologische Kulturgüter
pref label: Schweineborsten
  type: Label
  rank: preferred

Alpakawolle
type: Concept
notation: CG49C6
created: 2026-01-30
issued: 2026-01-30
modified: 2026-02-04
publisher: Leibniz-Zentrum für Archäologie (LEIZA)
alternative label: Alpaka
broader: Tierhaar
broader transitive: Tierhaar
broader transitive: Fasern tierischen Ursprungs
broader transitive: Material
broader transitive: [Untersuchungsergebnisse]
broader transitive: Zustandserfassung
broader transitive: Objektuntersuchung
broader transitive: organisches Material
broader transitive: Materialien tierischen Ursprungs
broader transitive: Haar
broader transitive: Materialbestimmung
definition: tierische Fasern aus dem Wollhaar des Alpakas
in scheme: Konservierungs- und Restaurierungsfachthesaurus für archäologische Kulturgüter
alt label: Alpaka
  type: Label
  rank: preferred
pref label: Alpakawolle
  type: Label
  rank: preferred

Ziegenhaar
type: Concept
notation: D51GAA
created: 2026-01-30
issued: 2026-01-30
modified: 2026-02-04
publisher: Leibniz-Zentrum für Archäologie (LEIZA)
broader: Tierhaar
broader transitive: Fasern tierischen Ursprungs
broader transitive: Material
broader transitive: [Untersuchungsergebnisse]
broader transitive: Zustandserfassung
broader transitive: Objektuntersuchung
broader transitive: organisches Material
broader transitive: Materialien tierischen Ursprungs
broader transitive: Materialbestimmung
broader transitive: Tierhaar
broader transitive: Haar
definition: tierische Fasern aus den Haaren der Hausziege
in scheme: Konservierungs- und Restaurierungsfachthesaurus für archäologische Kulturgüter
pref label: Ziegenhaar
  type: Label
  rank: preferred

Wolle
type: Concept
notation: DF96G1
preferred label: wool @en
created: 2026-01-30
issued: 2026-01-30
modified: 2026-02-04
publisher: Leibniz-Zentrum für Archäologie (LEIZA)
broader: Tierhaar
broader transitive: Tierhaar
broader transitive: Fasern tierischen Ursprungs
broader transitive: Material
broader transitive: [Untersuchungsergebnisse]
broader transitive: Zustandserfassung
broader transitive: Objektuntersuchung
broader transitive: organisches Material
broader transitive: Materialien tierischen Ursprungs
broader transitive: Haar
broader transitive: Materialbestimmung
definition: tierische Faser (Stapelfaser) aus dem charakteristischen Haarkleid des Schafes. Die Bezeichnung Wolle wird im allgemeinem Sprachgebrauch auch für die Haare anderer Tierarten verwendet, allerdings sollte zur Differenzierung deren Namen hinzugefügt werden.
definition:
  literal form: tierische Faser (Stapelfaser) aus dem charakteristischen Haarkleid des Schafes. Die Bezeichnung Wolle wird im allgemeinem Sprachgebrauch auch für die Haare anderer Tierarten verwendet, allerdings sollte zur Differenzierung deren Namen hinzugefügt werden.
in scheme: Konservierungs- und Restaurierungsfachthesaurus für archäologische Kulturgüter
pref label: Wolle
  type: Label
  rank: preferred
pref label: wool
  type: Label
  rank: normal

Pferdehaar
type: Concept
notation: G43GG2
created: 2026-01-30
issued: 2026-01-30
modified: 2026-02-04
publisher: Leibniz-Zentrum für Archäologie (LEIZA)
broader: Tierhaar
broader transitive: Fasern tierischen Ursprungs
broader transitive: Material
broader transitive: [Untersuchungsergebnisse]
broader transitive: Zustandserfassung
broader transitive: Objektuntersuchung
broader transitive: organisches Material
broader transitive: Materialien tierischen Ursprungs
broader transitive: Materialbestimmung
broader transitive: Tierhaar
broader transitive: Haar
definition: tierische Fasern aus dem Fell, der Mähne oder dem Schweif des Pferdes
in scheme: Konservierungs- und Restaurierungsfachthesaurus für archäologische Kulturgüter
pref label: Pferdehaar
  type: Label
  rank: preferred
alternative label: Rosshaar
alt label: Rosshaar
  type: Label
  rank: preferred

Wildschweinborsten
type: Concept
notation: G593G4
created: 2026-01-30
issued: 2026-01-30
modified: 2026-02-04
publisher: Leibniz-Zentrum für Archäologie (LEIZA)
broader: Tierhaar
broader transitive: Fasern tierischen Ursprungs
broader transitive: Material
broader transitive: [Untersuchungsergebnisse]
broader transitive: Zustandserfassung
broader transitive: Objektuntersuchung
broader transitive: organisches Material
broader transitive: Materialien tierischen Ursprungs
broader transitive: Materialbestimmung
broader transitive: Tierhaar
broader transitive: Haar
definition: tierische Fasern aus den Haaren des Wildschweines, mit außergewöhnlich kräftigen und harten Erscheinungsform im Vergleich zu Haaren anderer Tierarten.
in scheme: Konservierungs- und Restaurierungsfachthesaurus für archäologische Kulturgüter
pref label: Wildschweinborsten
  type: Label
  rank: preferred

Samen
type: Concept
notation: G465BG
preferred label: seed @en
created: 2026-01-30
issued: 2026-01-30
modified: 2026-02-04
publisher: Leibniz-Zentrum für Archäologie (LEIZA)
broader: Materialien pflanzlichen Ursprungs
broader transitive: Material
broader transitive: [Untersuchungsergebnisse]
broader transitive: Zustandserfassung
broader transitive: Objektuntersuchung
broader transitive: organisches Material
broader transitive: Materialbestimmung
broader transitive: Materialien pflanzlichen Ursprungs
definition: organisches Material aus der für die Ausbreitung dienenden Gebewebestruktur von Pflanzen, bestehend aus Samenschale, Embryo und Nährgewebe.
in scheme: Konservierungs- und Restaurierungsfachthesaurus für archäologische Kulturgüter
pref label: Samen
  type: Label
  rank: preferred
pref label: seed
  type: Label
  rank: normal

Tussahseide
type: Concept
notation: G16647
created: 2026-01-30
issued: 2026-01-30
modified: 2026-02-04
publisher: Leibniz-Zentrum für Archäologie (LEIZA)
broader: Seide
broader transitive: Fasern tierischen Ursprungs
broader transitive: Material
broader transitive: [Untersuchungsergebnisse]
broader transitive: Zustandserfassung
broader transitive: Objektuntersuchung
broader transitive: organisches Material
broader transitive: Materialien tierischen Ursprungs
broader transitive: Materialbestimmung
broader transitive: Seide
definition: Seide, die aus den Kokons des Tussahspinners (Antheraea mit diversen Unterarten) hergestellt wird.
in scheme: Konservierungs- und Restaurierungsfachthesaurus für archäologische Kulturgüter
pref label: Tussahseide
  type: Label
  rank: preferred

Muschelseide
type: Concept
notation: G21F5B
created: 2026-01-30
issued: 2026-01-30
modified: 2026-02-04
publisher: Leibniz-Zentrum für Archäologie (LEIZA)
broader: Seide
broader transitive: Fasern tierischen Ursprungs
broader transitive: Material
broader transitive: [Untersuchungsergebnisse]
broader transitive: Zustandserfassung
broader transitive: Objektuntersuchung
broader transitive: organisches Material
broader transitive: Materialien tierischen Ursprungs
broader transitive: Materialbestimmung
broader transitive: Seide
definition: Seide, die durch das Sekret bestimmter Muscheln (Steckmuschel – Pinna nobilis) hergestellt wird..
in scheme: Konservierungs- und Restaurierungsfachthesaurus für archäologische Kulturgüter
pref label: Muschelseide
  type: Label
  rank: preferred

Süßwasserperle
type: Concept
notation: B41GC3
created: 2026-01-30
issued: 2026-01-30
modified: 2026-02-04
publisher: Leibniz-Zentrum für Archäologie (LEIZA)
broader: Perle
broader transitive: Biomineral
broader transitive: Material
broader transitive: [Untersuchungsergebnisse]
broader transitive: Zustandserfassung
broader transitive: Objektuntersuchung
broader transitive: silikatisches Material
broader transitive: Materialbestimmung
broader transitive: Perle
in scheme: Konservierungs- und Restaurierungsfachthesaurus für archäologische Kulturgüter
pref label: Süßwasserperle
  type: Label
  rank: preferred

Tierzahn
type: Concept
notation: C12BC3
created: 2026-01-30
issued: 2026-01-30
modified: 2026-02-04
publisher: Leibniz-Zentrum für Archäologie (LEIZA)
broader: Zahn
broader transitive: Material
broader transitive: [Untersuchungsergebnisse]
broader transitive: Zustandserfassung
broader transitive: Objektuntersuchung
broader transitive: silikatisches Material
broader transitive: Materialbestimmung
broader transitive: Biomineral
broader transitive: Zahn
definition: Zahn eines Tieres
in scheme: Konservierungs- und Restaurierungsfachthesaurus für archäologische Kulturgüter
pref label: Tierzahn
  type: Label
  rank: preferred

Menschenzahn
type: Concept
notation: DGC848
created: 2026-01-30
issued: 2026-01-30
modified: 2026-02-04
publisher: Leibniz-Zentrum für Archäologie (LEIZA)
broader: Zahn
broader transitive: Material
broader transitive: [Untersuchungsergebnisse]
broader transitive: Zustandserfassung
broader transitive: Objektuntersuchung
broader transitive: silikatisches Material
broader transitive: Materialbestimmung
broader transitive: Biomineral
broader transitive: Zahn
definition: Zahn eines menschlichen Individums
in scheme: Konservierungs- und Restaurierungsfachthesaurus für archäologische Kulturgüter
pref label: Menschenzahn
  type: Label
  rank: preferred

Flachs
type: Concept
notation: BC685F
created: 2026-01-30
issued: 2026-01-30
modified: 2026-02-04
publisher: Leibniz-Zentrum für Archäologie (LEIZA)
broader: pflanzliche Fasern
broader transitive: Material
broader transitive: [Untersuchungsergebnisse]
broader transitive: Zustandserfassung
broader transitive: Objektuntersuchung
broader transitive: Materialbestimmung
broader transitive: pflanzliche Fasern
broader transitive: organisches Material
broader transitive: Materialien pflanzlichen Ursprungs
in scheme: Konservierungs- und Restaurierungsfachthesaurus für archäologische Kulturgüter
pref label: Flachs
  type: Label
  rank: preferred
definition: natürliche Stengelfaser, die aus der Leinpflanze (Linum usitatissimum) durch verschiedene Bearbeitungsschritte gewonnen wird.
narrower: Leinen

Leinen
type: Concept
notation: GB5A92
created: 2026-01-30
issued: 2026-01-30
modified: 2026-02-04
publisher: Leibniz-Zentrum für Archäologie (LEIZA)
broader: Flachs
broader transitive: Material
broader transitive: [Untersuchungsergebnisse]
broader transitive: Zustandserfassung
broader transitive: Objektuntersuchung
broader transitive: Materialbestimmung
broader transitive: Flachs
broader transitive: pflanzliche Fasern
broader transitive: organisches Material
broader transitive: Materialien pflanzlichen Ursprungs
in scheme: Konservierungs- und Restaurierungsfachthesaurus für archäologische Kulturgüter
pref label: Leinen
  type: Label
  rank: preferred
definition: Materialbezeichnung für Garn- und Stoffprodukte bestehend aus Flachsfasern.

Salzwasserperle
type: Concept
notation: FB8DCB
created: 2026-01-30
issued: 2026-01-30
modified: 2026-02-04
publisher: Leibniz-Zentrum für Archäologie (LEIZA)
broader: Perle
broader transitive: Biomineral
broader transitive: Material
broader transitive: [Untersuchungsergebnisse]
broader transitive: Zustandserfassung
broader transitive: Objektuntersuchung
broader transitive: silikatisches Material
broader transitive: Materialbestimmung
broader transitive: Perle
in scheme: Konservierungs- und Restaurierungsfachthesaurus für archäologische Kulturgüter
pref label: Salzwasserperle
  type: Label
  rank: preferred

Amethyst
type: Concept
notation: A2C56B
created: 2026-01-30
issued: 2026-01-30
modified: 2026-02-04
publisher: Leibniz-Zentrum für Archäologie (LEIZA)
broader: Quarz
broader transitive: Quarz
broader transitive: Material
broader transitive: [Untersuchungsergebnisse]
broader transitive: Mineral
broader transitive: Zustandserfassung
broader transitive: Objektuntersuchung
broader transitive: silikatisches Material
broader transitive: Materialbestimmung
definition: violette Varietät des Quarz. Die Farbigkeit reicht von blasslila bis tiefviolett, je nach Menge der enthaltenen Eisenverunreinigungen und Einwirkung natürlicher Strahlung. Bei Erhitzung verliert er seine Farbe und wird gelblich-braun, was wiederum als Quarz Varietät "Citrin" zählt. Dem Amethyst werden oft spirituelle und heilende Eigenschaften zugeschrieben und er wurde bereits seit der Antike für Schmuck verwendet.
definition:
  literal form: violette Varietät des Quarz. Die Farbigkeit reicht von blasslila bis tiefviolett, je nach Menge der enthaltenen Eisenverunreinigungen und Einwirkung natürlicher Strahlung. Bei Erhitzung verliert er seine Farbe und wird gelblich-braun, was wiederum als Quarz Varietät "Citrin" zählt. Dem Amethyst werden oft spirituelle und heilende Eigenschaften zugeschrieben und er wurde bereits seit der Antike für Schmuck verwendet.
in scheme: Konservierungs- und Restaurierungsfachthesaurus für archäologische Kulturgüter
pref label: Amethyst
  type: Label
  rank: preferred

Quarz
type: Concept
notation: C84834
created: 2026-01-30
issued: 2026-01-30
modified: 2026-02-04
publisher: Leibniz-Zentrum für Archäologie (LEIZA)
broader: Mineral
broader transitive: Material
broader transitive: [Untersuchungsergebnisse]
broader transitive: Mineral
broader transitive: Zustandserfassung
broader transitive: Objektuntersuchung
broader transitive: silikatisches Material
broader transitive: Materialbestimmung
definition: weit verbreitetes Mineral aus reinem SiO2, welches in vielen Gesteinsarten vorkommt. Quarz ist grundsätzlich farblos - weiß, tritt jedoch je nach Verunreinigungen/Einlagerungen auch in vielerlei Farben auf (weiß, gelb, violett, braun, schwarz, grün, blau, rosa, etc.) und zeigt in der Regel einen glasigen, matten Glanz. Quarz ist bekannt für seine Härte (Mohshärte 7) und Widerstandsfähigkeit gegenüber Verwitterung.
definition:
  literal form: weit verbreitetes Mineral aus reinem SiO2, welches in vielen Gesteinsarten vorkommt. Quarz ist grundsätzlich farblos - weiß, tritt jedoch je nach Verunreinigungen/Einlagerungen auch in vielerlei Farben auf (weiß, gelb, violett, braun, schwarz, grün, blau, rosa, etc.) und zeigt in der Regel einen glasigen, matten Glanz. Quarz ist bekannt für seine Härte (Mohshärte 7) und Widerstandsfähigkeit gegenüber Verwitterung.
in scheme: Konservierungs- und Restaurierungsfachthesaurus für archäologische Kulturgüter
pref label: Quarz
  type: Label
  rank: preferred
narrower: Amethyst
narrower: Bergkristall
narrower: Calcedon

Lapislazuli
type: Concept
notation: A42FG3
created: 2026-01-30
issued: 2026-01-30
modified: 2026-02-04
publisher: Leibniz-Zentrum für Archäologie (LEIZA)
broader: Mineral
broader transitive: Mineral
broader transitive: Material
broader transitive: [Untersuchungsergebnisse]
broader transitive: Zustandserfassung
broader transitive: Objektuntersuchung
broader transitive: silikatisches Material
broader transitive: Materialbestimmung
definition: Mineralgemisch aus primär Calcit, Lasurit, Diopsid und anderen Beimengungen, mit mittlerer Härte (Mohs-Härte 5 - 6). Lapislazuli zeichnet sich durch seine tiefblaue bis azurblaue Farbe aus, oft mit goldenen Pyriteinschlüssen, die ihm ein einzigartiges Erscheinungsbild verleihen. Seit Jahrtausenden wird Lapislazuli als Schmuckstein, in Kunstgegenständen und als Pigment („Ultramarin“) verwendet, insbesondere in Kulturen wie der altägyptischen, mesopotamischen und mittelalterlichen europäischen Kunst.
definition:
  literal form: Mineralgemisch aus primär Calcit, Lasurit, Diopsid und anderen Beimengungen, mit mittlerer Härte (Mohs-Härte 5 - 6). Lapislazuli zeichnet sich durch seine tiefblaue bis azurblaue Farbe aus, oft mit goldenen Pyriteinschlüssen, die ihm ein einzigartiges Erscheinungsbild verleihen. Seit Jahrtausenden wird Lapislazuli als Schmuckstein, in Kunstgegenständen und als Pigment („Ultramarin“) verwendet, insbesondere in Kulturen wie der altägyptischen, mesopotamischen und mittelalterlichen europäischen Kunst.
in scheme: Konservierungs- und Restaurierungsfachthesaurus für archäologische Kulturgüter
pref label: Lapislazuli
  type: Label
  rank: preferred

Korund
type: Concept
notation: AD3B58
created: 2026-01-30
issued: 2026-01-30
modified: 2026-02-04
publisher: Leibniz-Zentrum für Archäologie (LEIZA)
broader: Mineral
broader transitive: Material
broader transitive: [Untersuchungsergebnisse]
broader transitive: Mineral
broader transitive: Zustandserfassung
broader transitive: Objektuntersuchung
broader transitive: silikatisches Material
broader transitive: Materialbestimmung
definition: sehr hartes Mineral aus Aluminiumoxid, welches je nach enthaltenen Spurenelementen in ganz unterschiedlichen Farben auftreten kann. Die bekanntesten Varietäten sind Rubin und Saphir. Korund ist nach Diamant das zweithärteste, natürlich vorkommende Material mit einer Mohshärte von 9. Korund weist eine hohe Dichte, einen glasartigen Glanz sowie einen muscheligen Bruch auf.
definition:
  literal form: sehr hartes Mineral aus Aluminiumoxid, welches je nach enthaltenen Spurenelementen in ganz unterschiedlichen Farben auftreten kann. Die bekanntesten Varietäten sind Rubin und Saphir. Korund ist nach Diamant das zweithärteste, natürlich vorkommende Material mit einer Mohshärte von 9. Korund weist eine hohe Dichte, einen glasartigen Glanz sowie einen muscheligen Bruch auf.
in scheme: Konservierungs- und Restaurierungsfachthesaurus für archäologische Kulturgüter
pref label: Korund
  type: Label
  rank: preferred
narrower: Saphir
narrower: Rubin

modernes Elfenbein
type: Concept
notation: FF744D
created: 2026-01-30
issued: 2026-01-30
modified: 2026-02-04
publisher: Leibniz-Zentrum für Archäologie (LEIZA)
broader: Elfenbein
broader transitive: Material
broader transitive: [Untersuchungsergebnisse]
broader transitive: Zustandserfassung
broader transitive: Objektuntersuchung
broader transitive: silikatisches Material
broader transitive: Materialbestimmung
broader transitive: Elfenbein
broader transitive: Bein
broader transitive: Biomineral
definition: Elfenbein, das aus der Gegenwart bzw. von kürzlich verstorbenen Tieren wie Elefanten oder Walrossen gewonnen wurde. Aufgrund von Naturschutzgesetzen und internationalen Abkommen wie dem Washingtoner Artenschutzübereinkommen (CITES) ist der Handel mit solchem Elfenbein stark eingeschränkt und verboten.
definition:
  literal form: Elfenbein, das aus der Gegenwart bzw. von kürzlich verstorbenen Tieren wie Elefanten oder Walrossen gewonnen wurde. Aufgrund von Naturschutzgesetzen und internationalen Abkommen wie dem Washingtoner Artenschutzübereinkommen (CITES) ist der Handel mit solchem Elfenbein stark eingeschränkt und verboten.
in scheme: Konservierungs- und Restaurierungsfachthesaurus für archäologische Kulturgüter
pref label: modernes Elfenbein
  type: Label
  rank: preferred
alternative label: frisches Elfenbein
alt label: frisches Elfenbein
  type: Label
  rank: preferred

fossiles Elfenbein
type: Concept
notation: G56716
created: 2026-01-30
issued: 2026-01-30
modified: 2026-02-04
publisher: Leibniz-Zentrum für Archäologie (LEIZA)
broader: Elfenbein
broader transitive: Material
broader transitive: [Untersuchungsergebnisse]
broader transitive: Zustandserfassung
broader transitive: Objektuntersuchung
broader transitive: silikatisches Material
broader transitive: Materialbestimmung
broader transitive: Elfenbein
broader transitive: Bein
broader transitive: Biomineral
definition: Elfenbein von Tieren, die vor Tausenden von Jahren gestorben sind und durch natürliche Prozesse konserviert wurden. Der Handel mit fossilem Elfenbein fällt meist nicht unter internationale Artenschutzgesetze, da es keine direkten Auswirkungen auf heutige Tierpolpulationen hat.
definition:
  literal form: Elfenbein von Tieren, die vor Tausenden von Jahren gestorben sind und durch natürliche Prozesse konserviert wurden. Der Handel mit fossilem Elfenbein fällt meist nicht unter internationale Artenschutzgesetze, da es keine direkten Auswirkungen auf heutige Tierpolpulationen hat.
in scheme: Konservierungs- und Restaurierungsfachthesaurus für archäologische Kulturgüter
pref label: fossiles Elfenbein
  type: Label
  rank: preferred
alternative label: historisches Elfenbein
alt label: historisches Elfenbein
  type: Label
  rank: preferred

Malachit
type: Concept
notation: B452DG
created: 2026-01-30
issued: 2026-01-30
modified: 2026-02-04
publisher: Leibniz-Zentrum für Archäologie (LEIZA)
broader: Mineral
broader transitive: Material
broader transitive: [Untersuchungsergebnisse]
broader transitive: Mineral
broader transitive: Zustandserfassung
broader transitive: Objektuntersuchung
broader transitive: silikatisches Material
broader transitive: Materialbestimmung
definition: sekundäres Kupfermineral mit der chemischen Zusammensetzung Cu2CO3(OH)2. Es gehört zur Gruppe der Carbonate mit Hydroxidionen und entsteht häufig als Verwitterungsprodukt von Kupfererzen in der Oxidationszone. Typisch für Malachit ist seine intensive grüne Farbe, die von hellgrün bis dunkelgrün variieren kann, sowie seine oft konzentrisch gebänderte oder massige Struktur. Es hat eine Mohs-Härte von 3,5–4 und wird seit der Antike für Schmuck, Dekoration und Pigmente verwendet.
definition:
  literal form: sekundäres Kupfermineral mit der chemischen Zusammensetzung Cu2CO3(OH)2. Es gehört zur Gruppe der Carbonate mit Hydroxidionen und entsteht häufig als Verwitterungsprodukt von Kupfererzen in der Oxidationszone. Typisch für Malachit ist seine intensive grüne Farbe, die von hellgrün bis dunkelgrün variieren kann, sowie seine oft konzentrisch gebänderte oder massige Struktur. Es hat eine Mohs-Härte von 3,5–4 und wird seit der Antike für Schmuck, Dekoration und Pigmente verwendet.
in scheme: Konservierungs- und Restaurierungsfachthesaurus für archäologische Kulturgüter
pref label: Malachit
  type: Label
  rank: preferred

Achat
type: Concept
notation: B97F4A
preferred label: agate @en
created: 2026-01-30
issued: 2026-01-30
modified: 2026-02-04
publisher: Leibniz-Zentrum für Archäologie (LEIZA)
broader: Calcedon
broader transitive: Material
broader transitive: [Untersuchungsergebnisse]
broader transitive: Mineral
broader transitive: Zustandserfassung
broader transitive: Objektuntersuchung
broader transitive: silikatisches Material
broader transitive: Materialbestimmung
broader transitive: Calcedon
broader transitive: Quarz
definition: gebändert oder geschichtete Calcedon-Varietät, die je nach Einlagerungen in vielen verschiedenen Farben auftreten kann. Häufig finden sich Verunreinigungen in Form von Eisen, Mangan, Chrom, Calcium u.a., die den Achat in plakativ natürlichen Tönen färben. Achat ist hauptsächlich in vulkanischen Gesteinen, aber auch in Sedimentgestein zu finden.
definition:
  literal form: gebändert oder geschichtete Calcedon-Varietät, die je nach Einlagerungen in vielen verschiedenen Farben auftreten kann. Häufig finden sich Verunreinigungen in Form von Eisen, Mangan, Chrom, Calcium u.a., die den Achat in plakativ natürlichen Tönen färben. Achat ist hauptsächlich in vulkanischen Gesteinen, aber auch in Sedimentgestein zu finden.
in scheme: Konservierungs- und Restaurierungsfachthesaurus für archäologische Kulturgüter
pref label: Achat
  type: Label
  rank: preferred
pref label: agate
  type: Label
  rank: normal

Bergkristall
type: Concept
notation: B9A8BF
preferred label: rock crystal @en
created: 2026-01-30
issued: 2026-01-30
modified: 2026-02-04
publisher: Leibniz-Zentrum für Archäologie (LEIZA)
broader: Quarz
broader transitive: Material
broader transitive: [Untersuchungsergebnisse]
broader transitive: Mineral
broader transitive: Zustandserfassung
broader transitive: Objektuntersuchung
broader transitive: silikatisches Material
broader transitive: Materialbestimmung
broader transitive: Quarz
definition: transparente, farblose Varietät des reinen Quarz mit einer Mohs´schen Härte von 7. Charateristisch ist sein glasartiger Glanz, eine hohe Reinheit und eine ausgezeichnete Lichtdurchlässigkeit. Er bricht muschelig und zeigt keine Fluoreszenz unter UV-Licht.
definition:
  literal form: transparente, farblose Varietät des reinen Quarz mit einer Mohs´schen Härte von 7. Charateristisch ist sein glasartiger Glanz, eine hohe Reinheit und eine ausgezeichnete Lichtdurchlässigkeit. Er bricht muschelig und zeigt keine Fluoreszenz unter UV-Licht.
in scheme: Konservierungs- und Restaurierungsfachthesaurus für archäologische Kulturgüter
pref label: Bergkristall
  type: Label
  rank: preferred
pref label: rock crystal
  type: Label
  rank: normal
alternative label: alaska diamond @en
alt label: alaska diamond
  type: Label
  rank: preferred

Karneol
type: Concept
notation: BBA96A
preferred label: carnelian @en
created: 2026-01-30
issued: 2026-01-30
modified: 2026-02-04
publisher: Leibniz-Zentrum für Archäologie (LEIZA)
broader: Calcedon
broader transitive: Material
broader transitive: [Untersuchungsergebnisse]
broader transitive: Mineral
broader transitive: Zustandserfassung
broader transitive: Objektuntersuchung
broader transitive: silikatisches Material
broader transitive: Materialbestimmung
broader transitive: Calcedon
broader transitive: Quarz
definition: rötlich-orange bis braunrote Varietät des Calcedons, deren Farbe durch Eisenoxid verursacht wird.
in scheme: Konservierungs- und Restaurierungsfachthesaurus für archäologische Kulturgüter
pref label: Karneol
  type: Label
  rank: preferred
pref label: carnelian
  type: Label
  rank: normal

Feldspat
type: Concept
notation: CGGB4G
created: 2026-01-30
issued: 2026-01-30
modified: 2026-02-04
publisher: Leibniz-Zentrum für Archäologie (LEIZA)
broader: Mineral
broader transitive: Material
broader transitive: [Untersuchungsergebnisse]
broader transitive: Mineral
broader transitive: Zustandserfassung
broader transitive: Objektuntersuchung
broader transitive: silikatisches Material
broader transitive: Materialbestimmung
definition: eine der häufigsten gesteinsbildenden Mineralgruppe der Erdkruste, bestehend aus Alumosilikaten und unterschiedlichen Anteilen von Kalium, Natrium, Calcium und Barium. Die Farbigkeit reicht von weiß, grau bis rötlich, gelblich oder grünlich, je nach Zusammensetzung und Einschlüssen. Feldspatvertreter zeigen einen Glas- bis Perlmuttglanz auf den Spaltflächen, eine Mohshärte von 6 und rot bis violett-blaue Lumineszenz unter UV-Licht.
definition:
  literal form: eine der häufigsten gesteinsbildenden Mineralgruppe der Erdkruste, bestehend aus Alumosilikaten und unterschiedlichen Anteilen von Kalium, Natrium, Calcium und Barium. Die Farbigkeit reicht von weiß, grau bis rötlich, gelblich oder grünlich, je nach Zusammensetzung und Einschlüssen. Feldspatvertreter zeigen einen Glas- bis Perlmuttglanz auf den Spaltflächen, eine Mohshärte von 6 und rot bis violett-blaue Lumineszenz unter UV-Licht.
in scheme: Konservierungs- und Restaurierungsfachthesaurus für archäologische Kulturgüter
pref label: Feldspat
  type: Label
  rank: preferred

Dolomit (Mineral)
type: Concept
notation: D1788D
created: 2026-01-30
issued: 2026-01-30
modified: 2026-02-04
publisher: Leibniz-Zentrum für Archäologie (LEIZA)
broader: Mineral
broader transitive: Material
broader transitive: [Untersuchungsergebnisse]
broader transitive: Mineral
broader transitive: Zustandserfassung
broader transitive: Objektuntersuchung
broader transitive: silikatisches Material
broader transitive: Materialbestimmung
definition: karbonatisches Mineral, das hauptsächlich aus Kalzium-Magnesium-Carbonat besteht. Es zeigt in der Regel eine weiß bis gräuliche Farbe, durch Verunreinigungen treten auch Färbungen von rötlich, braun, grau oder schwarz auf. Darüber hinaus zeigt das Mineral einen glas- bis perlmuttartigen Glanz und tritt sowohl durchscheinend als auch opak auf.
definition:
  literal form: karbonatisches Mineral, das hauptsächlich aus Kalzium-Magnesium-Carbonat besteht. Es zeigt in der Regel eine weiß bis gräuliche Farbe, durch Verunreinigungen treten auch Färbungen von rötlich, braun, grau oder schwarz auf. Darüber hinaus zeigt das Mineral einen glas- bis perlmuttartigen Glanz und tritt sowohl durchscheinend als auch opak auf.
in scheme: Konservierungs- und Restaurierungsfachthesaurus für archäologische Kulturgüter
pref label: Dolomit (Mineral)
  type: Label
  rank: preferred

Granat
type: Concept
notation: D74F9D
created: 2026-01-30
issued: 2026-01-30
modified: 2026-02-04
publisher: Leibniz-Zentrum für Archäologie (LEIZA)
broader: Mineral
broader transitive: Mineral
broader transitive: Material
broader transitive: [Untersuchungsergebnisse]
broader transitive: Zustandserfassung
broader transitive: Objektuntersuchung
broader transitive: silikatisches Material
broader transitive: Materialbestimmung
definition: Gruppe von Silikatmineralen mit unterschiedlicher chemischer Zusammensetzung aus zweiwertigen Ionen, wie Ca, Mg, Fe, Mn und dreiwertigen, wie Al, Fe3+ oder Cr. Je nach Kombination ergeben sich verschiedene Varietäten, mit eigenen Trivialnamen, sowie Mischkristalle zwischen diesen. Granate kommen häufig als Nebengemengeteil in metamorphosen Gesteinen vor, zum Beispiel in Glimmerschiefer, Hornblenscheifer, Peridotit und Serpentinit.
definition:
  literal form: Gruppe von Silikatmineralen mit unterschiedlicher chemischer Zusammensetzung aus zweiwertigen Ionen, wie Ca, Mg, Fe, Mn und dreiwertigen, wie Al, Fe3+ oder Cr. Je nach Kombination ergeben sich verschiedene Varietäten, mit eigenen Trivialnamen, sowie Mischkristalle zwischen diesen. Granate kommen häufig als Nebengemengeteil in metamorphosen Gesteinen vor, zum Beispiel in Glimmerschiefer, Hornblenscheifer, Peridotit und Serpentinit.
in scheme: Konservierungs- und Restaurierungsfachthesaurus für archäologische Kulturgüter
pref label: Granat
  type: Label
  rank: preferred
narrower: Almandin

Gips (Mineral)
type: Concept
notation: D8B5C3
created: 2026-01-30
issued: 2026-01-30
modified: 2026-02-04
publisher: Leibniz-Zentrum für Archäologie (LEIZA)
broader: Mineral
broader transitive: Material
broader transitive: [Untersuchungsergebnisse]
broader transitive: Mineral
broader transitive: Zustandserfassung
broader transitive: Objektuntersuchung
broader transitive: silikatisches Material
broader transitive: Materialbestimmung
definition: weiches Mineral aus wasserhaltigem Kalziumsulfat. Es ist in der Regel farblos bis weiß, durch enthaltene Verunreinigungen können jedoch auch grau, gelb, rötliche bis braun, schwarze Färbungen auftreten. Gips zeigt eine äußerst geringe Härte, sodass er bereits mit dem Fingernagel geritzt werden kann. Gips kommt als Mineral häufig in Sedimentgesteinen oder auch in Seeablagerungen oder Tonen vor, darüber hinaus tritt er als Eindampfungsprodukt auch in reiner Form (Gips-Gestein) auf.
definition:
  literal form: weiches Mineral aus wasserhaltigem Kalziumsulfat. Es ist in der Regel farblos bis weiß, durch enthaltene Verunreinigungen können jedoch auch grau, gelb, rötliche bis braun, schwarze Färbungen auftreten. Gips zeigt eine äußerst geringe Härte, sodass er bereits mit dem Fingernagel geritzt werden kann. Gips kommt als Mineral häufig in Sedimentgesteinen oder auch in Seeablagerungen oder Tonen vor, darüber hinaus tritt er als Eindampfungsprodukt auch in reiner Form (Gips-Gestein) auf.
in scheme: Konservierungs- und Restaurierungsfachthesaurus für archäologische Kulturgüter
pref label: Gips (Mineral)
  type: Label
  rank: preferred
alternative label: Selenite
narrower: Alabaster
alt label: Selenite
  type: Label
  rank: preferred

Jadeit
type: Concept
notation: F68381
created: 2026-01-30
issued: 2026-01-30
modified: 2026-02-04
publisher: Leibniz-Zentrum für Archäologie (LEIZA)
broader: Mineral
broader transitive: Material
broader transitive: [Untersuchungsergebnisse]
broader transitive: Mineral
broader transitive: Zustandserfassung
broader transitive: Objektuntersuchung
broader transitive: silikatisches Material
broader transitive: Materialbestimmung
definition: natrium- und aluminiumreiches Mineral aus der Pyroxengruppe mit oft grün, weiß, gelblich oder violetter Färbung. Jadeit bildet dichte, feinkörnige Aggregate, die außergewöhnlich hart und zäh sind (Härte 6,5 - 7 auf der Mohs-Skala). Jadeit ist ein wichtiger Bestandteil des metamorphosen Gesteins Jade, einem Sammelbegriff, der auch Nephrit umfasst. Aufgrund seiner Härte und Ästhetik wurde Jadeit historisch für Schmuck und Werkzeuge verwendet und besitzt große kulturelle Bedeutung, insbesondere in ostasiatischen und mesoamerikanischen Kulturen.
definition:
  literal form: natrium- und aluminiumreiches Mineral aus der Pyroxengruppe mit oft grün, weiß, gelblich oder violetter Färbung. Jadeit bildet dichte, feinkörnige Aggregate, die außergewöhnlich hart und zäh sind (Härte 6,5 - 7 auf der Mohs-Skala). Jadeit ist ein wichtiger Bestandteil des metamorphosen Gesteins Jade, einem Sammelbegriff, der auch Nephrit umfasst. Aufgrund seiner Härte und Ästhetik wurde Jadeit historisch für Schmuck und Werkzeuge verwendet und besitzt große kulturelle Bedeutung, insbesondere in ostasiatischen und mesoamerikanischen Kulturen.
in scheme: Konservierungs- und Restaurierungsfachthesaurus für archäologische Kulturgüter
pref label: Jadeit
  type: Label
  rank: preferred
alternative label: Chloromelanit
alternative label: Jade
alt label: Chloromelanit
  type: Label
  rank: preferred
alt label: Jade
  type: Label
  rank: normal

Beryll
type: Concept
notation: F75BDB
created: 2026-01-30
issued: 2026-01-30
modified: 2026-02-04
publisher: Leibniz-Zentrum für Archäologie (LEIZA)
broader: Mineral
broader transitive: Material
broader transitive: [Untersuchungsergebnisse]
broader transitive: Mineral
broader transitive: Zustandserfassung
broader transitive: Objektuntersuchung
broader transitive: silikatisches Material
broader transitive: Materialbestimmung
definition: Mineral aus der Gruppe der Ringsilikate bestehend aus Beryllium-Aluminium-Silikat. Er zeichnet sich durch eine Härte von 7,5 . 8 auf der Mohs-Skala aus und tritt in reiner Form meist farblos transparent bis durchscheinend auf. Durch enthaltene Spurenelemente bildet der Beryll eine Reihe verschieden farbiger Varietäten, die aufgrund ihrers glasartigen Glanzes und der ästhetischen Farbgebung als Schmucksteine sehr geschätzt werden.
definition:
  literal form: Mineral aus der Gruppe der Ringsilikate bestehend aus Beryllium-Aluminium-Silikat. Er zeichnet sich durch eine Härte von 7,5 . 8 auf der Mohs-Skala aus und tritt in reiner Form meist farblos transparent bis durchscheinend auf. Durch enthaltene Spurenelemente bildet der Beryll eine Reihe verschieden farbiger Varietäten, die aufgrund ihrers glasartigen Glanzes und der ästhetischen Farbgebung als Schmucksteine sehr geschätzt werden.
in scheme: Konservierungs- und Restaurierungsfachthesaurus für archäologische Kulturgüter
pref label: Beryll
  type: Label
  rank: preferred
narrower: Smaragd
narrower: Aquamarin
narrower: Morganit

Tonminerale
type: Concept
notation: F9GC9A
created: 2026-01-30
issued: 2026-01-30
modified: 2026-02-04
publisher: Leibniz-Zentrum für Archäologie (LEIZA)
broader: Mineral
broader transitive: Mineral
broader transitive: Material
broader transitive: [Untersuchungsergebnisse]
broader transitive: Zustandserfassung
broader transitive: Objektuntersuchung
broader transitive: silikatisches Material
broader transitive: Materialbestimmung
definition: Gruppe von Mineralen, die hauptsächlich aus Aluminium-Silikaten, mit vereinzelten weiteren Bestandteilen, wie Eisen, Magnesium oder Kalium, bestehen. Sie bilden dichte, bröckelige oder mehlige Massen und fühlen sich zwischen den Fingern zerrieben seifig, fettig an. Typische Merkmale der Tonminerale sind die plättchenartige Struktur mit blättriger Kristallform, sowie ein charakteristisch erdiger Geruch im feuchten Zustand. Wie der Name bereits vermuten lässten, bilden diese Mineral die Hauptbestandteil von Tonen.
definition:
  literal form: Gruppe von Mineralen, die hauptsächlich aus Aluminium-Silikaten, mit vereinzelten weiteren Bestandteilen, wie Eisen, Magnesium oder Kalium, bestehen. Sie bilden dichte, bröckelige oder mehlige Massen und fühlen sich zwischen den Fingern zerrieben seifig, fettig an. Typische Merkmale der Tonminerale sind die plättchenartige Struktur mit blättriger Kristallform, sowie ein charakteristisch erdiger Geruch im feuchten Zustand. Wie der Name bereits vermuten lässten, bilden diese Mineral die Hauptbestandteil von Tonen.
in scheme: Konservierungs- und Restaurierungsfachthesaurus für archäologische Kulturgüter
pref label: Tonminerale
  type: Label
  rank: preferred
narrower: Kaolinit
narrower: Illit

Amphibol
type: Concept
notation: FA5484
created: 2026-01-30
issued: 2026-01-30
modified: 2026-02-04
publisher: Leibniz-Zentrum für Archäologie (LEIZA)
broader: Mineral
broader transitive: Material
broader transitive: [Untersuchungsergebnisse]
broader transitive: Mineral
broader transitive: Zustandserfassung
broader transitive: Objektuntersuchung
broader transitive: silikatisches Material
broader transitive: Materialbestimmung
definition: Gruppe von Eisen-Magnesium-Silikatmineralen mit mittlerer Härte. Die Färbung ist meit dunkel, von grün bis schwarzer Farbe. Die Färbung hängt dabei vor allem vom Eisen-Gehalt der Mineralie ab. Die Spaltflächen der Amphibole zeigen sich oft mit einem Glas- oder Perlmuttglanz, während die nadeligen, faserartigen Formen von einem seidigen Glanz sind. Amphibole kommen in vielen magmatischen und metamorphosen Gesteinen vor, wie z. B in Graniten, Dioriten und vor allem in den Amphiobioliten.
definition:
  literal form: Gruppe von Eisen-Magnesium-Silikatmineralen mit mittlerer Härte. Die Färbung ist meit dunkel, von grün bis schwarzer Farbe. Die Färbung hängt dabei vor allem vom Eisen-Gehalt der Mineralie ab. Die Spaltflächen der Amphibole zeigen sich oft mit einem Glas- oder Perlmuttglanz, während die nadeligen, faserartigen Formen von einem seidigen Glanz sind. Amphibole kommen in vielen magmatischen und metamorphosen Gesteinen vor, wie z. B in Graniten, Dioriten und vor allem in den Amphiobioliten.
in scheme: Konservierungs- und Restaurierungsfachthesaurus für archäologische Kulturgüter
pref label: Amphibol
  type: Label
  rank: preferred
narrower: Hornblende

Fluorit
type: Concept
notation: FD27A8
created: 2026-01-30
issued: 2026-01-30
modified: 2026-02-04
publisher: Leibniz-Zentrum für Archäologie (LEIZA)
broader: Mineral
broader transitive: Material
broader transitive: [Untersuchungsergebnisse]
broader transitive: Mineral
broader transitive: Zustandserfassung
broader transitive: Objektuntersuchung
broader transitive: silikatisches Material
broader transitive: Materialbestimmung
definition: Mineral aus der Gruppe der Halogeniden, bestehend aus Calciumfluorit und anderen Beimengungen. Fluorit tritt in einer großen Farbvielfalt auf, von reiner farblos-durchsichtigen bis violett, rosa, grün, blau oder gelben Färbungen. Fluorit ist ein relativ weiches Mineral, mit der Mohshärte 4 und ist durch seine vollkommene, oktaedrische Spaltbarkeit sowie seine markante Fluoreszenz, die je nach Lichtlänge und chemischer Zusammensezung des Fluorits in unterschiedlichen Farben auftreten kann, gekennzeichnet.
definition:
  literal form: Mineral aus der Gruppe der Halogeniden, bestehend aus Calciumfluorit und anderen Beimengungen. Fluorit tritt in einer großen Farbvielfalt auf, von reiner farblos-durchsichtigen bis violett, rosa, grün, blau oder gelben Färbungen. Fluorit ist ein relativ weiches Mineral, mit der Mohshärte 4 und ist durch seine vollkommene, oktaedrische Spaltbarkeit sowie seine markante Fluoreszenz, die je nach Lichtlänge und chemischer Zusammensezung des Fluorits in unterschiedlichen Farben auftreten kann, gekennzeichnet.
in scheme: Konservierungs- und Restaurierungsfachthesaurus für archäologische Kulturgüter
pref label: Fluorit
  type: Label
  rank: preferred
alternative label: Flussspat
alt label: Flussspat
  type: Label
  rank: preferred

Jaspis
type: Concept
notation: C5322D
preferred label: jasper @en
created: 2026-01-30
issued: 2026-01-30
modified: 2026-02-04
publisher: Leibniz-Zentrum für Archäologie (LEIZA)
broader: Calcedon
broader transitive: Material
broader transitive: [Untersuchungsergebnisse]
broader transitive: Mineral
broader transitive: Zustandserfassung
broader transitive: Objektuntersuchung
broader transitive: silikatisches Material
broader transitive: Materialbestimmung
broader transitive: Calcedon
broader transitive: Quarz
definition: mikrokristalline Varietät des Calcedons, durch Eisen rötlich bis bräunlich, gelb gefärbt. Jaspis weist dichtes, lichtundurchlässiges Gefüge auf und zeigt einen splittrigen Bruch.
in scheme: Konservierungs- und Restaurierungsfachthesaurus für archäologische Kulturgüter
pref label: Jaspis
  type: Label
  rank: preferred
pref label: jasper
  type: Label
  rank: normal

Calcedon
type: Concept
notation: C81F4D
preferred label: calcedony @en
created: 2026-01-30
issued: 2026-01-30
modified: 2026-02-04
publisher: Leibniz-Zentrum für Archäologie (LEIZA)
broader: Quarz
broader transitive: Quarz
broader transitive: Material
broader transitive: [Untersuchungsergebnisse]
broader transitive: Mineral
broader transitive: Zustandserfassung
broader transitive: Objektuntersuchung
broader transitive: silikatisches Material
broader transitive: Materialbestimmung
definition: in verschiedenen Farben vorkommende Quarzvarietät, aus parallel gewachsenen, faserigen Kristallen von mikroskopischer und submikroskopischer Größe. Häufig finden sich auch Beimengungen von Moganite zwischen 1% - 20%, die sich jedoch im Laufe der Zeit zu Quarz umwandeln können, sodass ein moganite-freier Calcedon entsteht.
definition:
  literal form: in verschiedenen Farben vorkommende Quarzvarietät, aus parallel gewachsenen, faserigen Kristallen von mikroskopischer und submikroskopischer Größe. Häufig finden sich auch Beimengungen von Moganite zwischen 1% - 20%, die sich jedoch im Laufe der Zeit zu Quarz umwandeln können, sodass ein moganite-freier Calcedon entsteht.
in scheme: Konservierungs- und Restaurierungsfachthesaurus für archäologische Kulturgüter
pref label: Calcedon
  type: Label
  rank: preferred
pref label: calcedony
  type: Label
  rank: normal
narrower: Achat
narrower: Karneol
narrower: Jaspis
alternative label: Calzedon
alternative label: Chalcedon
alternative label: chalcedone @en
alt label: Chalcedon
  type: Label
  rank: normal
alt label: chalcedone
  type: Label
  rank: normal
alt label: Calzedon
  type: Label
  rank: preferred

Smaragd
type: Concept
notation: A72G88
created: 2026-01-30
issued: 2026-01-30
modified: 2026-02-04
publisher: Leibniz-Zentrum für Archäologie (LEIZA)
broader: Beryll
broader transitive: Beryll
broader transitive: Material
broader transitive: [Untersuchungsergebnisse]
broader transitive: Mineral
broader transitive: Zustandserfassung
broader transitive: Objektuntersuchung
broader transitive: silikatisches Material
broader transitive: Materialbestimmung
definition: grüne Varietät des Minerals Beryll, das duch Spuren von Chrom eine intensive grüne Farbe erhält, die z.T. mit Nuancen von gelb bis blau ergänzt werden. Smaragd werden vor allem aufgrund ihrers Glanzes und ihrer Transparenz als edle Schmucksteine geschätzt, wobei waserklare und fehlerfreie Kristalle extrem selten sind und daher zu den teuersten Edelsteinen der Welt gehören. Häufig sind Smaragde durch Einschlüsse in ihrere Transparenz getrübt und neigen zur Brüchigkeit bei der Verabeitung. Unter langwelligen UV-Strahlen zeigt Smaragd eine rote Lumineszenz.
definition:
  literal form: grüne Varietät des Minerals Beryll, das duch Spuren von Chrom eine intensive grüne Farbe erhält, die z.T. mit Nuancen von gelb bis blau ergänzt werden. Smaragd werden vor allem aufgrund ihrers Glanzes und ihrer Transparenz als edle Schmucksteine geschätzt, wobei waserklare und fehlerfreie Kristalle extrem selten sind und daher zu den teuersten Edelsteinen der Welt gehören. Häufig sind Smaragde durch Einschlüsse in ihrere Transparenz getrübt und neigen zur Brüchigkeit bei der Verabeitung. Unter langwelligen UV-Strahlen zeigt Smaragd eine rote Lumineszenz.
in scheme: Konservierungs- und Restaurierungsfachthesaurus für archäologische Kulturgüter
pref label: Smaragd
  type: Label
  rank: preferred

Saphir
type: Concept
notation: BC5A3C
created: 2026-01-30
issued: 2026-01-30
modified: 2026-02-04
publisher: Leibniz-Zentrum für Archäologie (LEIZA)
broader: Korund
broader transitive: Material
broader transitive: [Untersuchungsergebnisse]
broader transitive: Mineral
broader transitive: Zustandserfassung
broader transitive: Objektuntersuchung
broader transitive: silikatisches Material
broader transitive: Materialbestimmung
broader transitive: Korund
definition: typischerweise blaue - hellblaue Varietät des Korunds, seltener grün bis gelbliche Färbungen. Die Färbung ist auf Einschlüsse von Eisen und Titan zurückzuführen. Saphir bricht in muschelig,splittriger Form, besitzt die Mohshärte 9 und zeigt keine Lumineszenz.
definition:
  literal form: typischerweise blaue - hellblaue Varietät des Korunds, seltener grün bis gelbliche Färbungen. Die Färbung ist auf Einschlüsse von Eisen und Titan zurückzuführen. Saphir bricht in muschelig,splittriger Form, besitzt die Mohshärte 9 und zeigt keine Lumineszenz.
in scheme: Konservierungs- und Restaurierungsfachthesaurus für archäologische Kulturgüter
pref label: Saphir
  type: Label
  rank: preferred

Rubin
type: Concept
notation: D75514
preferred label: ruby @en
created: 2026-01-30
issued: 2026-01-30
modified: 2026-02-04
publisher: Leibniz-Zentrum für Archäologie (LEIZA)
broader: Korund
broader transitive: Material
broader transitive: [Untersuchungsergebnisse]
broader transitive: Mineral
broader transitive: Zustandserfassung
broader transitive: Objektuntersuchung
broader transitive: silikatisches Material
broader transitive: Materialbestimmung
broader transitive: Korund
definition: rote Varietät des Korund, die durch Spuren von Chrom verursacht werden. Rubin ist für seine außergewöhnliche Härte (Mohshärte 9), seinen glasartigen Glanz und seine Seltenheit bekannt, wodurch er zu den wertvollsten Edelsteinen der Welt gehört.
definition:
  literal form: rote Varietät des Korund, die durch Spuren von Chrom verursacht werden. Rubin ist für seine außergewöhnliche Härte (Mohshärte 9), seinen glasartigen Glanz und seine Seltenheit bekannt, wodurch er zu den wertvollsten Edelsteinen der Welt gehört.
in scheme: Konservierungs- und Restaurierungsfachthesaurus für archäologische Kulturgüter
pref label: Rubin
  type: Label
  rank: preferred
pref label: ruby
  type: Label
  rank: normal

Aquamarin
type: Concept
notation: F43643
created: 2026-01-30
issued: 2026-01-30
modified: 2026-02-04
publisher: Leibniz-Zentrum für Archäologie (LEIZA)
broader: Beryll
broader transitive: Beryll
broader transitive: Material
broader transitive: [Untersuchungsergebnisse]
broader transitive: Mineral
broader transitive: Zustandserfassung
broader transitive: Objektuntersuchung
broader transitive: silikatisches Material
broader transitive: Materialbestimmung
definition: blau bis blaugrüne Varietät des Beryll, die durch Beimengungen von Titan oder zweiwertigen Eisen-Ionen entsteht.
in scheme: Konservierungs- und Restaurierungsfachthesaurus für archäologische Kulturgüter
pref label: Aquamarin
  type: Label
  rank: preferred

Morganit
type: Concept
notation: G98D28
created: 2026-01-30
issued: 2026-01-30
modified: 2026-02-04
publisher: Leibniz-Zentrum für Archäologie (LEIZA)
broader: Beryll
broader transitive: Material
broader transitive: [Untersuchungsergebnisse]
broader transitive: Mineral
broader transitive: Zustandserfassung
broader transitive: Objektuntersuchung
broader transitive: silikatisches Material
broader transitive: Materialbestimmung
broader transitive: Beryll
definition: rosafarbene bis pinke Varietät des Beryll, die durch Mangan-Einschlüsse ihre charakteristische Farbe erhält.
in scheme: Konservierungs- und Restaurierungsfachthesaurus für archäologische Kulturgüter
pref label: Morganit
  type: Label
  rank: preferred

Hornblende
type: Concept
notation: A43C59
created: 2026-01-30
issued: 2026-01-30
modified: 2026-02-04
publisher: Leibniz-Zentrum für Archäologie (LEIZA)
broader: Amphibol
broader transitive: Amphibol
broader transitive: Material
broader transitive: [Untersuchungsergebnisse]
broader transitive: Mineral
broader transitive: Zustandserfassung
broader transitive: Objektuntersuchung
broader transitive: silikatisches Material
broader transitive: Materialbestimmung
definition: dunkelgrüne bis schwarzes, calciumhaltiges Minerale der Amphibol-Gruppe, mit den Bestandteilen Aluminiumoxid und/oder Eisenoxid.
in scheme: Konservierungs- und Restaurierungsfachthesaurus für archäologische Kulturgüter
pref label: Hornblende
  type: Label
  rank: preferred

Alabaster
type: Concept
notation: D1GC4D
created: 2026-01-30
issued: 2026-01-30
modified: 2026-02-04
publisher: Leibniz-Zentrum für Archäologie (LEIZA)
broader: Gips (Mineral)
broader transitive: Material
broader transitive: [Untersuchungsergebnisse]
broader transitive: Mineral
broader transitive: Zustandserfassung
broader transitive: Objektuntersuchung
broader transitive: silikatisches Material
broader transitive: Materialbestimmung
broader transitive: Gips (Mineral)
definition: Varietät des Gipses mit fester und feinkörniger Struktur und in der Regel heller bis weißer Farbe. Im allgemeinen Sprachgebrauch wird auch eine sehr ähnlich aussehende Varietät des Calcit (Kalksinter) als Alabaster ("antiker od. ägyptischer Alabaster") bezeichnet. Echter Alabaster aus Calciumsulfat ist sehr weich und anfällig gegenüber Wasser, während Calcit-Alabaster wasserunlöslich und härter ist.
definition:
  literal form: Varietät des Gipses mit fester und feinkörniger Struktur und in der Regel heller bis weißer Farbe. Im allgemeinen Sprachgebrauch wird auch eine sehr ähnlich aussehende Varietät des Calcit (Kalksinter) als Alabaster ("antiker od. ägyptischer Alabaster") bezeichnet. Echter Alabaster aus Calciumsulfat ist sehr weich und anfällig gegenüber Wasser, während Calcit-Alabaster wasserunlöslich und härter ist.
in scheme: Konservierungs- und Restaurierungsfachthesaurus für archäologische Kulturgüter
pref label: Alabaster
  type: Label
  rank: preferred

Metamorphit
type: Concept
notation: ABB166
created: 2026-01-30
issued: 2026-01-30
modified: 2026-02-04
publisher: Leibniz-Zentrum für Archäologie (LEIZA)
alternative label: metamorphoses Gestein
broader: Gestein
broader transitive: Gestein
broader transitive: Material
broader transitive: [Untersuchungsergebnisse]
broader transitive: Zustandserfassung
broader transitive: Objektuntersuchung
broader transitive: silikatisches Material
broader transitive: Materialbestimmung
definition: Überbegriff für Gesteine, die durch Umwandlung anderer Gesteine (z.B. Magmatite oder Sedimentgesteine) in den Tiefen der Erdkruste, aufgrund des dort herrschenden Drucks und steigenden Temperaturen, entstanden sind.
definition:
  literal form: Überbegriff für Gesteine, die durch Umwandlung anderer Gesteine (z.B. Magmatite oder Sedimentgesteine) in den Tiefen der Erdkruste, aufgrund des dort herrschenden Drucks und steigenden Temperaturen, entstanden sind.
in scheme: Konservierungs- und Restaurierungsfachthesaurus für archäologische Kulturgüter
narrower: Marmor
narrower: Quarzit
narrower: Speckstein
narrower: Amphibolit
narrower: Serpentinit
alt label: metamorphoses Gestein
  type: Label
  rank: preferred
pref label: Metamorphit
  type: Label
  rank: preferred

Farbstoff
type: Concept
notation: AFD671
preferred label: colourant @en
created: 2026-01-30
issued: 2026-01-30
modified: 2026-02-04
publisher: Leibniz-Zentrum für Archäologie (LEIZA)
broader: Konservierungs- und Restaurierungsmaterialien
broader transitive: Maßnahme
broader transitive: Konservierungs- und Restaurierungsmaterialien
in scheme: Konservierungs- und Restaurierungsfachthesaurus für archäologische Kulturgüter
pref label: Farbstoff
  type: Label
  rank: preferred
pref label: colourant
  type: Label
  rank: normal
alternative label: farbgebendes Material
definition: Oberbegriff für Material, welches zur Erzeugung einer Färbung verwendet wird.
narrower: Blattsilber
narrower: Schlagmetall
narrower: Blattgold
narrower: Pigment
narrower: Dispersionsfarbe
narrower: Ölfarbe
alt label: farbgebendes Material
  type: Label
  rank: preferred

Almandin
type: Concept
notation: B3BCB6
created: 2026-01-30
issued: 2026-01-30
modified: 2026-02-04
publisher: Leibniz-Zentrum für Archäologie (LEIZA)
broader: Granat
broader transitive: Mineral
broader transitive: Material
broader transitive: [Untersuchungsergebnisse]
broader transitive: Zustandserfassung
broader transitive: Objektuntersuchung
broader transitive: silikatisches Material
broader transitive: Materialbestimmung
broader transitive: Granat
definition: häufigstes Mineral der Granatgruppe mit chemischer Zusammensetzung Fe3Al2(SiO4)3. Almandin zeichnet sich durch eine tiefrote bis violettrote Farbe aus, eine hohe Härte (6,5–7,5 auf der Mohs-Skala) und seine typischen isometrischen Kristalle. Es entsteht vorwiegend in metamorphen Gesteinen wie Glimmerschiefern oder Gneisen unter hohem Druck und Temperatur. Aufgrund seiner Härte und intensiven Farbe wird Almandin seit der Antike als Schmuckstein geschätzt und auch als Schleifmittel verwendet.
definition:
  literal form: häufigstes Mineral der Granatgruppe mit chemischer Zusammensetzung Fe3Al2(SiO4)3. Almandin zeichnet sich durch eine tiefrote bis violettrote Farbe aus, eine hohe Härte (6,5–7,5 auf der Mohs-Skala) und seine typischen isometrischen Kristalle. Es entsteht vorwiegend in metamorphen Gesteinen wie Glimmerschiefern oder Gneisen unter hohem Druck und Temperatur. Aufgrund seiner Härte und intensiven Farbe wird Almandin seit der Antike als Schmuckstein geschätzt und auch als Schleifmittel verwendet.
in scheme: Konservierungs- und Restaurierungsfachthesaurus für archäologische Kulturgüter
pref label: Almandin
  type: Label
  rank: preferred

Blattsilber
type: Concept
notation: C1G6C8
created: 2026-01-30
issued: 2026-01-30
modified: 2026-02-04
publisher: Leibniz-Zentrum für Archäologie (LEIZA)
broader: Farbstoff
broader transitive: Farbstoff
broader transitive: Konservierungs- und Restaurierungsmaterialien
broader transitive: Maßnahme
in scheme: Konservierungs- und Restaurierungsfachthesaurus für archäologische Kulturgüter
pref label: Blattsilber
  type: Label
  rank: preferred

Konservierungs- und Restaurierungsmaterialien
type: Concept
notation: C364G1
preferred label: restoration material @en
created: 2026-01-30
issued: 2026-01-30
modified: 2026-02-04
publisher: Leibniz-Zentrum für Archäologie (LEIZA)
broader: Maßnahme
broader transitive: Maßnahme
in scheme: Konservierungs- und Restaurierungsfachthesaurus für archäologische Kulturgüter
narrower: Base
narrower: Korrosionsinhibitor
narrower: Strahlmittel
narrower: Farbstoff
narrower: Reduktionsmittel
narrower: [Adhäsivstoff]
narrower: Füllstoff
narrower: Verstärkungsfaser
narrower: Lösungsmittel
narrower: Öl
narrower: [Stütz- und Verpackungsmaterial]
narrower: Komplexbildner
narrower: [Abform- und Ergänzungsmaterial]
narrower: Säure
pref label: Konservierungs- und Restaurierungsmaterialien
  type: Label
  rank: preferred
pref label: restoration material
  type: Label
  rank: normal
alternative label: conservation material @en
definition: strukturierender Sammelbegriff für sämtliche zur Konservierung und/oder Restaurierung eines Objektes verwendeter (Verbrauchs-)Materialien
alt label: conservation material
  type: Label
  rank: preferred

Maßnahme
type: Concept
notation: CFGDA3
created: 2026-01-30
issued: 2026-01-30
modified: 2026-02-04
publisher: Leibniz-Zentrum für Archäologie (LEIZA)
alternative label: Behandlung
alternative label: Eingriff
alternative label: durchgeführte Maßnahme
in scheme: Konservierungs- und Restaurierungsfachthesaurus für archäologische Kulturgüter
alt label: durchgeführte Maßnahme
  type: Label
  rank: preferred
alt label: Eingriff
  type: Label
  rank: normal
alt label: Behandlung
  type: Label
  rank: normal
pref label: Maßnahme
  type: Label
  rank: preferred
definition: Ausführung der im Restaurierungskonzept geplanten Vorgehensweisen zur Erreichung des festgelegten Restaurierungs-/Konservierungsziel
narrower: [Behandlungsmethode]
narrower: Konservierungs- und Restaurierungswerkzeuge
narrower: Konservierungs- und Restaurierungsmaterialien
narrower: Nachbildung für wissenschaftliche Zwecke
top concept of: Konservierungs- und Restaurierungsfachthesaurus für archäologische Kulturgüter

Sedimentgestein
type: Concept
notation: C7F346
created: 2026-01-30
issued: 2026-01-30
modified: 2026-02-04
publisher: Leibniz-Zentrum für Archäologie (LEIZA)
broader: Gestein
broader transitive: Material
broader transitive: [Untersuchungsergebnisse]
broader transitive: Zustandserfassung
broader transitive: Objektuntersuchung
broader transitive: Gestein
broader transitive: silikatisches Material
broader transitive: Materialbestimmung
definition: Überbegriff für Gesteine, die mittels Diagenese durch Verwitterung, Abtragung, Zerfall anderer Gesteine und deren sekundäre Ablagerung auf der Erdoberfläche entstehen. Auch Gesteine die durch chemische Ausfällung oder von Organismen aufgebaut werden, zählen zur Gruppe der Sedimentgesteine.
definition:
  literal form: Überbegriff für Gesteine, die mittels Diagenese durch Verwitterung, Abtragung, Zerfall anderer Gesteine und deren sekundäre Ablagerung auf der Erdoberfläche entstehen. Auch Gesteine die durch chemische Ausfällung oder von Organismen aufgebaut werden, zählen zur Gruppe der Sedimentgesteine.
in scheme: Konservierungs- und Restaurierungsfachthesaurus für archäologische Kulturgüter
pref label: Sedimentgestein
  type: Label
  rank: preferred
alternative label: Sedimentit
alternative label: sedimentäres Gestein
narrower: eisenreiches Sedimentit
narrower: Kalkstein
narrower: Kalksinter
narrower: Tonstein
narrower: Sandstein
narrower: Feuerstein
narrower: Schieferton
narrower: Gips (Gestein)
narrower: Bentonit
narrower: Dolomit (Gestein)
alt label: Sedimentit
  type: Label
  rank: preferred
alt label: sedimentäres Gestein
  type: Label
  rank: normal

Vollton-/Abtönfarbe
type: Concept
notation: C9GD44
created: 2026-01-30
issued: 2026-01-30
modified: 2026-02-04
publisher: Leibniz-Zentrum für Archäologie (LEIZA)
broader: Dispersionsfarbe
broader transitive: Farbstoff
broader transitive: Konservierungs- und Restaurierungsmaterialien
broader transitive: Maßnahme
broader transitive: Dispersionsfarbe
in scheme: Konservierungs- und Restaurierungsfachthesaurus für archäologische Kulturgüter
pref label: Vollton-/Abtönfarbe
  type: Label
  rank: preferred

Dispersionsfarbe
type: Concept
notation: G5733B
created: 2026-01-30
issued: 2026-01-30
modified: 2026-02-04
publisher: Leibniz-Zentrum für Archäologie (LEIZA)
broader: Farbstoff
broader transitive: Konservierungs- und Restaurierungsmaterialien
broader transitive: Maßnahme
broader transitive: Farbstoff
in scheme: Konservierungs- und Restaurierungsfachthesaurus für archäologische Kulturgüter
pref label: Dispersionsfarbe
  type: Label
  rank: preferred
narrower: Acrylfarbe
narrower: Vollton-/Abtönfarbe

Kaolinit
type: Concept
notation: CA53A2
created: 2026-01-30
issued: 2026-01-30
modified: 2026-02-04
publisher: Leibniz-Zentrum für Archäologie (LEIZA)
broader: Tonminerale
broader transitive: Mineral
broader transitive: Material
broader transitive: [Untersuchungsergebnisse]
broader transitive: Zustandserfassung
broader transitive: Objektuntersuchung
broader transitive: silikatisches Material
broader transitive: Materialbestimmung
broader transitive: Tonminerale
definition: häufig in der Natur vorkommendes Tonmineral mit der chemischen Zusammensetzung Al₂Si₂O₅(OH)₄. Es entsteht hauptsächlich durch die Verwitterung feldspathaltiger Gesteine und kristallisiert in dünnen Blättchen oder Schuppen als Schichtsilikat. Die Farbigkeit ist meist weiß, aber auch braune, gelbe oder graue Färbungen sind möglich. Es besitzt eine feinkörnige Struktur, ist Hauptbestandteil von Kaolin und wurde typischerweise für die Herstellung von Keramik oder als Füllstoff für verschiedene technologische Prozesse verwendet.
definition:
  literal form: häufig in der Natur vorkommendes Tonmineral mit der chemischen Zusammensetzung Al₂Si₂O₅(OH)₄. Es entsteht hauptsächlich durch die Verwitterung feldspathaltiger Gesteine und kristallisiert in dünnen Blättchen oder Schuppen als Schichtsilikat. Die Farbigkeit ist meist weiß, aber auch braune, gelbe oder graue Färbungen sind möglich. Es besitzt eine feinkörnige Struktur, ist Hauptbestandteil von Kaolin und wurde typischerweise für die Herstellung von Keramik oder als Füllstoff für verschiedene technologische Prozesse verwendet.
in scheme: Konservierungs- und Restaurierungsfachthesaurus für archäologische Kulturgüter
pref label: Kaolinit
  type: Label
  rank: preferred

Illit
type: Concept
notation: D71467
created: 2026-01-30
issued: 2026-01-30
modified: 2026-02-04
publisher: Leibniz-Zentrum für Archäologie (LEIZA)
broader: Tonminerale
broader transitive: Mineral
broader transitive: Material
broader transitive: [Untersuchungsergebnisse]
broader transitive: Zustandserfassung
broader transitive: Objektuntersuchung
broader transitive: silikatisches Material
broader transitive: Materialbestimmung
broader transitive: Tonminerale
definition: Schichtsilikat der Glimmergruppe, das durch umfassende Verwitterungsprozesse Wasser in sein Kristallgitter eingebaut hat und somit zu den sog. "Hydroglimmern" gehört. Illit tritt in der Regel in weißlich bis grün-gräulicher Färbung auf, zeigt einen perlmuttartigen Glanz und die typische plättchenartige Struktur der Tonminerale. Es erscheint vorrangig in Sedimentgesteinen, wie Mergeln, Tonstein oder Schieferton.
definition:
  literal form: Schichtsilikat der Glimmergruppe, das durch umfassende Verwitterungsprozesse Wasser in sein Kristallgitter eingebaut hat und somit zu den sog. "Hydroglimmern" gehört. Illit tritt in der Regel in weißlich bis grün-gräulicher Färbung auf, zeigt einen perlmuttartigen Glanz und die typische plättchenartige Struktur der Tonminerale. Es erscheint vorrangig in Sedimentgesteinen, wie Mergeln, Tonstein oder Schieferton.
in scheme: Konservierungs- und Restaurierungsfachthesaurus für archäologische Kulturgüter
pref label: Illit
  type: Label
  rank: preferred

Magmatit
type: Concept
notation: DF7826
created: 2026-01-30
issued: 2026-01-30
modified: 2026-02-04
publisher: Leibniz-Zentrum für Archäologie (LEIZA)
broader: Gestein
broader transitive: Material
broader transitive: [Untersuchungsergebnisse]
broader transitive: Zustandserfassung
broader transitive: Objektuntersuchung
broader transitive: Gestein
broader transitive: silikatisches Material
broader transitive: Materialbestimmung
definition: Überbegriff für Gesteine, die aus Erstarrung einer Gesteinsschmelze entstehen.
in scheme: Konservierungs- und Restaurierungsfachthesaurus für archäologische Kulturgüter
narrower: Gesteinsglas
narrower: Tuff
narrower: Diorit
narrower: Basalt
narrower: Granit
pref label: Magmatit
  type: Label
  rank: preferred
alternative label: Erstarrungsgestein
alternative label: magmatisches Gestein
alt label: magmatisches Gestein
  type: Label
  rank: preferred
alt label: Erstarrungsgestein
  type: Label
  rank: normal

Blattgold
type: Concept
notation: F49579
created: 2026-01-30
issued: 2026-01-30
modified: 2026-02-04
publisher: Leibniz-Zentrum für Archäologie (LEIZA)
broader: Farbstoff
broader transitive: Farbstoff
broader transitive: Konservierungs- und Restaurierungsmaterialien
broader transitive: Maßnahme
in scheme: Konservierungs- und Restaurierungsfachthesaurus für archäologische Kulturgüter
pref label: Blattgold
  type: Label
  rank: preferred

Seidenpapier
type: Concept
notation: A33F4B
created: 2026-01-30
issued: 2026-01-30
modified: 2026-02-04
publisher: Leibniz-Zentrum für Archäologie (LEIZA)
broader: [Stütz- und Verpackungsmaterial]
broader transitive: [Stütz- und Verpackungsmaterial]
broader transitive: Konservierungs- und Restaurierungsmaterialien
broader transitive: Maßnahme
in scheme: Konservierungs- und Restaurierungsfachthesaurus für archäologische Kulturgüter
pref label: Seidenpapier
  type: Label
  rank: preferred

Makrolon
type: Concept
notation: A7824C
created: 2026-01-30
issued: 2026-01-30
modified: 2026-02-04
publisher: Leibniz-Zentrum für Archäologie (LEIZA)
broader: Polycarbonat
broader transitive: Polycarbonat
broader transitive: Konservierungs- und Restaurierungsmaterialien
broader transitive: Maßnahme
broader transitive: [Stütz- und Verpackungsmaterial]
in scheme: Konservierungs- und Restaurierungsfachthesaurus für archäologische Kulturgüter
pref label: Makrolon
  type: Label
  rank: preferred

Polycarbonat
type: Concept
notation: BB8D78
created: 2026-01-30
issued: 2026-01-30
modified: 2026-02-04
publisher: Leibniz-Zentrum für Archäologie (LEIZA)
broader: [Stütz- und Verpackungsmaterial]
broader transitive: Konservierungs- und Restaurierungsmaterialien
broader transitive: Maßnahme
broader transitive: [Stütz- und Verpackungsmaterial]
in scheme: Konservierungs- und Restaurierungsfachthesaurus für archäologische Kulturgüter
pref label: Polycarbonat
  type: Label
  rank: preferred
narrower: Makrolon

[Stütz- und Verpackungsmaterial]
type: Concept
type: NonIndexingConcept
type: GuideTerm
notation: D9G356
created: 2026-01-30
issued: 2026-01-30
modified: 2026-02-04
publisher: Leibniz-Zentrum für Archäologie (LEIZA)
broader: Konservierungs- und Restaurierungsmaterialien
broader transitive: Konservierungs- und Restaurierungsmaterialien
broader transitive: Maßnahme
in scheme: Konservierungs- und Restaurierungsfachthesaurus für archäologische Kulturgüter
pref label: [Stütz- und Verpackungsmaterial]
  type: Label
  rank: preferred
narrower: Seidenpapier
narrower: Polycarbonat
narrower: Polyethylen-Schaum
narrower: Styrodur
narrower: Styropor
narrower: Kartonage
narrower: Acrylglas
narrower: Tyvek
narrower: Folie
narrower: Adsorbens
definition: strukturierender Oberbegriff für Materialien, die in der Restaurierung hauptsächlich für das Verpacken und die Lagerung sowie für die Abstützung bzw. den Trägerbau von Objekten verwendet werden.

Plastazote
type: Concept
notation: A93F6C
created: 2026-01-30
issued: 2026-01-30
modified: 2026-02-04
publisher: Leibniz-Zentrum für Archäologie (LEIZA)
broader: Polyethylen-Schaum
broader transitive: Konservierungs- und Restaurierungsmaterialien
broader transitive: Maßnahme
broader transitive: [Stütz- und Verpackungsmaterial]
broader transitive: Polyethylen-Schaum
in scheme: Konservierungs- und Restaurierungsfachthesaurus für archäologische Kulturgüter
pref label: Plastazote
  type: Label
  rank: preferred

Polyethylen-Schaum
type: Concept
notation: F91427
created: 2026-01-30
issued: 2026-01-30
modified: 2026-02-04
publisher: Leibniz-Zentrum für Archäologie (LEIZA)
broader: [Stütz- und Verpackungsmaterial]
broader transitive: Konservierungs- und Restaurierungsmaterialien
broader transitive: Maßnahme
broader transitive: [Stütz- und Verpackungsmaterial]
in scheme: Konservierungs- und Restaurierungsfachthesaurus für archäologische Kulturgüter
pref label: Polyethylen-Schaum
  type: Label
  rank: preferred
narrower: Plastazote
narrower: Ethafoam

Styrodur
type: Concept
notation: CBBF13
created: 2026-01-30
issued: 2026-01-30
modified: 2026-02-04
publisher: Leibniz-Zentrum für Archäologie (LEIZA)
broader: [Stütz- und Verpackungsmaterial]
broader transitive: Konservierungs- und Restaurierungsmaterialien
broader transitive: Maßnahme
broader transitive: [Stütz- und Verpackungsmaterial]
in scheme: Konservierungs- und Restaurierungsfachthesaurus für archäologische Kulturgüter
pref label: Styrodur
  type: Label
  rank: preferred
alternative label: extrudiertes Polystyrol
alt label: extrudiertes Polystyrol
  type: Label
  rank: preferred

Styropor
type: Concept
notation: CCB66C
created: 2026-01-30
issued: 2026-01-30
modified: 2026-02-04
publisher: Leibniz-Zentrum für Archäologie (LEIZA)
broader: [Stütz- und Verpackungsmaterial]
broader transitive: Konservierungs- und Restaurierungsmaterialien
broader transitive: Maßnahme
broader transitive: [Stütz- und Verpackungsmaterial]
in scheme: Konservierungs- und Restaurierungsfachthesaurus für archäologische Kulturgüter
pref label: Styropor
  type: Label
  rank: preferred

Kartonage
type: Concept
notation: DAG754
created: 2026-01-30
issued: 2026-01-30
modified: 2026-02-04
publisher: Leibniz-Zentrum für Archäologie (LEIZA)
broader: [Stütz- und Verpackungsmaterial]
broader transitive: [Stütz- und Verpackungsmaterial]
broader transitive: Konservierungs- und Restaurierungsmaterialien
broader transitive: Maßnahme
in scheme: Konservierungs- und Restaurierungsfachthesaurus für archäologische Kulturgüter
pref label: Kartonage
  type: Label
  rank: preferred

Acrylglas
type: Concept
notation: DD3858
preferred label: acrylic glass @en
created: 2026-01-30
issued: 2026-01-30
modified: 2026-02-04
publisher: Leibniz-Zentrum für Archäologie (LEIZA)
broader: [Stütz- und Verpackungsmaterial]
broader transitive: Konservierungs- und Restaurierungsmaterialien
broader transitive: Maßnahme
broader transitive: [Stütz- und Verpackungsmaterial]
in scheme: Konservierungs- und Restaurierungsfachthesaurus für archäologische Kulturgüter
pref label: Acrylglas
  type: Label
  rank: preferred
pref label: acrylic glass
  type: Label
  rank: normal
alternative label: Plexiglas
alt label: Plexiglas
  type: Label
  rank: preferred

Tyvek
type: Concept
notation: F432G4
created: 2026-01-30
issued: 2026-01-30
modified: 2026-02-04
publisher: Leibniz-Zentrum für Archäologie (LEIZA)
broader: [Stütz- und Verpackungsmaterial]
broader transitive: [Stütz- und Verpackungsmaterial]
broader transitive: Konservierungs- und Restaurierungsmaterialien
broader transitive: Maßnahme
in scheme: Konservierungs- und Restaurierungsfachthesaurus für archäologische Kulturgüter
pref label: Tyvek
  type: Label
  rank: preferred

Folie
type: Concept
notation: F8ADGD
created: 2026-01-30
issued: 2026-01-30
modified: 2026-02-04
publisher: Leibniz-Zentrum für Archäologie (LEIZA)
broader: [Stütz- und Verpackungsmaterial]
broader transitive: [Stütz- und Verpackungsmaterial]
broader transitive: Konservierungs- und Restaurierungsmaterialien
broader transitive: Maßnahme
in scheme: Konservierungs- und Restaurierungsfachthesaurus für archäologische Kulturgüter
pref label: Folie
  type: Label
  rank: preferred
narrower: PE-Folie
narrower: Aluminiumverbundfolie
narrower: Zinnfolie
narrower: Aluminiumfolie

Adsorbens
type: Concept
notation: GDB246
created: 2026-01-30
issued: 2026-01-30
modified: 2026-02-04
publisher: Leibniz-Zentrum für Archäologie (LEIZA)
broader: [Stütz- und Verpackungsmaterial]
broader transitive: [Stütz- und Verpackungsmaterial]
broader transitive: Konservierungs- und Restaurierungsmaterialien
broader transitive: Maßnahme
in scheme: Konservierungs- und Restaurierungsfachthesaurus für archäologische Kulturgüter
pref label: Adsorbens
  type: Label
  rank: preferred
definition: Material, das in der Lage ist, Stoffe (z.B. Gase, Flüssigkeiten oder gelöste Substanzen) an seiner Oberfläche zu binden und so aus einer Mischung zu entfernen oder zu konzentrieren.
narrower: Trockenmittel
narrower: Schadstoffabsorber
alternative label: Adsorptionsmittel
alt label: Adsorptionsmittel
  type: Label
  rank: preferred

Schlagmetall
type: Concept
notation: DBAD15
created: 2026-01-30
issued: 2026-01-30
modified: 2026-02-04
publisher: Leibniz-Zentrum für Archäologie (LEIZA)
broader: Farbstoff
broader transitive: Konservierungs- und Restaurierungsmaterialien
broader transitive: Maßnahme
broader transitive: Farbstoff
in scheme: Konservierungs- und Restaurierungsfachthesaurus für archäologische Kulturgüter
pref label: Schlagmetall
  type: Label
  rank: preferred

Ethafoam
type: Concept
notation: GA1687
created: 2026-01-30
issued: 2026-01-30
modified: 2026-02-04
publisher: Leibniz-Zentrum für Archäologie (LEIZA)
broader: Polyethylen-Schaum
broader transitive: Konservierungs- und Restaurierungsmaterialien
broader transitive: Maßnahme
broader transitive: [Stütz- und Verpackungsmaterial]
broader transitive: Polyethylen-Schaum
in scheme: Konservierungs- und Restaurierungsfachthesaurus für archäologische Kulturgüter
pref label: Ethafoam
  type: Label
  rank: preferred

Silicagel
type: Concept
notation: A8B27G
created: 2026-01-30
issued: 2026-01-30
modified: 2026-02-04
publisher: Leibniz-Zentrum für Archäologie (LEIZA)
broader: Trockenmittel
broader transitive: Trockenmittel
broader transitive: Konservierungs- und Restaurierungsmaterialien
broader transitive: Maßnahme
broader transitive: [Stütz- und Verpackungsmaterial]
broader transitive: Adsorbens
in scheme: Konservierungs- und Restaurierungsfachthesaurus für archäologische Kulturgüter
pref label: Silicagel
  type: Label
  rank: preferred

Molekularsieb
type: Concept
notation: B33968
created: 2026-01-30
issued: 2026-01-30
modified: 2026-02-04
publisher: Leibniz-Zentrum für Archäologie (LEIZA)
broader: Trockenmittel
broader transitive: Trockenmittel
broader transitive: Konservierungs- und Restaurierungsmaterialien
broader transitive: Maßnahme
broader transitive: [Stütz- und Verpackungsmaterial]
broader transitive: Adsorbens
in scheme: Konservierungs- und Restaurierungsfachthesaurus für archäologische Kulturgüter
pref label: Molekularsieb
  type: Label
  rank: preferred
alternative label: Molsieb
alt label: Molsieb
  type: Label
  rank: preferred

PE-Folie
type: Concept
notation: B6F5BG
created: 2026-01-30
issued: 2026-01-30
modified: 2026-02-04
publisher: Leibniz-Zentrum für Archäologie (LEIZA)
broader: Folie
broader transitive: [Stütz- und Verpackungsmaterial]
broader transitive: Konservierungs- und Restaurierungsmaterialien
broader transitive: Maßnahme
broader transitive: Folie
in scheme: Konservierungs- und Restaurierungsfachthesaurus für archäologische Kulturgüter
pref label: PE-Folie
  type: Label
  rank: preferred
definition: Folien aus thermoplastischem Polymer des Ethylens, die durch ihre chemische Inertheit gegenüber einer Vielzahl von in der Konservierung und Restaurierung eingesetzten Materialen vielfältig für Verpackungen verwendet wird.
definition:
  literal form: Folien aus thermoplastischem Polymer des Ethylens, die durch ihre chemische Inertheit gegenüber einer Vielzahl von in der Konservierung und Restaurierung eingesetzten Materialen vielfältig für Verpackungen verwendet wird.

Trockenmittel
type: Concept
notation: C38B35
created: 2026-01-30
issued: 2026-01-30
modified: 2026-02-04
publisher: Leibniz-Zentrum für Archäologie (LEIZA)
broader: Adsorbens
broader transitive: [Stütz- und Verpackungsmaterial]
broader transitive: Konservierungs- und Restaurierungsmaterialien
broader transitive: Maßnahme
broader transitive: Adsorbens
in scheme: Konservierungs- und Restaurierungsfachthesaurus für archäologische Kulturgüter
pref label: Trockenmittel
  type: Label
  rank: preferred
narrower: Silicagel
narrower: Molekularsieb

Schadstoffabsorber
type: Concept
notation: F443FD
created: 2026-01-30
issued: 2026-01-30
modified: 2026-02-04
publisher: Leibniz-Zentrum für Archäologie (LEIZA)
broader: Adsorbens
broader transitive: Konservierungs- und Restaurierungsmaterialien
broader transitive: Maßnahme
broader transitive: [Stütz- und Verpackungsmaterial]
broader transitive: Adsorbens
in scheme: Konservierungs- und Restaurierungsfachthesaurus für archäologische Kulturgüter
pref label: Schadstoffabsorber
  type: Label
  rank: preferred
narrower: RP Sauerstoffabsorber
narrower: Aktivkohlegewebe

Aluminiumverbundfolie
type: Concept
notation: F67D14
created: 2026-01-30
issued: 2026-01-30
modified: 2026-02-04
publisher: Leibniz-Zentrum für Archäologie (LEIZA)
broader: Folie
broader transitive: [Stütz- und Verpackungsmaterial]
broader transitive: Konservierungs- und Restaurierungsmaterialien
broader transitive: Maßnahme
broader transitive: Folie
in scheme: Konservierungs- und Restaurierungsfachthesaurus für archäologische Kulturgüter
pref label: Aluminiumverbundfolie
  type: Label
  rank: preferred

Zinnfolie
type: Concept
notation: F8G977
created: 2026-01-30
issued: 2026-01-30
modified: 2026-02-04
publisher: Leibniz-Zentrum für Archäologie (LEIZA)
broader: Folie
broader transitive: [Stütz- und Verpackungsmaterial]
broader transitive: Konservierungs- und Restaurierungsmaterialien
broader transitive: Maßnahme
broader transitive: Folie
in scheme: Konservierungs- und Restaurierungsfachthesaurus für archäologische Kulturgüter
pref label: Zinnfolie
  type: Label
  rank: preferred

Aluminiumfolie
type: Concept
notation: G2DA3A
created: 2026-01-30
issued: 2026-01-30
modified: 2026-02-04
publisher: Leibniz-Zentrum für Archäologie (LEIZA)
broader: Folie
broader transitive: [Stütz- und Verpackungsmaterial]
broader transitive: Konservierungs- und Restaurierungsmaterialien
broader transitive: Maßnahme
broader transitive: Folie
in scheme: Konservierungs- und Restaurierungsfachthesaurus für archäologische Kulturgüter
pref label: Aluminiumfolie
  type: Label
  rank: preferred

Heißluftföhn
type: Concept
notation: A4G4G1
created: 2026-01-30
issued: 2026-01-30
modified: 2026-02-04
publisher: Leibniz-Zentrum für Archäologie (LEIZA)
broader: technische Geräte
broader transitive: technische Geräte
broader transitive: Konservierungs- und Restaurierungswerkzeuge
broader transitive: Maßnahme
in scheme: Konservierungs- und Restaurierungsfachthesaurus für archäologische Kulturgüter
pref label: Heißluftföhn
  type: Label
  rank: preferred

Absauganlage
type: Concept
notation: BBB987
created: 2026-01-30
issued: 2026-01-30
modified: 2026-02-04
publisher: Leibniz-Zentrum für Archäologie (LEIZA)
broader: technische Geräte
broader transitive: Konservierungs- und Restaurierungswerkzeuge
broader transitive: Maßnahme
broader transitive: technische Geräte
in scheme: Konservierungs- und Restaurierungsfachthesaurus für archäologische Kulturgüter
pref label: Absauganlage
  type: Label
  rank: preferred
definition: technisches Gerät zur Entfernung von gesundheitsgefährdenden Stäuben und/oder Dämpfen, i.d.R. bestehend aus Motor, Pumpe, Filter-Einheit und Saugrüssel.

RP Sauerstoffabsorber
type: Concept
notation: BFCF37
created: 2026-01-30
issued: 2026-01-30
modified: 2026-02-04
publisher: Leibniz-Zentrum für Archäologie (LEIZA)
broader: Schadstoffabsorber
broader transitive: Konservierungs- und Restaurierungsmaterialien
broader transitive: Maßnahme
broader transitive: [Stütz- und Verpackungsmaterial]
broader transitive: Adsorbens
broader transitive: Schadstoffabsorber
in scheme: Konservierungs- und Restaurierungsfachthesaurus für archäologische Kulturgüter
pref label: RP Sauerstoffabsorber
  type: Label
  rank: preferred
definition: Produktname von Schadstoff- bzw. Sauerstoffabsorbern der Firma Mitsubishi Gas Chemical Europe GmbH
narrower: RP-A Sauerstoffabsober
narrower: RP-K Sauerstoffabsober

RP-A Sauerstoffabsober
type: Concept
notation: BG5FG6
created: 2026-01-30
issued: 2026-01-30
modified: 2026-02-04
publisher: Leibniz-Zentrum für Archäologie (LEIZA)
broader: RP Sauerstoffabsorber
broader transitive: Konservierungs- und Restaurierungsmaterialien
broader transitive: Maßnahme
broader transitive: [Stütz- und Verpackungsmaterial]
broader transitive: Adsorbens
broader transitive: RP Sauerstoffabsorber
broader transitive: Schadstoffabsorber
in scheme: Konservierungs- und Restaurierungsfachthesaurus für archäologische Kulturgüter
pref label: RP-A Sauerstoffabsober
  type: Label
  rank: preferred
definition: Produktname eines Schadstoff- bzw Sauerstoffabsorbers bestehend aus Zeolith, Polyethylen, Ca(OH)2 sowie Aktivkohle der Firma Mitsubishi Gas Chemical Europe GmbH, speziell für die Konservierung von Metallen, Elektronik und archäologische Bodenfunde entwickelt. RP-A absorbiert Luftsauerstoft und senkt dabei auch die relative Luftfeuchtigkeit.
definition:
  literal form: Produktname eines Schadstoff- bzw Sauerstoffabsorbers bestehend aus Zeolith, Polyethylen, Ca(OH)2 sowie Aktivkohle der Firma Mitsubishi Gas Chemical Europe GmbH, speziell für die Konservierung von Metallen, Elektronik und archäologische Bodenfunde entwickelt. RP-A absorbiert Luftsauerstoft und senkt dabei auch die relative Luftfeuchtigkeit.

RP-K Sauerstoffabsober
type: Concept
notation: D4FC62
created: 2026-01-30
issued: 2026-01-30
modified: 2026-02-04
publisher: Leibniz-Zentrum für Archäologie (LEIZA)
broader: RP Sauerstoffabsorber
broader transitive: Konservierungs- und Restaurierungsmaterialien
broader transitive: Maßnahme
broader transitive: [Stütz- und Verpackungsmaterial]
broader transitive: Adsorbens
broader transitive: RP Sauerstoffabsorber
broader transitive: Schadstoffabsorber
in scheme: Konservierungs- und Restaurierungsfachthesaurus für archäologische Kulturgüter
pref label: RP-K Sauerstoffabsober
  type: Label
  rank: preferred
definition: Produktname eines Schadstoff- bzw Sauerstoffabsorbers bestehend aus Kieselgur, Polyethylen, Ca(OH)2 sowie Graphit der Firma Mitsubishi Gas Chemical Europe GmbH, speziell für die Konservierung von hygroskopischen Materialien entwickelt. RP-K absorbiert Luftsauerstoff, ohne Einfluss auf die relative Luftfeuchtigkeit zu nehmen.
definition:
  literal form: Produktname eines Schadstoff- bzw Sauerstoffabsorbers bestehend aus Kieselgur, Polyethylen, Ca(OH)2 sowie Graphit der Firma Mitsubishi Gas Chemical Europe GmbH, speziell für die Konservierung von hygroskopischen Materialien entwickelt. RP-K absorbiert Luftsauerstoff, ohne Einfluss auf die relative Luftfeuchtigkeit zu nehmen.

Aktivkohlegewebe
type: Concept
notation: C1DG79
created: 2026-01-30
issued: 2026-01-30
modified: 2026-02-04
publisher: Leibniz-Zentrum für Archäologie (LEIZA)
broader: Schadstoffabsorber
broader transitive: Konservierungs- und Restaurierungsmaterialien
broader transitive: Maßnahme
broader transitive: [Stütz- und Verpackungsmaterial]
broader transitive: Adsorbens
broader transitive: Schadstoffabsorber
in scheme: Konservierungs- und Restaurierungsfachthesaurus für archäologische Kulturgüter
pref label: Aktivkohlegewebe
  type: Label
  rank: preferred
alternative label: Kohlevlies
alt label: Kohlevlies
  type: Label
  rank: preferred

Gefriertrocknungsanlage
type: Concept
notation: C2112G
created: 2026-01-30
issued: 2026-01-30
modified: 2026-02-04
publisher: Leibniz-Zentrum für Archäologie (LEIZA)
broader: technische Geräte
broader transitive: Konservierungs- und Restaurierungswerkzeuge
broader transitive: Maßnahme
broader transitive: technische Geräte
in scheme: Konservierungs- und Restaurierungsfachthesaurus für archäologische Kulturgüter
pref label: Gefriertrocknungsanlage
  type: Label
  rank: preferred

Schleifkörper
type: Concept
notation: C4C6B6
created: 2026-01-30
issued: 2026-01-30
modified: 2026-02-04
publisher: Leibniz-Zentrum für Archäologie (LEIZA)
broader: technische Geräte
broader transitive: Konservierungs- und Restaurierungswerkzeuge
broader transitive: Maßnahme
broader transitive: technische Geräte
in scheme: Konservierungs- und Restaurierungsfachthesaurus für archäologische Kulturgüter
pref label: Schleifkörper
  type: Label
  rank: preferred
definition: Werkzeug aus abrasivem Material, in unterschiedlicher Form wie Scheiben, Stäben oder Blöcken, das in der Konservierung und Restaurierung zur schonenden Bearbeitung von Oberflächen eingesetzt wird. Es dient zum Glätten, Formen oder Entfernen von Schichten und wird auf die spezifischen Anforderungen des zu bearbeitenden Materials abgestimmt.
definition:
  literal form: Werkzeug aus abrasivem Material, in unterschiedlicher Form wie Scheiben, Stäben oder Blöcken, das in der Konservierung und Restaurierung zur schonenden Bearbeitung von Oberflächen eingesetzt wird. Es dient zum Glätten, Formen oder Entfernen von Schichten und wird auf die spezifischen Anforderungen des zu bearbeitenden Materials abgestimmt.
narrower: Korundschleifkörper
narrower: Gummischleifkörper
narrower: Diamantschleifkörper
narrower: Metallfräser

Ultraschallgerät
type: Concept
notation: C5A318
created: 2026-01-30
issued: 2026-01-30
modified: 2026-02-04
publisher: Leibniz-Zentrum für Archäologie (LEIZA)
broader: technische Geräte
broader transitive: Konservierungs- und Restaurierungswerkzeuge
broader transitive: Maßnahme
broader transitive: technische Geräte
in scheme: Konservierungs- und Restaurierungsfachthesaurus für archäologische Kulturgüter
pref label: Ultraschallgerät
  type: Label
  rank: preferred
definition: technisches Gerät, das zur Reinigung von Objekten mittels hochfrequenter Ultraschallwellen eingesetzt wird. Diese Wellen erzeugen in einer Flüssigkeit, meist Wasser oder einer speziellen Reinigungslösung, Kavitationsblasen, die beim Zusammenfallen Verunreinigungen von der Oberfläche der zu reinigenden Gegenstände lösen. Diese Methode ist besonders schonend und effizient und wird in der Konservierung und Restaurierung für empfindliche oder komplex geformte Objekte verwendet.
definition:
  literal form: technisches Gerät, das zur Reinigung von Objekten mittels hochfrequenter Ultraschallwellen eingesetzt wird. Diese Wellen erzeugen in einer Flüssigkeit, meist Wasser oder einer speziellen Reinigungslösung, Kavitationsblasen, die beim Zusammenfallen Verunreinigungen von der Oberfläche der zu reinigenden Gegenstände lösen. Diese Methode ist besonders schonend und effizient und wird in der Konservierung und Restaurierung für empfindliche oder komplex geformte Objekte verwendet.

Ultraschallfeinmeißel
type: Concept
notation: C871CB
created: 2026-01-30
issued: 2026-01-30
modified: 2026-02-04
publisher: Leibniz-Zentrum für Archäologie (LEIZA)
broader: technische Geräte
broader transitive: Konservierungs- und Restaurierungswerkzeuge
broader transitive: Maßnahme
broader transitive: technische Geräte
in scheme: Konservierungs- und Restaurierungsfachthesaurus für archäologische Kulturgüter
pref label: Ultraschallfeinmeißel
  type: Label
  rank: preferred

Konservierungs- und Restaurierungswerkzeuge
type: Concept
notation: C93638
created: 2026-01-30
issued: 2026-01-30
modified: 2026-02-04
publisher: Leibniz-Zentrum für Archäologie (LEIZA)
alternative label: Konservierungs- und Restaurierungsequipment
broader: Maßnahme
broader transitive: Maßnahme
in scheme: Konservierungs- und Restaurierungsfachthesaurus für archäologische Kulturgüter
alt label: Konservierungs- und Restaurierungsequipment
  type: Label
  rank: preferred
pref label: Konservierungs- und Restaurierungswerkzeuge
  type: Label
  rank: preferred
definition: Oberbegriff für Gegenstände, die genutzt werden um Konservierungs- und/oder Restaurierungsmaßnahmen durchzuführen. Die verschiedenen Werkzeuge ermöglichen ein präzises Arbeiten und erhöhen die Effizienz bei den unterschiedlichen Methoden und Aufgaben.
definition:
  literal form: Oberbegriff für Gegenstände, die genutzt werden um Konservierungs- und/oder Restaurierungsmaßnahmen durchzuführen. Die verschiedenen Werkzeuge ermöglichen ein präzises Arbeiten und erhöhen die Effizienz bei den unterschiedlichen Methoden und Aufgaben.
narrower: manuelle Werkzeuge
narrower: technische Geräte

Plasmaanlage
type: Concept
notation: C99F9G
created: 2026-01-30
issued: 2026-01-30
modified: 2026-02-04
publisher: Leibniz-Zentrum für Archäologie (LEIZA)
broader: technische Geräte
broader transitive: technische Geräte
broader transitive: Konservierungs- und Restaurierungswerkzeuge
broader transitive: Maßnahme
in scheme: Konservierungs- und Restaurierungsfachthesaurus für archäologische Kulturgüter
pref label: Plasmaanlage
  type: Label
  rank: preferred

Airbrush-System
type: Concept
notation: C9G1B6
created: 2026-01-30
issued: 2026-01-30
modified: 2026-02-04
publisher: Leibniz-Zentrum für Archäologie (LEIZA)
broader: technische Geräte
broader transitive: technische Geräte
broader transitive: Konservierungs- und Restaurierungswerkzeuge
broader transitive: Maßnahme
in scheme: Konservierungs- und Restaurierungsfachthesaurus für archäologische Kulturgüter
pref label: Airbrush-System
  type: Label
  rank: preferred

Wärmeschrank
type: Concept
notation: D7GGGG
created: 2026-01-30
issued: 2026-01-30
modified: 2026-02-04
publisher: Leibniz-Zentrum für Archäologie (LEIZA)
broader: technische Geräte
broader transitive: technische Geräte
broader transitive: Konservierungs- und Restaurierungswerkzeuge
broader transitive: Maßnahme
in scheme: Konservierungs- und Restaurierungsfachthesaurus für archäologische Kulturgüter
pref label: Wärmeschrank
  type: Label
  rank: preferred
alternative label: Wärmekammer
alt label: Wärmekammer
  type: Label
  rank: preferred

Mikromotor
type: Concept
notation: D8G747
created: 2026-01-30
issued: 2026-01-30
modified: 2026-02-04
publisher: Leibniz-Zentrum für Archäologie (LEIZA)
broader: technische Geräte
broader transitive: Maßnahme
broader transitive: Konservierungs- und Restaurierungswerkzeuge
broader transitive: technische Geräte
in scheme: Konservierungs- und Restaurierungsfachthesaurus für archäologische Kulturgüter
pref label: Mikromotor
  type: Label
  rank: preferred
definition: präzises Elektrowerkzeug mit austauschbaren Aufsätzen, das in der Konservierung und Restaurierung verwendet wird, um feine Arbeiten wie Schleifen, Bohren oder Polieren durchzuführen. Es ermöglicht exakte Materialbearbeitung unter Kontrolle und ohne großen Kraftaufwand.
definition:
  literal form: präzises Elektrowerkzeug mit austauschbaren Aufsätzen, das in der Konservierung und Restaurierung verwendet wird, um feine Arbeiten wie Schleifen, Bohren oder Polieren durchzuführen. Es ermöglicht exakte Materialbearbeitung unter Kontrolle und ohne großen Kraftaufwand.

technische Geräte
type: Concept
notation: GF9C49
created: 2026-01-30
issued: 2026-01-30
modified: 2026-02-04
publisher: Leibniz-Zentrum für Archäologie (LEIZA)
broader: Konservierungs- und Restaurierungswerkzeuge
broader transitive: Maßnahme
broader transitive: Konservierungs- und Restaurierungswerkzeuge
in scheme: Konservierungs- und Restaurierungsfachthesaurus für archäologische Kulturgüter
pref label: technische Geräte
  type: Label
  rank: preferred
definition: Oberbegriff für komplexe, technische Hilfsmittel mit elektrischen oder elektronischen Komponenten, die durch Strom betrieben werden.
narrower: Heißluftföhn
narrower: Absauganlage
narrower: Gefriertrocknungsanlage
narrower: Schleifkörper
narrower: Ultraschallgerät
narrower: Ultraschallfeinmeißel
narrower: Plasmaanlage
narrower: Airbrush-System
narrower: Wärmeschrank
narrower: Mikromotor
narrower: Lötvorrichtung
narrower: industrielle Mikrowellenkammer
narrower: Schmelzofen
narrower: Exsikkator
narrower: Feinstrahlgerät
narrower: Druckluft

Lötvorrichtung
type: Concept
notation: DAC482
created: 2026-01-30
issued: 2026-01-30
modified: 2026-02-04
publisher: Leibniz-Zentrum für Archäologie (LEIZA)
broader: technische Geräte
broader transitive: technische Geräte
broader transitive: Konservierungs- und Restaurierungswerkzeuge
broader transitive: Maßnahme
in scheme: Konservierungs- und Restaurierungsfachthesaurus für archäologische Kulturgüter
pref label: Lötvorrichtung
  type: Label
  rank: preferred

industrielle Mikrowellenkammer
type: Concept
notation: F8323G
created: 2026-01-30
issued: 2026-01-30
modified: 2026-02-04
publisher: Leibniz-Zentrum für Archäologie (LEIZA)
broader: technische Geräte
broader transitive: technische Geräte
broader transitive: Konservierungs- und Restaurierungswerkzeuge
broader transitive: Maßnahme
in scheme: Konservierungs- und Restaurierungsfachthesaurus für archäologische Kulturgüter
pref label: industrielle Mikrowellenkammer
  type: Label
  rank: preferred
alternative label: Mikrowelle
alt label: Mikrowelle
  type: Label
  rank: preferred

Schmelzofen
type: Concept
notation: FA9542
created: 2026-01-30
issued: 2026-01-30
modified: 2026-02-04
publisher: Leibniz-Zentrum für Archäologie (LEIZA)
broader: technische Geräte
broader transitive: technische Geräte
broader transitive: Konservierungs- und Restaurierungswerkzeuge
broader transitive: Maßnahme
in scheme: Konservierungs- und Restaurierungsfachthesaurus für archäologische Kulturgüter
pref label: Schmelzofen
  type: Label
  rank: preferred

Exsikkator
type: Concept
notation: FG9C55
created: 2026-01-30
issued: 2026-01-30
modified: 2026-02-04
publisher: Leibniz-Zentrum für Archäologie (LEIZA)
broader: technische Geräte
broader transitive: technische Geräte
broader transitive: Konservierungs- und Restaurierungswerkzeuge
broader transitive: Maßnahme
in scheme: Konservierungs- und Restaurierungsfachthesaurus für archäologische Kulturgüter
pref label: Exsikkator
  type: Label
  rank: preferred

Feinstrahlgerät
type: Concept
notation: G487C2
created: 2026-01-30
issued: 2026-01-30
modified: 2026-02-04
publisher: Leibniz-Zentrum für Archäologie (LEIZA)
broader: technische Geräte
broader transitive: Maßnahme
broader transitive: Konservierungs- und Restaurierungswerkzeuge
broader transitive: technische Geräte
in scheme: Konservierungs- und Restaurierungsfachthesaurus für archäologische Kulturgüter
pref label: Feinstrahlgerät
  type: Label
  rank: preferred
alternative label: Mikrostrahlgerät
alternative label: Sandstrahlgerät
alt label: Mikrostrahlgerät
  type: Label
  rank: preferred
alt label: Sandstrahlgerät
  type: Label
  rank: normal

Druckluft
type: Concept
notation: GF3586
created: 2026-01-30
issued: 2026-01-30
modified: 2026-02-04
publisher: Leibniz-Zentrum für Archäologie (LEIZA)
broader: technische Geräte
broader transitive: Konservierungs- und Restaurierungswerkzeuge
broader transitive: Maßnahme
broader transitive: technische Geräte
in scheme: Konservierungs- und Restaurierungsfachthesaurus für archäologische Kulturgüter
pref label: Druckluft
  type: Label
  rank: preferred

Korundschleifkörper
type: Concept
notation: A22C84
created: 2026-01-30
issued: 2026-01-30
modified: 2026-02-04
publisher: Leibniz-Zentrum für Archäologie (LEIZA)
broader: Schleifkörper
broader transitive: Schleifkörper
broader transitive: Konservierungs- und Restaurierungswerkzeuge
broader transitive: Maßnahme
broader transitive: technische Geräte
in scheme: Konservierungs- und Restaurierungsfachthesaurus für archäologische Kulturgüter
pref label: Korundschleifkörper
  type: Label
  rank: preferred

Gummischleifkörper
type: Concept
notation: A97F31
preferred label: rubber abrasives @en
created: 2026-01-30
issued: 2026-01-30
modified: 2026-02-04
publisher: Leibniz-Zentrum für Archäologie (LEIZA)
broader: Schleifkörper
broader transitive: Schleifkörper
broader transitive: Konservierungs- und Restaurierungswerkzeuge
broader transitive: Maßnahme
broader transitive: technische Geräte
in scheme: Konservierungs- und Restaurierungsfachthesaurus für archäologische Kulturgüter
pref label: Gummischleifkörper
  type: Label
  rank: preferred
pref label: rubber abrasives
  type: Label
  rank: normal
alternative label: Gummipolierer
alternative label: rubber polisher @en
alt label: Gummipolierer
  type: Label
  rank: preferred
alt label: rubber polisher
  type: Label
  rank: normal

Diamantschleifkörper
type: Concept
notation: ABF57G
preferred label: diamand grinding wheel @en
created: 2026-01-30
issued: 2026-01-30
modified: 2026-02-04
publisher: Leibniz-Zentrum für Archäologie (LEIZA)
broader: Schleifkörper
broader transitive: Schleifkörper
broader transitive: Konservierungs- und Restaurierungswerkzeuge
broader transitive: Maßnahme
broader transitive: technische Geräte
in scheme: Konservierungs- und Restaurierungsfachthesaurus für archäologische Kulturgüter
pref label: Diamantschleifkörper
  type: Label
  rank: preferred
pref label: diamand grinding wheel
  type: Label
  rank: normal

Metallfräser
type: Concept
notation: CDF423
preferred label: metal cutter @en
created: 2026-01-30
issued: 2026-01-30
modified: 2026-02-04
publisher: Leibniz-Zentrum für Archäologie (LEIZA)
broader: Schleifkörper
broader transitive: Schleifkörper
broader transitive: Konservierungs- und Restaurierungswerkzeuge
broader transitive: Maßnahme
broader transitive: technische Geräte
in scheme: Konservierungs- und Restaurierungsfachthesaurus für archäologische Kulturgüter
pref label: Metallfräser
  type: Label
  rank: preferred
pref label: metal cutter
  type: Label
  rank: normal

Pinsel
type: Concept
notation: CC2BBB
created: 2026-01-30
issued: 2026-01-30
modified: 2026-02-04
publisher: Leibniz-Zentrum für Archäologie (LEIZA)
broader: manuelle Werkzeuge
broader transitive: Konservierungs- und Restaurierungswerkzeuge
broader transitive: Maßnahme
broader transitive: manuelle Werkzeuge
in scheme: Konservierungs- und Restaurierungsfachthesaurus für archäologische Kulturgüter
pref label: Pinsel
  type: Label
  rank: preferred

manuelle Werkzeuge
type: Concept
notation: D941BB
created: 2026-01-30
issued: 2026-01-30
modified: 2026-02-04
publisher: Leibniz-Zentrum für Archäologie (LEIZA)
broader: Konservierungs- und Restaurierungswerkzeuge
broader transitive: Maßnahme
broader transitive: Konservierungs- und Restaurierungswerkzeuge
in scheme: Konservierungs- und Restaurierungsfachthesaurus für archäologische Kulturgüter
pref label: manuelle Werkzeuge
  type: Label
  rank: preferred
definition: Oberbegriff für nicht-elektronische Geräte, die durch rein menschliche Kraft funktionieren.
narrower: Schwamm
narrower: Draht (Werkzeug)
narrower: Silberputztuch
narrower: Groom/Stick®
narrower: Textil
narrower: Stachelschweinborste
narrower: Zellstoff
narrower: Bürste
narrower: Kunststoffhammer
narrower: Acrylglaspunzen
narrower: Pinsel
narrower: Wattestäbchen
narrower: Gaze
narrower: Putzholz
narrower: Metallschaber
narrower: Wattepads
narrower: Holzschaber
narrower: Nadel
narrower: Skalpell
narrower: Radiergummi
narrower: Acrylglasschaber

Wattestäbchen
type: Concept
notation: CG825A
preferred label: cotton swab @en
created: 2026-01-30
issued: 2026-01-30
modified: 2026-02-04
publisher: Leibniz-Zentrum für Archäologie (LEIZA)
broader: manuelle Werkzeuge
broader transitive: Konservierungs- und Restaurierungswerkzeuge
broader transitive: Maßnahme
broader transitive: manuelle Werkzeuge
in scheme: Konservierungs- und Restaurierungsfachthesaurus für archäologische Kulturgüter
pref label: Wattestäbchen
  type: Label
  rank: preferred
pref label: cotton swab
  type: Label
  rank: normal

Galvanoform
type: Concept
notation: A2GC16
created: 2026-01-30
issued: 2026-01-30
modified: 2026-02-04
publisher: Leibniz-Zentrum für Archäologie (LEIZA)
broader: [Formtyp]
broader transitive: [Formtyp]
broader transitive: Nachbildung für wissenschaftliche Zwecke
broader transitive: Maßnahme
broader transitive: Abformung
broader transitive: analoge Abformung
broader transitive: [Vorgehensweise]
definition: Form zur Herstellung galvanoplastischer Kopien.
in scheme: Konservierungs- und Restaurierungsfachthesaurus für archäologische Kulturgüter
pref label: Galvanoform
  type: Label
  rank: preferred

[Formtyp]
type: Concept
type: NonIndexingConcept
type: GuideTerm
notation: FFA16B
created: 2026-01-30
issued: 2026-01-30
modified: 2026-02-04
publisher: Leibniz-Zentrum für Archäologie (LEIZA)
broader: analoge Abformung
broader transitive: analoge Abformung
broader transitive: Nachbildung für wissenschaftliche Zwecke
broader transitive: Maßnahme
broader transitive: Abformung
broader transitive: [Vorgehensweise]
definition: strukturierender Sammelbegriff, der die unterschiedlichen Typen von Formen beinhaltet
in scheme: Konservierungs- und Restaurierungsfachthesaurus für archäologische Kulturgüter
narrower: Schwenkform
narrower: Galvanoform
narrower: Laminierform
narrower: Gussform
narrower: Steiggussform
narrower: Quetschform
narrower: Spiegelform
pref label: [Formtyp]
  type: Label
  rank: preferred
alternative label: [Formart]
alt label: [Formart]
  type: Label
  rank: preferred

Nachbildung für wissenschaftliche Zwecke
type: Concept
notation: C3A182
created: 2026-01-30
issued: 2026-01-30
modified: 2026-02-04
publisher: Leibniz-Zentrum für Archäologie (LEIZA)
broader: Maßnahme
broader transitive: Maßnahme
definition: Erstellung aussagekräftiger Vergleichsstücke zu wissenschaftlichem Zweck
in scheme: Konservierungs- und Restaurierungsfachthesaurus für archäologische Kulturgüter
narrower: [Vorgehensweise]
narrower: [Nachbildungsergebnisse]
pref label: Nachbildung für wissenschaftliche Zwecke
  type: Label
  rank: preferred
alternative label: Kopieren
alternative label: Nachbilden
alt label: Nachbilden
  type: Label
  rank: preferred
alt label: Kopieren
  type: Label
  rank: normal

Abformung
type: Concept
notation: DAG2A8
created: 2026-01-30
issued: 2026-01-30
modified: 2026-02-04
publisher: Leibniz-Zentrum für Archäologie (LEIZA)
broader: [Vorgehensweise]
broader transitive: Nachbildung für wissenschaftliche Zwecke
broader transitive: Maßnahme
broader transitive: [Vorgehensweise]
definition: Methode zur Erfassung der Form und aller sichtbaren Informationen der Oberflächen eines Objektes
in scheme: Konservierungs- und Restaurierungsfachthesaurus für archäologische Kulturgüter
narrower: analoge Abformung
narrower: 3D-Digitalisierung
pref label: Abformung
  type: Label
  rank: preferred

analoge Abformung
type: Concept
notation: G52378
created: 2026-01-30
issued: 2026-01-30
modified: 2026-02-04
publisher: Leibniz-Zentrum für Archäologie (LEIZA)
broader: Abformung
broader transitive: Nachbildung für wissenschaftliche Zwecke
broader transitive: Maßnahme
broader transitive: Abformung
broader transitive: [Vorgehensweise]
definition: Methode, bei der Abformmaterialien auf das Original aufgetragen werden, um das zu kopierende Objekt als Negativform abzubilden.
in scheme: Konservierungs- und Restaurierungsfachthesaurus für archäologische Kulturgüter
narrower: Formbau
narrower: [Formaufbau]
narrower: [Formtyp]
pref label: analoge Abformung
  type: Label
  rank: preferred

[Vorgehensweise]
type: Concept
type: NonIndexingConcept
type: GuideTerm
notation: G79CAC
created: 2026-01-30
issued: 2026-01-30
modified: 2026-02-04
publisher: Leibniz-Zentrum für Archäologie (LEIZA)
broader: Nachbildung für wissenschaftliche Zwecke
broader transitive: Nachbildung für wissenschaftliche Zwecke
broader transitive: Maßnahme
definition: strukturierender Sammelbegriff für verschiedene Methoden, die zur Herstellung von wissenschaftlichen Vergleichsstücken angewandt werden können
in scheme: Konservierungs- und Restaurierungsfachthesaurus für archäologische Kulturgüter
narrower: Abformung
narrower: Modellanfertigung
narrower: Kolorierung
narrower: Kopieherstellung
narrower: Rekonstruktion (Methode)
narrower: Reproduktion (Methode)
pref label: [Vorgehensweise]
  type: Label
  rank: preferred

Mehrteilige Form
type: Concept
notation: B2D9C9
created: 2026-01-30
issued: 2026-01-30
modified: 2026-02-04
publisher: Leibniz-Zentrum für Archäologie (LEIZA)
broader: [Formaufbau]
broader transitive: Nachbildung für wissenschaftliche Zwecke
broader transitive: Maßnahme
broader transitive: Abformung
broader transitive: analoge Abformung
broader transitive: [Vorgehensweise]
broader transitive: [Formaufbau]
definition: Form, die aus mehreren Formbauteilen besteht.
in scheme: Konservierungs- und Restaurierungsfachthesaurus für archäologische Kulturgüter
pref label: Mehrteilige Form
  type: Label
  rank: preferred

[Formaufbau]
type: Concept
type: NonIndexingConcept
type: GuideTerm
notation: FBGFC2
created: 2026-01-30
issued: 2026-01-30
modified: 2026-02-04
publisher: Leibniz-Zentrum für Archäologie (LEIZA)
broader: analoge Abformung
broader transitive: Nachbildung für wissenschaftliche Zwecke
broader transitive: Maßnahme
broader transitive: Abformung
broader transitive: analoge Abformung
broader transitive: [Vorgehensweise]
definition: strukturierender Sammelbegriff, für die Aufbauarten von Formen, d.h. aus wie vielen Teilen sie bestehend.
in scheme: Konservierungs- und Restaurierungsfachthesaurus für archäologische Kulturgüter
pref label: [Formaufbau]
  type: Label
  rank: preferred
narrower: Mehrteilige Form
narrower: Einteilige Form

Galvanisieren
type: Concept
notation: BAB7B1
created: 2026-01-30
issued: 2026-01-30
modified: 2026-02-04
publisher: Leibniz-Zentrum für Archäologie (LEIZA)
broader: Kopieherstellung
broader transitive: Kopieherstellung
broader transitive: Nachbildung für wissenschaftliche Zwecke
broader transitive: Maßnahme
broader transitive: [Vorgehensweise]
definition: Methode zur Herstellung einer metallischen Kopie durch Beschichten einer Neagtivform mit metallischen Werkstoffen in einem galvanischen Verfahren
in scheme: Konservierungs- und Restaurierungsfachthesaurus für archäologische Kulturgüter
pref label: Galvanisieren
  type: Label
  rank: preferred

Gaze
type: Concept
notation: D11BD4
created: 2026-01-30
issued: 2026-01-30
modified: 2026-02-04
publisher: Leibniz-Zentrum für Archäologie (LEIZA)
broader: manuelle Werkzeuge
broader transitive: Maßnahme
broader transitive: Konservierungs- und Restaurierungswerkzeuge
broader transitive: manuelle Werkzeuge
in scheme: Konservierungs- und Restaurierungsfachthesaurus für archäologische Kulturgüter
pref label: Gaze
  type: Label
  rank: preferred

Putzholz
type: Concept
notation: D1A63D
preferred label: cleaning wood stick @en
created: 2026-01-30
issued: 2026-01-30
modified: 2026-02-04
publisher: Leibniz-Zentrum für Archäologie (LEIZA)
broader: manuelle Werkzeuge
broader transitive: Maßnahme
broader transitive: Konservierungs- und Restaurierungswerkzeuge
broader transitive: manuelle Werkzeuge
in scheme: Konservierungs- und Restaurierungsfachthesaurus für archäologische Kulturgüter
pref label: Putzholz
  type: Label
  rank: preferred
pref label: cleaning wood stick
  type: Label
  rank: normal

3D-Druckverfahren
type: Concept
notation: D772G6
created: 2026-01-30
issued: 2026-01-30
modified: 2026-02-04
publisher: Leibniz-Zentrum für Archäologie (LEIZA)
broader: Kopieherstellung
broader transitive: Kopieherstellung
broader transitive: Nachbildung für wissenschaftliche Zwecke
broader transitive: Maßnahme
broader transitive: [Vorgehensweise]
definition: Methode zur Herstellung einer Kopie aus photogrammetrischen Daten durch schichtweises Auftragen von Material nach digitalem 3D-Modell.
in scheme: Konservierungs- und Restaurierungsfachthesaurus für archäologische Kulturgüter
pref label: 3D-Druckverfahren
  type: Label
  rank: preferred
alternative label: 3D-Printing
alternative label: dreidimensionales Drucken
alt label: 3D-Printing
  type: Label
  rank: preferred
alt label: dreidimensionales Drucken
  type: Label
  rank: normal

Wattepads
type: Concept
notation: D84847
created: 2026-01-30
issued: 2026-01-30
modified: 2026-02-04
publisher: Leibniz-Zentrum für Archäologie (LEIZA)
broader: manuelle Werkzeuge
broader transitive: Maßnahme
broader transitive: Konservierungs- und Restaurierungswerkzeuge
broader transitive: manuelle Werkzeuge
in scheme: Konservierungs- und Restaurierungsfachthesaurus für archäologische Kulturgüter
pref label: Wattepads
  type: Label
  rank: preferred

Formausguss
type: Concept
notation: D9F7AC
created: 2026-01-30
issued: 2026-01-30
modified: 2026-02-04
publisher: Leibniz-Zentrum für Archäologie (LEIZA)
broader: Kopieherstellung
broader transitive: Kopieherstellung
broader transitive: Nachbildung für wissenschaftliche Zwecke
broader transitive: Maßnahme
broader transitive: [Vorgehensweise]
definition: Methode zur Herstellung eines Positives durch Ausgießen, Auspinseln, Ausspachteln, Beschichten (Ausformen) der Negativform mit aushärtenden Werkstoffen (Kunstharze, Gips, etc.).
in scheme: Konservierungs- und Restaurierungsfachthesaurus für archäologische Kulturgüter
pref label: Formausguss
  type: Label
  rank: preferred

Einteilige Form
type: Concept
notation: F7G7CB
created: 2026-01-30
issued: 2026-01-30
modified: 2026-02-04
publisher: Leibniz-Zentrum für Archäologie (LEIZA)
broader: [Formaufbau]
broader transitive: Nachbildung für wissenschaftliche Zwecke
broader transitive: Maßnahme
broader transitive: Abformung
broader transitive: analoge Abformung
broader transitive: [Vorgehensweise]
broader transitive: [Formaufbau]
definition: Form, die aus einem Formbauteil besteht - siehe Spiegelform.
in scheme: Konservierungs- und Restaurierungsfachthesaurus für archäologische Kulturgüter
pref label: Einteilige Form
  type: Label
  rank: preferred

Kopieherstellung
type: Concept
notation: F8F7CF
created: 2026-01-30
issued: 2026-01-30
modified: 2026-02-04
publisher: Leibniz-Zentrum für Archäologie (LEIZA)
broader: [Vorgehensweise]
broader transitive: Nachbildung für wissenschaftliche Zwecke
broader transitive: Maßnahme
broader transitive: [Vorgehensweise]
definition: Methode, bei der aus der zuvor hergestellten Form ein dem Aussehen des originalen Objektes entsprechendes neues Objekt hergestellt wird.
in scheme: Konservierungs- und Restaurierungsfachthesaurus für archäologische Kulturgüter
pref label: Kopieherstellung
  type: Label
  rank: preferred
narrower: Galvanisieren
narrower: 3D-Druckverfahren
narrower: Formausguss

Radiergummi
type: Concept
notation: F91CBB
preferred label: eraser @en
created: 2026-01-30
issued: 2026-01-30
modified: 2026-02-04
publisher: Leibniz-Zentrum für Archäologie (LEIZA)
broader: manuelle Werkzeuge
broader transitive: Maßnahme
broader transitive: Konservierungs- und Restaurierungswerkzeuge
broader transitive: manuelle Werkzeuge
in scheme: Konservierungs- und Restaurierungsfachthesaurus für archäologische Kulturgüter
pref label: Radiergummi
  type: Label
  rank: preferred
pref label: eraser
  type: Label
  rank: normal

3D-Digitalisierung
type: Concept
notation: GC14B8
created: 2026-01-30
issued: 2026-01-30
modified: 2026-02-04
publisher: Leibniz-Zentrum für Archäologie (LEIZA)
broader: Abformung
broader transitive: Nachbildung für wissenschaftliche Zwecke
broader transitive: Maßnahme
broader transitive: Abformung
broader transitive: [Vorgehensweise]
definition: Durch photogrammetrische Verfahren (z.B. Streifenlichtprojektion, Laserscanning) erzeugte digitale, dreidimensionale Bildkopie
in scheme: Konservierungs- und Restaurierungsfachthesaurus für archäologische Kulturgüter
pref label: 3D-Digitalisierung
  type: Label
  rank: preferred
alternative label: 3D-Scan (Abformmethode)
alt label: 3D-Scan (Abformmethode)
  type: Label
  rank: preferred

Kopie
type: Concept
notation: A7FC45
created: 2026-01-30
issued: 2026-01-30
modified: 2026-02-04
publisher: Leibniz-Zentrum für Archäologie (LEIZA)
broader: [Nachbildungsergebnisse]
broader transitive: [Nachbildungsergebnisse]
broader transitive: Nachbildung für wissenschaftliche Zwecke
broader transitive: Maßnahme
definition: Durch Abformen nachgebildetes Objekt eines Vorbildgegenstandes, welches u.A. zur Erforschung der Typologie, Oberflächeneigenschaften und/oder Farbgebung des Originals genutzt wird.
in scheme: Konservierungs- und Restaurierungsfachthesaurus für archäologische Kulturgüter
narrower: Kunstharzkopie
narrower: Gipskopie
narrower: Galvanoplastik
pref label: Kopie
  type: Label
  rank: preferred

Modellanfertigung
type: Concept
notation: BD7FF8
created: 2026-01-30
issued: 2026-01-30
modified: 2026-02-04
publisher: Leibniz-Zentrum für Archäologie (LEIZA)
broader: [Vorgehensweise]
broader transitive: Nachbildung für wissenschaftliche Zwecke
broader transitive: Maßnahme
broader transitive: [Vorgehensweise]
definition: Methode zur Herstellung von modellhaften Darstellung auf Forschungsergebnissen basierender Gegebenheiten.
in scheme: Konservierungs- und Restaurierungsfachthesaurus für archäologische Kulturgüter
pref label: Modellanfertigung
  type: Label
  rank: preferred

Ergänzung (an Kopie)
type: Concept
notation: BDCBC3
created: 2026-01-30
issued: 2026-01-30
modified: 2026-02-04
publisher: Leibniz-Zentrum für Archäologie (LEIZA)
broader: Rekonstruktion (Methode)
broader transitive: Nachbildung für wissenschaftliche Zwecke
broader transitive: Maßnahme
broader transitive: [Vorgehensweise]
broader transitive: Rekonstruktion (Methode)
definition: Ausbesserung von Fehlstellen einer Kunstharz- oder Galvanokopie nach Vorbild eines originalen Objektes.
in scheme: Konservierungs- und Restaurierungsfachthesaurus für archäologische Kulturgüter
pref label: Ergänzung (an Kopie)
  type: Label
  rank: preferred

Rekonstruktion (Methode)
type: Concept
notation: FA2332
created: 2026-01-30
issued: 2026-01-30
modified: 2026-02-04
publisher: Leibniz-Zentrum für Archäologie (LEIZA)
broader: [Vorgehensweise]
broader transitive: Nachbildung für wissenschaftliche Zwecke
broader transitive: Maßnahme
broader transitive: [Vorgehensweise]
definition: Methode zur Wiederherstellung und/oder Nachbildung eines ursprünglichen Zustandes. Die Rekonstruktion kann sowohl auf Grundlage einer analogen als auch einer digitalen Kopie erfolgen.
in scheme: Konservierungs- und Restaurierungsfachthesaurus für archäologische Kulturgüter
pref label: Rekonstruktion (Methode)
  type: Label
  rank: preferred
narrower: Ergänzung (an Kopie)
narrower: Rückformung

[Nachbildungsergebnisse]
type: Concept
type: NonIndexingConcept
type: GuideTerm
notation: C11192
created: 2026-01-30
issued: 2026-01-30
modified: 2026-02-04
publisher: Leibniz-Zentrum für Archäologie (LEIZA)
broader: Nachbildung für wissenschaftliche Zwecke
broader transitive: Nachbildung für wissenschaftliche Zwecke
broader transitive: Maßnahme
definition: struktureller Sammelbegriff für die bei der Nachbildungstätigkeit entstehenden Objekte
in scheme: Konservierungs- und Restaurierungsfachthesaurus für archäologische Kulturgüter
pref label: [Nachbildungsergebnisse]
  type: Label
  rank: preferred
narrower: Kopie
narrower: Reproduktion (Objekt)
narrower: Rekonstruktion (Objekt)
narrower: Modell

Reproduktion (Objekt)
type: Concept
notation: C5GA26
created: 2026-01-30
issued: 2026-01-30
modified: 2026-02-04
publisher: Leibniz-Zentrum für Archäologie (LEIZA)
broader: [Nachbildungsergebnisse]
broader transitive: [Nachbildungsergebnisse]
broader transitive: Nachbildung für wissenschaftliche Zwecke
broader transitive: Maßnahme
definition: Objekt, welches nach Vorbild eines von einer anderen Person angefertigten Originals hergestellt wurde, ohne das dieses Original im Vorfeld abgeformt wurde
in scheme: Konservierungs- und Restaurierungsfachthesaurus für archäologische Kulturgüter
pref label: Reproduktion (Objekt)
  type: Label
  rank: preferred

Rekonstruktion (Objekt)
type: Concept
notation: D532GF
created: 2026-01-30
issued: 2026-01-30
modified: 2026-02-04
publisher: Leibniz-Zentrum für Archäologie (LEIZA)
broader: [Nachbildungsergebnisse]
broader transitive: [Nachbildungsergebnisse]
broader transitive: Nachbildung für wissenschaftliche Zwecke
broader transitive: Maßnahme
definition: Nachgebildetes Objekt, das einen angenommenen, ursprünglichen Zustand eines Vorbildgegendstandes wiedergibt.
in scheme: Konservierungs- und Restaurierungsfachthesaurus für archäologische Kulturgüter
pref label: Rekonstruktion (Objekt)
  type: Label
  rank: preferred

Modell
type: Concept
notation: F9549F
created: 2026-01-30
issued: 2026-01-30
modified: 2026-02-04
publisher: Leibniz-Zentrum für Archäologie (LEIZA)
broader: [Nachbildungsergebnisse]
broader transitive: [Nachbildungsergebnisse]
broader transitive: Nachbildung für wissenschaftliche Zwecke
broader transitive: Maßnahme
definition: Auf Forschungsergebnissen basierender Nachbau, ohne aktuell extistierendes Vorbild.
in scheme: Konservierungs- und Restaurierungsfachthesaurus für archäologische Kulturgüter
pref label: Modell
  type: Label
  rank: preferred

Kolorierung
type: Concept
notation: F1F372
created: 2026-01-30
issued: 2026-01-30
modified: 2026-02-04
publisher: Leibniz-Zentrum für Archäologie (LEIZA)
broader: [Vorgehensweise]
broader transitive: Nachbildung für wissenschaftliche Zwecke
broader transitive: Maßnahme
broader transitive: [Vorgehensweise]
definition: Methode zur farbigen Fassung einer angefertigten Nachbildung nach originalem Objektvorbild
in scheme: Konservierungs- und Restaurierungsfachthesaurus für archäologische Kulturgüter
pref label: Kolorierung
  type: Label
  rank: preferred
alternative label: Färben
alternative label: Kolorieren
alt label: Kolorieren
  type: Label
  rank: preferred
alt label: Färben
  type: Label
  rank: normal

Rückformung
type: Concept
notation: G6282F
created: 2026-01-30
issued: 2026-01-30
modified: 2026-02-04
publisher: Leibniz-Zentrum für Archäologie (LEIZA)
broader: Rekonstruktion (Methode)
broader transitive: Nachbildung für wissenschaftliche Zwecke
broader transitive: Maßnahme
broader transitive: [Vorgehensweise]
broader transitive: Rekonstruktion (Methode)
definition: Umformung einer Kunstharz- oder Galvanokopie zur Herstellung der angenommenen, ursprünglichen Form eines Vorbildobjektes.
in scheme: Konservierungs- und Restaurierungsfachthesaurus für archäologische Kulturgüter
pref label: Rückformung
  type: Label
  rank: preferred

Reproduktion (Methode)
type: Concept
notation: G59852
created: 2026-01-30
issued: 2026-01-30
modified: 2026-02-04
publisher: Leibniz-Zentrum für Archäologie (LEIZA)
broader: [Vorgehensweise]
broader transitive: Nachbildung für wissenschaftliche Zwecke
broader transitive: Maßnahme
broader transitive: [Vorgehensweise]
definition: Methoden zur Nachbildung oder Wiedergabe eines originalen Objektes, das von einer anderen Person angefertigt wurde. Die Methode beinhaltet keine analoge oder digitale Abformung des Objekts.
in scheme: Konservierungs- und Restaurierungsfachthesaurus für archäologische Kulturgüter
pref label: Reproduktion (Methode)
  type: Label
  rank: preferred

Kunstharzkopie
type: Concept
notation: B689B6
created: 2026-01-30
issued: 2026-01-30
modified: 2026-02-04
publisher: Leibniz-Zentrum für Archäologie (LEIZA)
broader: Kopie
broader transitive: Kopie
broader transitive: [Nachbildungsergebnisse]
broader transitive: Nachbildung für wissenschaftliche Zwecke
broader transitive: Maßnahme
definition: Kopie, die aus polymeren Werkstoffen hergestellt wird (Epoxid-, Polyester-, Acryl-, Polyurethan-Harz), mit oder ohne Verstärkungsfasern.
in scheme: Konservierungs- und Restaurierungsfachthesaurus für archäologische Kulturgüter
pref label: Kunstharzkopie
  type: Label
  rank: preferred

Gipskopie
type: Concept
notation: D2GGAC
created: 2026-01-30
issued: 2026-01-30
modified: 2026-02-04
publisher: Leibniz-Zentrum für Archäologie (LEIZA)
broader: Kopie
broader transitive: Kopie
broader transitive: [Nachbildungsergebnisse]
broader transitive: Nachbildung für wissenschaftliche Zwecke
broader transitive: Maßnahme
definition: Kopie, die aus Gips hergestellt wird.
in scheme: Konservierungs- und Restaurierungsfachthesaurus für archäologische Kulturgüter
pref label: Gipskopie
  type: Label
  rank: preferred

Galvanoplastik
type: Concept
notation: D9CC3C
created: 2026-01-30
issued: 2026-01-30
modified: 2026-02-04
publisher: Leibniz-Zentrum für Archäologie (LEIZA)
broader: Kopie
broader transitive: Kopie
broader transitive: [Nachbildungsergebnisse]
broader transitive: Nachbildung für wissenschaftliche Zwecke
broader transitive: Maßnahme
definition: Kopie aus Metall, die durch ein galvanisches Verfahren hergestellt wird
in scheme: Konservierungs- und Restaurierungsfachthesaurus für archäologische Kulturgüter
pref label: Galvanoplastik
  type: Label
  rank: preferred

Transportbedingungen
type: Concept
notation: BGG5A6
created: 2026-01-30
issued: 2026-01-30
modified: 2026-02-04
publisher: Leibniz-Zentrum für Archäologie (LEIZA)
broader: Handlungsempfehlung
broader transitive: Handlungsempfehlung
in scheme: Konservierungs- und Restaurierungsfachthesaurus für archäologische Kulturgüter
pref label: Transportbedingungen
  type: Label
  rank: preferred

Gesundheitsschutz
type: Concept
notation: CD5C3F
created: 2026-01-30
issued: 2026-01-30
modified: 2026-02-04
publisher: Leibniz-Zentrum für Archäologie (LEIZA)
broader: Handlungsempfehlung
broader transitive: Handlungsempfehlung
in scheme: Konservierungs- und Restaurierungsfachthesaurus für archäologische Kulturgüter
pref label: Gesundheitsschutz
  type: Label
  rank: preferred

Lagerungsbedingungen
type: Concept
notation: D1CFD5
created: 2026-01-30
issued: 2026-01-30
modified: 2026-02-04
publisher: Leibniz-Zentrum für Archäologie (LEIZA)
broader: Handlungsempfehlung
broader transitive: Handlungsempfehlung
in scheme: Konservierungs- und Restaurierungsfachthesaurus für archäologische Kulturgüter
pref label: Lagerungsbedingungen
  type: Label
  rank: preferred

Handlungsempfehlung
type: Concept
notation: DAB4B7
created: 2026-01-30
issued: 2026-01-30
modified: 2026-02-04
publisher: Leibniz-Zentrum für Archäologie (LEIZA)
definition: Durch einen fachlich qualifizierten Restaurator formulierte Hinweise zur Handhabung eines Objektes, um dieses nachhaltig vor negativer Beeinträchtigung zu schützen und zu erhalten
in scheme: Konservierungs- und Restaurierungsfachthesaurus für archäologische Kulturgüter
narrower: Transportbedingungen
narrower: Gesundheitsschutz
narrower: Lagerungsbedingungen
narrower: Ausstellungsparameter
narrower: Handhabung
pref label: Handlungsempfehlung
  type: Label
  rank: preferred
top concept of: Konservierungs- und Restaurierungsfachthesaurus für archäologische Kulturgüter

Ausstellungsparameter
type: Concept
notation: D6A11G
created: 2026-01-30
issued: 2026-01-30
modified: 2026-02-04
publisher: Leibniz-Zentrum für Archäologie (LEIZA)
broader: Handlungsempfehlung
broader transitive: Handlungsempfehlung
in scheme: Konservierungs- und Restaurierungsfachthesaurus für archäologische Kulturgüter
pref label: Ausstellungsparameter
  type: Label
  rank: preferred

Handhabung
type: Concept
notation: D949G6
created: 2026-01-30
issued: 2026-01-30
modified: 2026-02-04
publisher: Leibniz-Zentrum für Archäologie (LEIZA)
broader: Handlungsempfehlung
broader transitive: Handlungsempfehlung
definition: empfohlene Umgangs- und Vorgehensweise bei der Bewegung und/oder dem Aufnehmen des Objektes oder dessen Trägersystems, zur Minimierung des Risikos einer ungewollten Beschädigung oder Zerstörung
in scheme: Konservierungs- und Restaurierungsfachthesaurus für archäologische Kulturgüter
pref label: Handhabung
  type: Label
  rank: preferred
alternative label: Händelbarkeit
alt label: Händelbarkeit
  type: Label
  rank: preferred

Maßnahmenbericht
type: Concept
notation: A8D3G1
created: 2026-01-30
issued: 2026-01-30
modified: 2026-02-04
publisher: Leibniz-Zentrum für Archäologie (LEIZA)
alternative label: Maßnahmendokumentation
alternative label: Restaurierungsbericht
alternative label: Restaurierungsprotokoll
broader: Dokumentation
broader transitive: Dokumentation
definition: schriftliche Dokumentation des Konservierungs-/Restaurierungskonzeptes, der durchgeführten Konservierungs- und Restaurierungsmaßnahmen sowie der dabei verwendeten Materialien und Werkzeuge.
in scheme: Konservierungs- und Restaurierungsfachthesaurus für archäologische Kulturgüter
alt label: Maßnahmendokumentation
  type: Label
  rank: normal
alt label: Restaurierungsbericht
  type: Label
  rank: preferred
alt label: Restaurierungsprotokoll
  type: Label
  rank: normal
pref label: Maßnahmenbericht
  type: Label
  rank: preferred

Dokumentation
type: Concept
notation: C8CG15
preferred label: documentation @en
created: 2026-01-30
issued: 2026-01-30
modified: 2026-02-04
publisher: Leibniz-Zentrum für Archäologie (LEIZA)
alternative label: report @en
definition: Sammelbegriff für Aufzeichnungen gemachter Beobachtungen und Handlungen
in scheme: Konservierungs- und Restaurierungsfachthesaurus für archäologische Kulturgüter
narrower: Maßnahmenbericht
narrower: Zustandsdokumentation
narrower: Technologische Auswertung
alt label: report
  type: Label
  rank: preferred
pref label: Dokumentation
  type: Label
  rank: preferred
pref label: documentation
  type: Label
  rank: normal
top concept of: Konservierungs- und Restaurierungsfachthesaurus für archäologische Kulturgüter

Zustandsfoto
type: Concept
notation: C33D85
created: 2026-01-30
issued: 2026-01-30
modified: 2026-02-04
publisher: Leibniz-Zentrum für Archäologie (LEIZA)
broader: Bildgebende Dokumentation
broader transitive: Dokumentation
broader transitive: Bildgebende Dokumentation
broader transitive: Zustandsdokumentation
in scheme: Konservierungs- und Restaurierungsfachthesaurus für archäologische Kulturgüter
pref label: Zustandsfoto
  type: Label
  rank: preferred

Bildgebende Dokumentation
type: Concept
notation: CB7747
created: 2026-01-30
issued: 2026-01-30
modified: 2026-02-04
publisher: Leibniz-Zentrum für Archäologie (LEIZA)
broader: Zustandsdokumentation
broader transitive: Dokumentation
broader transitive: Zustandsdokumentation
in scheme: Konservierungs- und Restaurierungsfachthesaurus für archäologische Kulturgüter
pref label: Bildgebende Dokumentation
  type: Label
  rank: preferred
narrower: Zeichnung
narrower: Zustandsfoto
narrower: Zustandskartierung
narrower: 3D-Scan
narrower: Röntgenbild

Zustandsdokumentation
type: Concept
notation: D3AF3A
preferred label: condition documentation @en
created: 2026-01-30
issued: 2026-01-30
modified: 2026-02-04
publisher: Leibniz-Zentrum für Archäologie (LEIZA)
alternative label: Zustandsbericht
alternative label: condition report @en
broader: Dokumentation
broader transitive: Dokumentation
definition: Aufzeichnungen zur Einschätzung des Erhaltungszustandes eines Objektes zu einem bestimmten Zeitpunkt mit speziellem Zweck
in scheme: Konservierungs- und Restaurierungsfachthesaurus für archäologische Kulturgüter
narrower: Bildgebende Dokumentation
narrower: Zustandsbericht
alt label: Zustandsbericht
  type: Label
  rank: preferred
alt label: condition report
  type: Label
  rank: normal
pref label: Zustandsdokumentation
  type: Label
  rank: preferred
pref label: condition documentation
  type: Label
  rank: normal

Zustandsbericht
type: Concept
notation: D7D443
created: 2026-01-30
issued: 2026-01-30
modified: 2026-02-04
publisher: Leibniz-Zentrum für Archäologie (LEIZA)
alternative label: Zustandsreport
alternative label: schriftliche Dokumentation
broader: Zustandsdokumentation
broader transitive: Dokumentation
broader transitive: Zustandsdokumentation
definition: schriftliche Auflistung der durchgeführten Untersuchungsmethoden, inklusive der verwendeten Gerätschaften sowie Beschreibung und Interpretation der dabei gemachten Beobachtungen und Ergebnisse hinsichtlich des aktuellen Erhaltungszustandes des Objektes
definition:
  literal form: schriftliche Auflistung der durchgeführten Untersuchungsmethoden, inklusive der verwendeten Gerätschaften sowie Beschreibung und Interpretation der dabei gemachten Beobachtungen und Ergebnisse hinsichtlich des aktuellen Erhaltungszustandes des Objektes
in scheme: Konservierungs- und Restaurierungsfachthesaurus für archäologische Kulturgüter
alt label: Zustandsreport
  type: Label
  rank: preferred
alt label: schriftliche Dokumentation
  type: Label
  rank: normal
pref label: Zustandsbericht
  type: Label
  rank: preferred

Zustandskartierung
type: Concept
notation: D9A6FA
created: 2026-01-30
issued: 2026-01-30
modified: 2026-02-04
publisher: Leibniz-Zentrum für Archäologie (LEIZA)
alternative label: Schadenskartierung
broader: Bildgebende Dokumentation
broader transitive: Dokumentation
broader transitive: Bildgebende Dokumentation
broader transitive: Zustandsdokumentation
definition: bildliche Aufzeichnung des Objektes mit gezielter Annotation der beobachteten Befunde (Schäden).
in scheme: Konservierungs- und Restaurierungsfachthesaurus für archäologische Kulturgüter
alt label: Schadenskartierung
  type: Label
  rank: preferred
pref label: Zustandskartierung
  type: Label
  rank: preferred

3D-Scan
type: Concept
notation: F58F6D
created: 2026-01-30
issued: 2026-01-30
modified: 2026-02-04
publisher: Leibniz-Zentrum für Archäologie (LEIZA)
broader: Bildgebende Dokumentation
broader transitive: Dokumentation
broader transitive: Bildgebende Dokumentation
broader transitive: Zustandsdokumentation
in scheme: Konservierungs- und Restaurierungsfachthesaurus für archäologische Kulturgüter
pref label: 3D-Scan
  type: Label
  rank: preferred

Röntgenbild
type: Concept
notation: FD2B2B
created: 2026-01-30
issued: 2026-01-30
modified: 2026-02-04
publisher: Leibniz-Zentrum für Archäologie (LEIZA)
broader: Bildgebende Dokumentation
broader transitive: Dokumentation
broader transitive: Bildgebende Dokumentation
broader transitive: Zustandsdokumentation
in scheme: Konservierungs- und Restaurierungsfachthesaurus für archäologische Kulturgüter
pref label: Röntgenbild
  type: Label
  rank: preferred

Technologische Auswertung
type: Concept
notation: G76B7G
created: 2026-01-30
issued: 2026-01-30
modified: 2026-02-04
publisher: Leibniz-Zentrum für Archäologie (LEIZA)
alternative label: Interpretation
broader: Dokumentation
broader transitive: Dokumentation
definition: Dokumentation und Erläuterung der festgestellten Beobachtungen und gewonnenen Erkentnisse hinsichtlich der anzunehmenden antiken Technologien.
in scheme: Konservierungs- und Restaurierungsfachthesaurus für archäologische Kulturgüter
alt label: Interpretation
  type: Label
  rank: preferred
pref label: Technologische Auswertung
  type: Label
  rank: preferred

Schwamm
type: Concept
notation: A341F9
preferred label: sponge @en
created: 2026-01-30
issued: 2026-01-30
modified: 2026-02-04
publisher: Leibniz-Zentrum für Archäologie (LEIZA)
broader: manuelle Werkzeuge
broader transitive: manuelle Werkzeuge
broader transitive: Konservierungs- und Restaurierungswerkzeuge
broader transitive: Maßnahme
in scheme: Konservierungs- und Restaurierungsfachthesaurus für archäologische Kulturgüter
pref label: Schwamm
  type: Label
  rank: preferred
pref label: sponge
  type: Label
  rank: normal

Groom/Stick®
type: Concept
notation: A7B5AA
created: 2026-01-30
issued: 2026-01-30
modified: 2026-02-04
publisher: Leibniz-Zentrum für Archäologie (LEIZA)
broader: manuelle Werkzeuge
broader transitive: manuelle Werkzeuge
broader transitive: Konservierungs- und Restaurierungswerkzeuge
broader transitive: Maßnahme
in scheme: Konservierungs- und Restaurierungsfachthesaurus für archäologische Kulturgüter
pref label: Groom/Stick®
  type: Label
  rank: preferred
definition: Produktname eines ph-neutralen, knetbaren Naturgummies der Firma Picreator Enterprises Ltd. zur Oberflächenreinigung. Laut Herstellerangaben abriebfest, rückstandsfrei und vollständig wiederverwendbar.
definition:
  literal form: Produktname eines ph-neutralen, knetbaren Naturgummies der Firma Picreator Enterprises Ltd. zur Oberflächenreinigung. Laut Herstellerangaben abriebfest, rückstandsfrei und vollständig wiederverwendbar.

Textil
type: Concept
notation: AA4F93
preferred label: textile @en
created: 2026-01-30
issued: 2026-01-30
modified: 2026-02-04
publisher: Leibniz-Zentrum für Archäologie (LEIZA)
broader: manuelle Werkzeuge
broader transitive: manuelle Werkzeuge
broader transitive: Konservierungs- und Restaurierungswerkzeuge
broader transitive: Maßnahme
in scheme: Konservierungs- und Restaurierungsfachthesaurus für archäologische Kulturgüter
pref label: Textil
  type: Label
  rank: preferred
pref label: textile
  type: Label
  rank: normal

Stachelschweinborste
type: Concept
notation: ACB46G
preferred label: porcupine bristle @en
created: 2026-01-30
issued: 2026-01-30
modified: 2026-02-04
publisher: Leibniz-Zentrum für Archäologie (LEIZA)
broader: manuelle Werkzeuge
broader transitive: manuelle Werkzeuge
broader transitive: Konservierungs- und Restaurierungswerkzeuge
broader transitive: Maßnahme
in scheme: Konservierungs- und Restaurierungsfachthesaurus für archäologische Kulturgüter
pref label: Stachelschweinborste
  type: Label
  rank: preferred
pref label: porcupine bristle
  type: Label
  rank: normal

Zellstoff
type: Concept
notation: B28GC7
created: 2026-01-30
issued: 2026-01-30
modified: 2026-02-04
publisher: Leibniz-Zentrum für Archäologie (LEIZA)
broader: manuelle Werkzeuge
broader transitive: manuelle Werkzeuge
broader transitive: Konservierungs- und Restaurierungswerkzeuge
broader transitive: Maßnahme
in scheme: Konservierungs- und Restaurierungsfachthesaurus für archäologische Kulturgüter
pref label: Zellstoff
  type: Label
  rank: preferred

Metallschaber
type: Concept
notation: D1C67A
preferred label: metal scraper @en
created: 2026-01-30
issued: 2026-01-30
modified: 2026-02-04
publisher: Leibniz-Zentrum für Archäologie (LEIZA)
broader: manuelle Werkzeuge
broader transitive: manuelle Werkzeuge
broader transitive: Konservierungs- und Restaurierungswerkzeuge
broader transitive: Maßnahme
in scheme: Konservierungs- und Restaurierungsfachthesaurus für archäologische Kulturgüter
pref label: Metallschaber
  type: Label
  rank: preferred
pref label: metal scraper
  type: Label
  rank: normal
alternative label: Dreikantschaber
alt label: Dreikantschaber
  type: Label
  rank: preferred

Holzschaber
type: Concept
notation: F18C56
preferred label: wood scraper @en
created: 2026-01-30
issued: 2026-01-30
modified: 2026-02-04
publisher: Leibniz-Zentrum für Archäologie (LEIZA)
broader: manuelle Werkzeuge
broader transitive: manuelle Werkzeuge
broader transitive: Konservierungs- und Restaurierungswerkzeuge
broader transitive: Maßnahme
in scheme: Konservierungs- und Restaurierungsfachthesaurus für archäologische Kulturgüter
pref label: Holzschaber
  type: Label
  rank: preferred
pref label: wood scraper
  type: Label
  rank: normal

Nadel
type: Concept
notation: F19194
created: 2026-01-30
issued: 2026-01-30
modified: 2026-02-04
publisher: Leibniz-Zentrum für Archäologie (LEIZA)
broader: manuelle Werkzeuge
broader transitive: manuelle Werkzeuge
broader transitive: Konservierungs- und Restaurierungswerkzeuge
broader transitive: Maßnahme
in scheme: Konservierungs- und Restaurierungsfachthesaurus für archäologische Kulturgüter
pref label: Nadel
  type: Label
  rank: preferred

Skalpell
type: Concept
notation: F71C33
preferred label: scalpel @en
created: 2026-01-30
issued: 2026-01-30
modified: 2026-02-04
publisher: Leibniz-Zentrum für Archäologie (LEIZA)
broader: manuelle Werkzeuge
broader transitive: manuelle Werkzeuge
broader transitive: Konservierungs- und Restaurierungswerkzeuge
broader transitive: Maßnahme
in scheme: Konservierungs- und Restaurierungsfachthesaurus für archäologische Kulturgüter
pref label: Skalpell
  type: Label
  rank: preferred
pref label: scalpel
  type: Label
  rank: normal

Acrylglasschaber
type: Concept
notation: G33846
preferred label: acrylic scraper @en
created: 2026-01-30
issued: 2026-01-30
modified: 2026-02-04
publisher: Leibniz-Zentrum für Archäologie (LEIZA)
broader: manuelle Werkzeuge
broader transitive: manuelle Werkzeuge
broader transitive: Konservierungs- und Restaurierungswerkzeuge
broader transitive: Maßnahme
in scheme: Konservierungs- und Restaurierungsfachthesaurus für archäologische Kulturgüter
pref label: Acrylglasschaber
  type: Label
  rank: preferred
pref label: acrylic scraper
  type: Label
  rank: normal
alternative label: Plexiglasschaber
alt label: Plexiglasschaber
  type: Label
  rank: preferred

Schwenkform
type: Concept
notation: A15D7G
created: 2026-01-30
issued: 2026-01-30
modified: 2026-02-04
publisher: Leibniz-Zentrum für Archäologie (LEIZA)
broader: [Formtyp]
broader transitive: [Formtyp]
broader transitive: Nachbildung für wissenschaftliche Zwecke
broader transitive: Maßnahme
broader transitive: Abformung
broader transitive: analoge Abformung
broader transitive: [Vorgehensweise]
definition: Form bei der die flüssige Ausformmasse eingegossen und durch Schwenken der Form in dieser verteilt wird.
in scheme: Konservierungs- und Restaurierungsfachthesaurus für archäologische Kulturgüter
pref label: Schwenkform
  type: Label
  rank: preferred

Formbau
type: Concept
notation: A2G7B9
created: 2026-01-30
issued: 2026-01-30
modified: 2026-02-04
publisher: Leibniz-Zentrum für Archäologie (LEIZA)
broader: analoge Abformung
broader transitive: analoge Abformung
broader transitive: Nachbildung für wissenschaftliche Zwecke
broader transitive: Maßnahme
broader transitive: Abformung
broader transitive: [Vorgehensweise]
definition: Methode zur Herstellung der Negativform eines Objektes durch Verarbeitung von Abformmaterialien. Die gebräuchlichste Form besteht aus einer dünnen, flexiblen Silikonkautschuckhaut, die die Oberfläche des Originals im negativ abzeichnet und einer starren Kapsel, in der die Hautform formschlüssig eingelegt wird.
definition:
  literal form: Methode zur Herstellung der Negativform eines Objektes durch Verarbeitung von Abformmaterialien. Die gebräuchlichste Form besteht aus einer dünnen, flexiblen Silikonkautschuckhaut, die die Oberfläche des Originals im negativ abzeichnet und einer starren Kapsel, in der die Hautform formschlüssig eingelegt wird.
in scheme: Konservierungs- und Restaurierungsfachthesaurus für archäologische Kulturgüter
narrower: Abformung (Methode)
narrower: Stützkapselbau
narrower: Isolierung
pref label: Formbau
  type: Label
  rank: preferred

Abformung (Methode)
type: Concept
notation: C1218G
created: 2026-01-30
issued: 2026-01-30
modified: 2026-02-04
publisher: Leibniz-Zentrum für Archäologie (LEIZA)
broader: Formbau
broader transitive: Formbau
broader transitive: analoge Abformung
broader transitive: Nachbildung für wissenschaftliche Zwecke
broader transitive: Maßnahme
broader transitive: Abformung
broader transitive: [Vorgehensweise]
definition: Methode, bei der das gewählte Abformmaterial auf das originale Objekt aufgetragen wird, um dessen Form zeichnungsgenau nachzubilden. Dies kann durch Streichen, Gießen oder Drücken erfolgen, je nach Art des verwendeten Abformmaterials.
definition:
  literal form: Methode, bei der das gewählte Abformmaterial auf das originale Objekt aufgetragen wird, um dessen Form zeichnungsgenau nachzubilden. Dies kann durch Streichen, Gießen oder Drücken erfolgen, je nach Art des verwendeten Abformmaterials.
in scheme: Konservierungs- und Restaurierungsfachthesaurus für archäologische Kulturgüter
pref label: Abformung (Methode)
  type: Label
  rank: preferred
alternative label: Abformen
alt label: Abformen
  type: Label
  rank: preferred

Stützkapselbau
type: Concept
notation: CC67B2
created: 2026-01-30
issued: 2026-01-30
modified: 2026-02-04
publisher: Leibniz-Zentrum für Archäologie (LEIZA)
broader: Formbau
broader transitive: Formbau
broader transitive: analoge Abformung
broader transitive: Nachbildung für wissenschaftliche Zwecke
broader transitive: Maßnahme
broader transitive: Abformung
broader transitive: [Vorgehensweise]
definition: Methode zur Herstellung einer starren Stützkapsel zur Aufnahme der flexiblen Abformmasse.
in scheme: Konservierungs- und Restaurierungsfachthesaurus für archäologische Kulturgüter
pref label: Stützkapselbau
  type: Label
  rank: preferred

Isolierung
type: Concept
notation: D51B5G
created: 2026-01-30
issued: 2026-01-30
modified: 2026-02-04
publisher: Leibniz-Zentrum für Archäologie (LEIZA)
broader: Formbau
broader transitive: Formbau
broader transitive: analoge Abformung
broader transitive: Nachbildung für wissenschaftliche Zwecke
broader transitive: Maßnahme
broader transitive: Abformung
broader transitive: [Vorgehensweise]
definition: Methode, bei der das originale Objekte durch Auftragen einer Trennschicht vor den verwendeten Abformmaterialien geschützt wird.
in scheme: Konservierungs- und Restaurierungsfachthesaurus für archäologische Kulturgüter
pref label: Isolierung
  type: Label
  rank: preferred
alternative label: Absperren
alternative label: Isolieren
alt label: Isolieren
  type: Label
  rank: preferred
alt label: Absperren
  type: Label
  rank: normal

Laminierform
type: Concept
notation: ADCC8A
created: 2026-01-30
issued: 2026-01-30
modified: 2026-02-04
publisher: Leibniz-Zentrum für Archäologie (LEIZA)
broader: [Formtyp]
broader transitive: [Formtyp]
broader transitive: Nachbildung für wissenschaftliche Zwecke
broader transitive: Maßnahme
broader transitive: Abformung
broader transitive: analoge Abformung
broader transitive: [Vorgehensweise]
definition: Form, in die die Ausformmasse in Verbindung mit Geweben aus Verstärkungsfasern eingebracht (laminiert) wird.
in scheme: Konservierungs- und Restaurierungsfachthesaurus für archäologische Kulturgüter
pref label: Laminierform
  type: Label
  rank: preferred

Gussform
type: Concept
notation: B1DB9G
created: 2026-01-30
issued: 2026-01-30
modified: 2026-02-04
publisher: Leibniz-Zentrum für Archäologie (LEIZA)
broader: [Formtyp]
broader transitive: [Formtyp]
broader transitive: Nachbildung für wissenschaftliche Zwecke
broader transitive: Maßnahme
broader transitive: Abformung
broader transitive: analoge Abformung
broader transitive: [Vorgehensweise]
definition: Form mit Einfüllöffnung, in die die flüssige Ausformmasse gegossen werden kann.
in scheme: Konservierungs- und Restaurierungsfachthesaurus für archäologische Kulturgüter
pref label: Gussform
  type: Label
  rank: preferred

Steiggussform
type: Concept
notation: C369CB
created: 2026-01-30
issued: 2026-01-30
modified: 2026-02-04
publisher: Leibniz-Zentrum für Archäologie (LEIZA)
broader: [Formtyp]
broader transitive: [Formtyp]
broader transitive: Nachbildung für wissenschaftliche Zwecke
broader transitive: Maßnahme
broader transitive: Abformung
broader transitive: analoge Abformung
broader transitive: [Vorgehensweise]
definition: Form mit unterer Einfüllöffnung, in die die flüssige Ausformmasse über eine seperate Steigleitung eingegossen werden kann.
in scheme: Konservierungs- und Restaurierungsfachthesaurus für archäologische Kulturgüter
pref label: Steiggussform
  type: Label
  rank: preferred

Quetschform
type: Concept
notation: DC3F7A
created: 2026-01-30
issued: 2026-01-30
modified: 2026-02-04
publisher: Leibniz-Zentrum für Archäologie (LEIZA)
broader: [Formtyp]
broader transitive: [Formtyp]
broader transitive: Nachbildung für wissenschaftliche Zwecke
broader transitive: Maßnahme
broader transitive: Abformung
broader transitive: analoge Abformung
broader transitive: [Vorgehensweise]
definition: Mehrteilige, geschlossene Form, bei der der Auftrag der Ausformungsmasse vor dem Zusammenbau der Form erfolgt. Ein Überschuss an den Kontaktflächen der Form sorgt für ein 'Zusammenquetschen' und Verbinden der nicht ausgehärtenden Ausformmasse beim Zusammenfügen der Formteile.
definition:
  literal form: Mehrteilige, geschlossene Form, bei der der Auftrag der Ausformungsmasse vor dem Zusammenbau der Form erfolgt. Ein Überschuss an den Kontaktflächen der Form sorgt für ein 'Zusammenquetschen' und Verbinden der nicht ausgehärtenden Ausformmasse beim Zusammenfügen der Formteile.
in scheme: Konservierungs- und Restaurierungsfachthesaurus für archäologische Kulturgüter
pref label: Quetschform
  type: Label
  rank: preferred

Spiegelform
type: Concept
notation: G967G1
created: 2026-01-30
issued: 2026-01-30
modified: 2026-02-04
publisher: Leibniz-Zentrum für Archäologie (LEIZA)
broader: [Formtyp]
broader transitive: analoge Abformung
broader transitive: Nachbildung für wissenschaftliche Zwecke
broader transitive: Maßnahme
broader transitive: Abformung
broader transitive: [Vorgehensweise]
broader transitive: [Formtyp]
definition: Einteilige, offene Form mit nur einseitiger Abbildung des Objektes im Negativ
in scheme: Konservierungs- und Restaurierungsfachthesaurus für archäologische Kulturgüter
pref label: Spiegelform
  type: Label
  rank: preferred

Ameisensäure
type: Concept
notation: AA69FB
preferred label: formic acid @en
created: 2026-01-30
issued: 2026-01-30
modified: 2026-02-04
publisher: Leibniz-Zentrum für Archäologie (LEIZA)
broader: Säure
broader transitive: Maßnahme
broader transitive: Säure
broader transitive: Konservierungs- und Restaurierungsmaterialien
in scheme: Konservierungs- und Restaurierungsfachthesaurus für archäologische Kulturgüter
pref label: Ameisensäure
  type: Label
  rank: preferred
pref label: formic acid
  type: Label
  rank: normal

Säure
type: Concept
notation: FGF575
preferred label: acidic detergent @en
created: 2026-01-30
issued: 2026-01-30
modified: 2026-02-04
publisher: Leibniz-Zentrum für Archäologie (LEIZA)
alternative label: acid @en
broader: Konservierungs- und Restaurierungsmaterialien
broader transitive: Konservierungs- und Restaurierungsmaterialien
broader transitive: Maßnahme
definition: chemische Substanz, die in wässriger Lösung Protonen aus ihrer Wasserstoffverbindung abspalten oder ein freies Elektronenpaar aufnehmen kann. In der Restaurierung werden Säuren zur Reinigung, Entfernung von Korrosionsprodukten und Verkrustungen, sowie zur Stabilisierung und Konservierung verwendet.
definition:
  literal form: chemische Substanz, die in wässriger Lösung Protonen aus ihrer Wasserstoffverbindung abspalten oder ein freies Elektronenpaar aufnehmen kann. In der Restaurierung werden Säuren zur Reinigung, Entfernung von Korrosionsprodukten und Verkrustungen, sowie zur Stabilisierung und Konservierung verwendet.
in scheme: Konservierungs- und Restaurierungsfachthesaurus für archäologische Kulturgüter
narrower: Ameisensäure
narrower: Schwefelsäure
narrower: Oxalsäure
narrower: Ascorbinsäure
narrower: Thioglykolsäure
narrower: Salzsäure
narrower: Zitronensäure
alt label: acid
  type: Label
  rank: preferred
pref label: Säure
  type: Label
  rank: preferred
pref label: acidic detergent
  type: Label
  rank: normal

Schwefelsäure
type: Concept
notation: B7395G
preferred label: sulphuric acid @en
created: 2026-01-30
issued: 2026-01-30
modified: 2026-02-04
publisher: Leibniz-Zentrum für Archäologie (LEIZA)
broader: Säure
broader transitive: Maßnahme
broader transitive: Säure
broader transitive: Konservierungs- und Restaurierungsmaterialien
definition: starke, farblose bis schwach gelbliche, viskose Flüssigkeit mit hoher Dichte und stark hygroskopischen Eigenschaften. Chemisch wirkt sie als starkes Oxidations- und Dehydrationsmittel und ist mit Wasser in allen Verhältnissen mischbar, wobei Wärme frei wird.
definition:
  literal form: starke, farblose bis schwach gelbliche, viskose Flüssigkeit mit hoher Dichte und stark hygroskopischen Eigenschaften. Chemisch wirkt sie als starkes Oxidations- und Dehydrationsmittel und ist mit Wasser in allen Verhältnissen mischbar, wobei Wärme frei wird.
in scheme: Konservierungs- und Restaurierungsfachthesaurus für archäologische Kulturgüter
pref label: Schwefelsäure
  type: Label
  rank: preferred
pref label: sulphuric acid
  type: Label
  rank: normal
alternative label: H2SO4
alt label: H2SO4
  type: Label
  rank: preferred

Thioglykolsäure
type: Concept
notation: G7BADF
created: 2026-01-30
issued: 2026-01-30
modified: 2026-02-04
publisher: Leibniz-Zentrum für Archäologie (LEIZA)
broader: Säure
broader transitive: Maßnahme
broader transitive: Säure
broader transitive: Konservierungs- und Restaurierungsmaterialien
in scheme: Konservierungs- und Restaurierungsfachthesaurus für archäologische Kulturgüter
pref label: Thioglykolsäure
  type: Label
  rank: preferred

Salzsäure
type: Concept
notation: GA33BC
preferred label: hydrochlorid acid @en
created: 2026-01-30
issued: 2026-01-30
modified: 2026-02-04
publisher: Leibniz-Zentrum für Archäologie (LEIZA)
broader: Säure
broader transitive: Maßnahme
broader transitive: Säure
broader transitive: Konservierungs- und Restaurierungsmaterialien
definition: anorganische Mineralsäure mit Summenformel HCl, die in der Konservierung und Restaurierung vor allem für die Entfernung von Kalkablagerungen und anderen mineralischen Verunreinigungen verwendet wird. Aufgrund der stark ätzenden Wirkung und gesundheitsgefährdenden Dämpfen ist bei der Anwendung besondere Vorsicht geboten.
definition:
  literal form: anorganische Mineralsäure mit Summenformel HCl, die in der Konservierung und Restaurierung vor allem für die Entfernung von Kalkablagerungen und anderen mineralischen Verunreinigungen verwendet wird. Aufgrund der stark ätzenden Wirkung und gesundheitsgefährdenden Dämpfen ist bei der Anwendung besondere Vorsicht geboten.
in scheme: Konservierungs- und Restaurierungsfachthesaurus für archäologische Kulturgüter
pref label: Salzsäure
  type: Label
  rank: preferred
pref label: hydrochlorid acid
  type: Label
  rank: normal
alternative label: HCl
alt label: HCl
  type: Label
  rank: preferred

Zitronensäure
type: Concept
notation: GBC8AC
preferred label: citric acid @en
created: 2026-01-30
issued: 2026-01-30
modified: 2026-02-04
publisher: Leibniz-Zentrum für Archäologie (LEIZA)
broader: Säure
broader transitive: Maßnahme
broader transitive: Säure
broader transitive: Konservierungs- und Restaurierungsmaterialien
definition: organische Tricarbonsäure mit der chemischen Summenformel C6H8O7, die in der Konservierung und Restaurierung als mildes Reinigungsmittel für die Entfernung von Kalkablagerungen, Oxidationsschichten und anderen minderalischen Verunreinigungen auf originalen Oberflächen verwendet wird. Darüber hinaus kann Zitrönensäure auch als Komplexbilder eingesetzte werden, um Metallionen zu binden.
definition:
  literal form: organische Tricarbonsäure mit der chemischen Summenformel C6H8O7, die in der Konservierung und Restaurierung als mildes Reinigungsmittel für die Entfernung von Kalkablagerungen, Oxidationsschichten und anderen minderalischen Verunreinigungen auf originalen Oberflächen verwendet wird. Darüber hinaus kann Zitrönensäure auch als Komplexbilder eingesetzte werden, um Metallionen zu binden.
in scheme: Konservierungs- und Restaurierungsfachthesaurus für archäologische Kulturgüter
pref label: Zitronensäure
  type: Label
  rank: preferred
pref label: citric acid
  type: Label
  rank: normal

synthetisches Polymer
type: Concept
notation: A1D125
preferred label: synthetic polymer @en
created: 2026-01-30
issued: 2026-01-30
modified: 2026-02-04
publisher: Leibniz-Zentrum für Archäologie (LEIZA)
alternative label: Kunststoff
alternative label: synthetisches Harz
broader: [Adhäsivstoff]
broader transitive: [Adhäsivstoff]
broader transitive: Konservierungs- und Restaurierungsmaterialien
broader transitive: Maßnahme
definition: Durch Polymerisation von einem oder mehreren kleineren Einheiten, sog. Monomeren, künstlich hergestellter großer, langkettiger Molekülverbund.
in scheme: Konservierungs- und Restaurierungsfachthesaurus für archäologische Kulturgüter
narrower: Polyurethan
narrower: Epoxidharz
narrower: Polyvinylbutyral
narrower: Polyvinylalkohol
narrower: Cyclododecan
narrower: Cellulosederivat
narrower: Polyvinylacetat
narrower: Melamin-Formaldehydharz
narrower: Polyethylenglycol
narrower: Polyesterharz
narrower: Acrylharz
alt label: Kunststoff
  type: Label
  rank: preferred
alt label: synthetisches Harz
  type: Label
  rank: normal
pref label: synthetisches Polymer
  type: Label
  rank: preferred
pref label: synthetic polymer
  type: Label
  rank: normal

Gesteinsglas
type: Concept
notation: B12CB4
created: 2026-01-30
issued: 2026-01-30
modified: 2026-02-04
publisher: Leibniz-Zentrum für Archäologie (LEIZA)
broader: Magmatit
broader transitive: Magmatit
broader transitive: Material
broader transitive: [Untersuchungsergebnisse]
broader transitive: Zustandserfassung
broader transitive: Objektuntersuchung
broader transitive: Gestein
broader transitive: silikatisches Material
broader transitive: Materialbestimmung
definition: natürliches, glasartiges Gestein, das durch die rasche Abkühlung einer Schmelze, ohne Ausbildung von Kristallen, entsteht.
in scheme: Konservierungs- und Restaurierungsfachthesaurus für archäologische Kulturgüter
narrower: Obsidian
narrower: Schlacke
narrower: Perlit
narrower: Bimsstein
pref label: Gesteinsglas
  type: Label
  rank: preferred

Obsidian
type: Concept
notation: B21C51
created: 2026-01-30
issued: 2026-01-30
modified: 2026-02-04
publisher: Leibniz-Zentrum für Archäologie (LEIZA)
broader: Gesteinsglas
broader transitive: Gesteinsglas
broader transitive: Magmatit
broader transitive: Material
broader transitive: [Untersuchungsergebnisse]
broader transitive: Zustandserfassung
broader transitive: Objektuntersuchung
broader transitive: Gestein
broader transitive: silikatisches Material
broader transitive: Materialbestimmung
definition: vulkanisches Gesteinsglas aus Siliziumdioxid mit glasartig-homogener aber auch schlackig-blasiger Oberfläche. Die Färbung reicht von dunkelgrau bis annähernd schwarz über rot bis dunkel rot-braun. Obsidian zeichnet sich durch seinen charakteristisch muscheligen, scharfkantigen Bruch aus und wurde daher bereits in der Steinzeit für Werkzeuge und Waffen verwendet.
definition:
  literal form: vulkanisches Gesteinsglas aus Siliziumdioxid mit glasartig-homogener aber auch schlackig-blasiger Oberfläche. Die Färbung reicht von dunkelgrau bis annähernd schwarz über rot bis dunkel rot-braun. Obsidian zeichnet sich durch seinen charakteristisch muscheligen, scharfkantigen Bruch aus und wurde daher bereits in der Steinzeit für Werkzeuge und Waffen verwendet.
in scheme: Konservierungs- und Restaurierungsfachthesaurus für archäologische Kulturgüter
pref label: Obsidian
  type: Label
  rank: preferred

Schlacke
type: Concept
notation: C7BG27
created: 2026-01-30
issued: 2026-01-30
modified: 2026-02-04
publisher: Leibniz-Zentrum für Archäologie (LEIZA)
broader: Gesteinsglas
broader transitive: Gesteinsglas
broader transitive: Material
broader transitive: [Untersuchungsergebnisse]
broader transitive: Zustandserfassung
broader transitive: Objektuntersuchung
broader transitive: Gestein
broader transitive: silikatisches Material
broader transitive: Materialbestimmung
broader transitive: Magmatit
definition: poröses, festes Material aus der Abkühlung und Erstarrung geschmolzener basaltischer Gesteine auf der Oberseite von Lavaströmen. Ähnelt von der Textur und Struktur dem Bimsstein, ist jedoch deutlich schwerer und von dunklerer Farbe als dieser. Schlacke zählt nur bedingt zu den natürlichen Gesteinen, da es neben vulkanischen Ereignissen auch als Nebenprodukt technologischer Prozesse wie der Metallurgie entstehen kann.
definition:
  literal form: poröses, festes Material aus der Abkühlung und Erstarrung geschmolzener basaltischer Gesteine auf der Oberseite von Lavaströmen. Ähnelt von der Textur und Struktur dem Bimsstein, ist jedoch deutlich schwerer und von dunklerer Farbe als dieser. Schlacke zählt nur bedingt zu den natürlichen Gesteinen, da es neben vulkanischen Ereignissen auch als Nebenprodukt technologischer Prozesse wie der Metallurgie entstehen kann.
in scheme: Konservierungs- und Restaurierungsfachthesaurus für archäologische Kulturgüter
pref label: Schlacke
  type: Label
  rank: preferred

Perlit
type: Concept
notation: CCBB4G
created: 2026-01-30
issued: 2026-01-30
modified: 2026-02-04
publisher: Leibniz-Zentrum für Archäologie (LEIZA)
broader: Gesteinsglas
broader transitive: Gesteinsglas
broader transitive: Magmatit
broader transitive: Material
broader transitive: [Untersuchungsergebnisse]
broader transitive: Zustandserfassung
broader transitive: Objektuntersuchung
broader transitive: Gestein
broader transitive: silikatisches Material
broader transitive: Materialbestimmung
definition: vulkanisches Gesteinsglas mit charakteristischem, perlartigen Aussehen, welches auf zentimetergroßen konzentrisch-schaligen Glaskügelchen in der Matrix zurückzuführen ist. Die Farbigkeit kann von grau, grün, bläulich über rötlich, braun bis hin zu farblos reichen.
definition:
  literal form: vulkanisches Gesteinsglas mit charakteristischem, perlartigen Aussehen, welches auf zentimetergroßen konzentrisch-schaligen Glaskügelchen in der Matrix zurückzuführen ist. Die Farbigkeit kann von grau, grün, bläulich über rötlich, braun bis hin zu farblos reichen.
in scheme: Konservierungs- und Restaurierungsfachthesaurus für archäologische Kulturgüter
pref label: Perlit
  type: Label
  rank: preferred
alternative label: Perlstein
alt label: Perlstein
  type: Label
  rank: preferred

Bimsstein
type: Concept
notation: D51GA5
created: 2026-01-30
issued: 2026-01-30
modified: 2026-02-04
publisher: Leibniz-Zentrum für Archäologie (LEIZA)
broader: Gesteinsglas
broader transitive: Gesteinsglas
broader transitive: Magmatit
broader transitive: Material
broader transitive: [Untersuchungsergebnisse]
broader transitive: Zustandserfassung
broader transitive: Objektuntersuchung
broader transitive: Gestein
broader transitive: silikatisches Material
broader transitive: Materialbestimmung
definition: schaumiges Gesteinsglas, bestehend aus subparallel verflochtenen Glasfasern, welche Hohlräume einschließen oder um Einsprenglinge herum führen. Das Gesteinsglas zeigt greuweiße, gelbliche, braune, hellgraue bis fast schwarze oder seltener rötliche Farbnuanzen. Seine Struktur ist deutlich porös und leicht, wodurch er in der Lage ist auf dem Wasser zu schwimmen.
definition:
  literal form: schaumiges Gesteinsglas, bestehend aus subparallel verflochtenen Glasfasern, welche Hohlräume einschließen oder um Einsprenglinge herum führen. Das Gesteinsglas zeigt greuweiße, gelbliche, braune, hellgraue bis fast schwarze oder seltener rötliche Farbnuanzen. Seine Struktur ist deutlich porös und leicht, wodurch er in der Lage ist auf dem Wasser zu schwimmen.
in scheme: Konservierungs- und Restaurierungsfachthesaurus für archäologische Kulturgüter
pref label: Bimsstein
  type: Label
  rank: preferred

Tuff
type: Concept
notation: B14489
created: 2026-01-30
issued: 2026-01-30
modified: 2026-02-04
publisher: Leibniz-Zentrum für Archäologie (LEIZA)
broader: Magmatit
broader transitive: Magmatit
broader transitive: Material
broader transitive: [Untersuchungsergebnisse]
broader transitive: Zustandserfassung
broader transitive: Objektuntersuchung
broader transitive: Gestein
broader transitive: silikatisches Material
broader transitive: Materialbestimmung
definition: aus der Umwandlung der losen Pyroklasten (klastisches Auswurfmaterial aus Vulkanen) durch Druck und/oder Zementierung entstandenes Festgestein. Die Gesteinsmatrix kann, ähnlich wie bei den Sedimentgesteinen, aus verschiedenen mit einander verkitteten Mineralien, wie z.B. Calcit oder Quarz, bestehen und wird mit Hilfe des Grundwassers ausgeschieden. Tuffe zeichnen sich durch eine poröse, wasserdurchlässige Struktur sowie starke Umwandlungserscheinungen, wie Silifizierung, Entglasung der Glasbestandteile und chemische Verwitterung, aus
definition:
  literal form: aus der Umwandlung der losen Pyroklasten (klastisches Auswurfmaterial aus Vulkanen) durch Druck und/oder Zementierung entstandenes Festgestein. Die Gesteinsmatrix kann, ähnlich wie bei den Sedimentgesteinen, aus verschiedenen mit einander verkitteten Mineralien, wie z.B. Calcit oder Quarz, bestehen und wird mit Hilfe des Grundwassers ausgeschieden. Tuffe zeichnen sich durch eine poröse, wasserdurchlässige Struktur sowie starke Umwandlungserscheinungen, wie Silifizierung, Entglasung der Glasbestandteile und chemische Verwitterung, aus
in scheme: Konservierungs- und Restaurierungsfachthesaurus für archäologische Kulturgüter
pref label: Tuff
  type: Label
  rank: preferred

[Adhäsivstoff]
type: Concept
type: NonIndexingConcept
type: GuideTerm
notation: B7B8B6
created: 2026-01-30
issued: 2026-01-30
modified: 2026-02-04
publisher: Leibniz-Zentrum für Archäologie (LEIZA)
alternative label: Bindemittel
alternative label: Festigungsmittel
alternative label: Klebemittel
broader: Konservierungs- und Restaurierungsmaterialien
broader transitive: Konservierungs- und Restaurierungsmaterialien
broader transitive: Maßnahme
definition: strukturierender Sammelbegriff für Materialien, die die Fähigkeit haben, andere Materialien durch Adhäsion (Haftung) zu verbinden. Adhäsivstoffe werden in der Restaurierung sowohl für Klebungen, Festigungen, Ergänzungen als auch als schützender Überzug sowie für die Herstellung wissenschaftlicher Nachbildungen verwendet.
definition:
  literal form: strukturierender Sammelbegriff für Materialien, die die Fähigkeit haben, andere Materialien durch Adhäsion (Haftung) zu verbinden. Adhäsivstoffe werden in der Restaurierung sowohl für Klebungen, Festigungen, Ergänzungen als auch als schützender Überzug sowie für die Herstellung wissenschaftlicher Nachbildungen verwendet.
in scheme: Konservierungs- und Restaurierungsfachthesaurus für archäologische Kulturgüter
narrower: synthetisches Polymer
narrower: natürliches Polymer
alt label: Klebemittel
  type: Label
  rank: preferred
alt label: Festigungsmittel
  type: Label
  rank: normal
alt label: Bindemittel
  type: Label
  rank: normal
pref label: [Adhäsivstoff]
  type: Label
  rank: preferred

Cyclododecan
type: Concept
notation: CD13GA
created: 2026-01-30
issued: 2026-01-30
modified: 2026-02-04
publisher: Leibniz-Zentrum für Archäologie (LEIZA)
broader: synthetisches Polymer
broader transitive: synthetisches Polymer
broader transitive: [Adhäsivstoff]
broader transitive: Konservierungs- und Restaurierungsmaterialien
broader transitive: Maßnahme
definition: organischer, cyclischer Kohlenwasserstoff, der aufgrund seiner spezifischen Eigenschaften in der Konservierung und Restaurierung als temporäres Festigungsmittel bzw. Schutzüberzug verwendet wird. Cyclododecan bildet bei Raumtemperatur zunächst einen wachsartigen, weißlichen Feststoff der mit der Zeit von festen direkt in den gasförmigen Zustand wechselt. Auf diese Weise können empfindliche Teilbereiche eines Objektes zeitweise mit Cyclododecan abgedeckt werden, um vor der Bearbeitung des restlichen Objektes geschützt zu werden (mechanische Beanspruchung, Lösemittelbehandlung, etc.), ohne im Anschluss wieder aufwendigen Entfernungsmethoden unterzogen zu werden.
definition:
  literal form: organischer, cyclischer Kohlenwasserstoff, der aufgrund seiner spezifischen Eigenschaften in der Konservierung und Restaurierung als temporäres Festigungsmittel bzw. Schutzüberzug verwendet wird. Cyclododecan bildet bei Raumtemperatur zunächst einen wachsartigen, weißlichen Feststoff der mit der Zeit von festen direkt in den gasförmigen Zustand wechselt. Auf diese Weise können empfindliche Teilbereiche eines Objektes zeitweise mit Cyclododecan abgedeckt werden, um vor der Bearbeitung des restlichen Objektes geschützt zu werden (mechanische Beanspruchung, Lösemittelbehandlung, etc.), ohne im Anschluss wieder aufwendigen Entfernungsmethoden unterzogen zu werden.
in scheme: Konservierungs- und Restaurierungsfachthesaurus für archäologische Kulturgüter
pref label: Cyclododecan
  type: Label
  rank: preferred

Diorit
type: Concept
notation: CDB814
preferred label: diorite @en
created: 2026-01-30
issued: 2026-01-30
modified: 2026-02-04
publisher: Leibniz-Zentrum für Archäologie (LEIZA)
broader: Magmatit
broader transitive: Magmatit
broader transitive: Material
broader transitive: [Untersuchungsergebnisse]
broader transitive: Zustandserfassung
broader transitive: Objektuntersuchung
broader transitive: Gestein
broader transitive: silikatisches Material
broader transitive: Materialbestimmung
definition: magmatisches Tiefengestein mit Plagioklas-Feldspat als Hauptbestandteil. Zeigt häufig eine grauschwarze bis grünlich-graue Färbung, wobei die Zusammensetzung aus weißlich-grauen Feldspäten und dunklen grünlich-schwarzen Hornblende- und/oder Biotit-Beimengungen zu einem gefleckten/gesprenkeltes Erscheinungsbild führen kann. Die Textur wird als körnig beschrieben, bei der die Minerale mit bloßem Auge erkennbar sind.
definition:
  literal form: magmatisches Tiefengestein mit Plagioklas-Feldspat als Hauptbestandteil. Zeigt häufig eine grauschwarze bis grünlich-graue Färbung, wobei die Zusammensetzung aus weißlich-grauen Feldspäten und dunklen grünlich-schwarzen Hornblende- und/oder Biotit-Beimengungen zu einem gefleckten/gesprenkeltes Erscheinungsbild führen kann. Die Textur wird als körnig beschrieben, bei der die Minerale mit bloßem Auge erkennbar sind.
in scheme: Konservierungs- und Restaurierungsfachthesaurus für archäologische Kulturgüter
pref label: Diorit
  type: Label
  rank: preferred
pref label: diorite
  type: Label
  rank: normal

Basalt
type: Concept
notation: D9B246
created: 2026-01-30
issued: 2026-01-30
modified: 2026-02-04
publisher: Leibniz-Zentrum für Archäologie (LEIZA)
broader: Magmatit
broader transitive: Magmatit
broader transitive: Material
broader transitive: [Untersuchungsergebnisse]
broader transitive: Zustandserfassung
broader transitive: Objektuntersuchung
broader transitive: Gestein
broader transitive: silikatisches Material
broader transitive: Materialbestimmung
definition: vulkanisches Gestein mit den mineralischen Hauptbestandteilen Plagioklas, Pyroxen und Olivin. Das Gestein zeig sich in der Regel in dunkle Färbung und eine feinkörnige Textur. Basalt ist das häufigste Gestein der ozeanischen Kruste
definition:
  literal form: vulkanisches Gestein mit den mineralischen Hauptbestandteilen Plagioklas, Pyroxen und Olivin. Das Gestein zeig sich in der Regel in dunkle Färbung und eine feinkörnige Textur. Basalt ist das häufigste Gestein der ozeanischen Kruste
in scheme: Konservierungs- und Restaurierungsfachthesaurus für archäologische Kulturgüter
pref label: Basalt
  type: Label
  rank: preferred

Granit
type: Concept
notation: F646B4
preferred label: granite @en
created: 2026-01-30
issued: 2026-01-30
modified: 2026-02-04
publisher: Leibniz-Zentrum für Archäologie (LEIZA)
broader: Magmatit
broader transitive: Magmatit
broader transitive: Material
broader transitive: [Untersuchungsergebnisse]
broader transitive: Zustandserfassung
broader transitive: Objektuntersuchung
broader transitive: Gestein
broader transitive: silikatisches Material
broader transitive: Materialbestimmung
definition: körniges Tiefengestein mit Quarzanteil von mehr als 20% und weiteren Bestandteilen aus Feldspat, Biotit und Hornblende. Die Farbigkeit wird allgemein als Hell beschrieben, wobei je nach mineralogischer Zusammensetzungen Abstufungen zwischen weißlich-grau, über rose-rot bis dunkelgrau-schwarz sowie gesprenkelte oder geflecke Texturen zu beobachten sind.
definition:
  literal form: körniges Tiefengestein mit Quarzanteil von mehr als 20% und weiteren Bestandteilen aus Feldspat, Biotit und Hornblende. Die Farbigkeit wird allgemein als Hell beschrieben, wobei je nach mineralogischer Zusammensetzungen Abstufungen zwischen weißlich-grau, über rose-rot bis dunkelgrau-schwarz sowie gesprenkelte oder geflecke Texturen zu beobachten sind.
in scheme: Konservierungs- und Restaurierungsfachthesaurus für archäologische Kulturgüter
pref label: Granit
  type: Label
  rank: preferred
pref label: granite
  type: Label
  rank: normal

eisenreiches Sedimentit
type: Concept
notation: ACD56G
created: 2026-01-30
issued: 2026-01-30
modified: 2026-02-04
publisher: Leibniz-Zentrum für Archäologie (LEIZA)
alternative label: Eisenerz
alternative label: Eisenformation
broader: Sedimentgestein
broader transitive: Gestein
broader transitive: Material
broader transitive: [Untersuchungsergebnisse]
broader transitive: Zustandserfassung
broader transitive: Objektuntersuchung
broader transitive: silikatisches Material
broader transitive: Materialbestimmung
broader transitive: Sedimentgestein
definition: sedimentäres Gestein mit einem Eisengehalt von mehr als 15%. Als eisenmineralien sind häufig u.A. Limonit, Hämatit, Magnetit, Siderit und/oder Pyrit enthalten.
in scheme: Konservierungs- und Restaurierungsfachthesaurus für archäologische Kulturgüter
alt label: Eisenerz
  type: Label
  rank: preferred
alt label: Eisenformation
  type: Label
  rank: normal
pref label: eisenreiches Sedimentit
  type: Label
  rank: preferred

Kalkstein
type: Concept
notation: B8224D
created: 2026-01-30
issued: 2026-01-30
modified: 2026-02-04
publisher: Leibniz-Zentrum für Archäologie (LEIZA)
broader: Sedimentgestein
broader transitive: Material
broader transitive: Sedimentgestein
broader transitive: [Untersuchungsergebnisse]
broader transitive: Zustandserfassung
broader transitive: Objektuntersuchung
broader transitive: Gestein
broader transitive: silikatisches Material
broader transitive: Materialbestimmung
definition: sedimentäres Gestein, welches durch die Verfestigung von Kalkschlämmen (Calcit und/oder Aragonit) oder durch mechanisch sedimentierten Klasten verschiedener Herkunft gebildet wird. Auch die Bildung durch direkte biogene Anlagerung unter Beteiligung von pflanzlichen Organismen ist möglich. Die Farbigkeit kann sehr unterschiedlich sein, wenn auch weißlich, gelblich oder graue Farbtöne am häufigsten vorkommen.
definition:
  literal form: sedimentäres Gestein, welches durch die Verfestigung von Kalkschlämmen (Calcit und/oder Aragonit) oder durch mechanisch sedimentierten Klasten verschiedener Herkunft gebildet wird. Auch die Bildung durch direkte biogene Anlagerung unter Beteiligung von pflanzlichen Organismen ist möglich. Die Farbigkeit kann sehr unterschiedlich sein, wenn auch weißlich, gelblich oder graue Farbtöne am häufigsten vorkommen.
in scheme: Konservierungs- und Restaurierungsfachthesaurus für archäologische Kulturgüter
pref label: Kalkstein
  type: Label
  rank: preferred

Kalksinter
type: Concept
notation: CB4C3C
created: 2026-01-30
issued: 2026-01-30
modified: 2026-02-04
publisher: Leibniz-Zentrum für Archäologie (LEIZA)
broader: Sedimentgestein
broader transitive: Material
broader transitive: Sedimentgestein
broader transitive: [Untersuchungsergebnisse]
broader transitive: Zustandserfassung
broader transitive: Objektuntersuchung
broader transitive: Gestein
broader transitive: silikatisches Material
broader transitive: Materialbestimmung
definition: sedimentäres Gestein, das durch Ablagerung von Kalk aus kalkhaltigem Wasser entsteht. Häufig tritt Kalksinter auch als oberflächliche Ablagerung/Überzug (z.B. auf bodengelagerten Objekten) auf. In Höhlen kann es unter den richtigen Bedingungen zur Bildung von Tropfsteinen aus Kalksinter kommen.
definition:
  literal form: sedimentäres Gestein, das durch Ablagerung von Kalk aus kalkhaltigem Wasser entsteht. Häufig tritt Kalksinter auch als oberflächliche Ablagerung/Überzug (z.B. auf bodengelagerten Objekten) auf. In Höhlen kann es unter den richtigen Bedingungen zur Bildung von Tropfsteinen aus Kalksinter kommen.
in scheme: Konservierungs- und Restaurierungsfachthesaurus für archäologische Kulturgüter
pref label: Kalksinter
  type: Label
  rank: preferred

Tonstein
type: Concept
notation: DB13B8
created: 2026-01-30
issued: 2026-01-30
modified: 2026-02-04
publisher: Leibniz-Zentrum für Archäologie (LEIZA)
broader: Sedimentgestein
broader transitive: Material
broader transitive: Sedimentgestein
broader transitive: [Untersuchungsergebnisse]
broader transitive: Zustandserfassung
broader transitive: Objektuntersuchung
broader transitive: Gestein
broader transitive: silikatisches Material
broader transitive: Materialbestimmung
definition: klastisches Sedimentgestein, welches hauptsächlich aus Tonmineralen besteht. Häufig werden Tonsteine durch Ablagerung von Illit, Montomorillonit und/oder Chlorit leicht schiefrig ausgebildet. Die Farbigkeit liegt bei grau, blau, grünlich, rotbraun, schwarz oder verschiedenfarbig gefleckt. Tonsteine weisen in der Regel eine außerordentliche Feinkörnigkeit auf, wodurch der Bruch selbst bei beachtlicher Beimengung von Quarz oder Glimmer durchwegs homogen wirkt. Die Struktur der Tonsteine ist meist weich und krümelig, zeigt jedoch eine höhere Härte als Schieferton. Die Oberfläche ist von einem seidigen Glanz.
definition:
  literal form: klastisches Sedimentgestein, welches hauptsächlich aus Tonmineralen besteht. Häufig werden Tonsteine durch Ablagerung von Illit, Montomorillonit und/oder Chlorit leicht schiefrig ausgebildet. Die Farbigkeit liegt bei grau, blau, grünlich, rotbraun, schwarz oder verschiedenfarbig gefleckt. Tonsteine weisen in der Regel eine außerordentliche Feinkörnigkeit auf, wodurch der Bruch selbst bei beachtlicher Beimengung von Quarz oder Glimmer durchwegs homogen wirkt. Die Struktur der Tonsteine ist meist weich und krümelig, zeigt jedoch eine höhere Härte als Schieferton. Die Oberfläche ist von einem seidigen Glanz.
in scheme: Konservierungs- und Restaurierungsfachthesaurus für archäologische Kulturgüter
pref label: Tonstein
  type: Label
  rank: preferred

Sandstein
type: Concept
notation: DD91F6
created: 2026-01-30
issued: 2026-01-30
modified: 2026-02-04
publisher: Leibniz-Zentrum für Archäologie (LEIZA)
broader: Sedimentgestein
broader transitive: Material
broader transitive: Sedimentgestein
broader transitive: [Untersuchungsergebnisse]
broader transitive: Zustandserfassung
broader transitive: Objektuntersuchung
broader transitive: Gestein
broader transitive: silikatisches Material
broader transitive: Materialbestimmung
definition: klastisches Sedimentgestein aus in einer feinen Matrix eingebetteten Sandkörnern, die sich durch das Ausfüllen der Zwischenräume mit Bindemitteln wie Kalk, Ton oder Siliziumdioxid verfestigt haben. Die Farbigkeit von Sandsteinen ist vielfältig von weiß, hellgrau, gelblich über rötlich, gelblich-braun bis seltener auch grünlich, blau oder violett,. Häufig kommen auch Bänderungen, Flecken oder Maserungen vor, die auf die unterschiedliche Färbung der einzelnen Ablagerungsschichten zurückzuführen sind. Der Hauptbestandteil der meisten Sandsteine ist Quarz, weitere häufig auftretende Minerale sind Feldspat und Glimmer.
definition:
  literal form: klastisches Sedimentgestein aus in einer feinen Matrix eingebetteten Sandkörnern, die sich durch das Ausfüllen der Zwischenräume mit Bindemitteln wie Kalk, Ton oder Siliziumdioxid verfestigt haben. Die Farbigkeit von Sandsteinen ist vielfältig von weiß, hellgrau, gelblich über rötlich, gelblich-braun bis seltener auch grünlich, blau oder violett,. Häufig kommen auch Bänderungen, Flecken oder Maserungen vor, die auf die unterschiedliche Färbung der einzelnen Ablagerungsschichten zurückzuführen sind. Der Hauptbestandteil der meisten Sandsteine ist Quarz, weitere häufig auftretende Minerale sind Feldspat und Glimmer.
in scheme: Konservierungs- und Restaurierungsfachthesaurus für archäologische Kulturgüter
pref label: Sandstein
  type: Label
  rank: preferred

Feuerstein
type: Concept
notation: F2B8B7
created: 2026-01-30
issued: 2026-01-30
modified: 2026-02-04
publisher: Leibniz-Zentrum für Archäologie (LEIZA)
broader: Sedimentgestein
broader transitive: Material
broader transitive: Sedimentgestein
broader transitive: [Untersuchungsergebnisse]
broader transitive: Zustandserfassung
broader transitive: Objektuntersuchung
broader transitive: Gestein
broader transitive: silikatisches Material
broader transitive: Materialbestimmung
definition: hartes Sedimentgestein, hauptsächlich bestehend aus feinkörnigem Quarz. Feuerstein bildet sich durch chemische Ausfällung von Siliziumdioxid in marinen Umgebungen und findet sich häufig lagenweise in Kalksteinen oder Kreideschichten. Die Farbe ist meist dunkelgrau bis schwarz und häufig von einer hellen Rinde umgeben. Der Bruch des Feuerstein ist schwarfkantig, muschelig, wesswegen er bereits früh in der Menschheitsgeschichte für Werkzeuge und Waffen verwendet wurde. Der Namensgebung entsprechend zeichnet sich Feuerstein durch seine Eigenschaft der Funkenerzeugung, bei harten Schlägen gegeneinander oder gegen andere harte Materialien, aus.
definition:
  literal form: hartes Sedimentgestein, hauptsächlich bestehend aus feinkörnigem Quarz. Feuerstein bildet sich durch chemische Ausfällung von Siliziumdioxid in marinen Umgebungen und findet sich häufig lagenweise in Kalksteinen oder Kreideschichten. Die Farbe ist meist dunkelgrau bis schwarz und häufig von einer hellen Rinde umgeben. Der Bruch des Feuerstein ist schwarfkantig, muschelig, wesswegen er bereits früh in der Menschheitsgeschichte für Werkzeuge und Waffen verwendet wurde. Der Namensgebung entsprechend zeichnet sich Feuerstein durch seine Eigenschaft der Funkenerzeugung, bei harten Schlägen gegeneinander oder gegen andere harte Materialien, aus.
in scheme: Konservierungs- und Restaurierungsfachthesaurus für archäologische Kulturgüter
pref label: Feuerstein
  type: Label
  rank: preferred
alternative label: Flint
alt label: Flint
  type: Label
  rank: preferred

Schieferton
type: Concept
notation: G636F1
created: 2026-01-30
issued: 2026-01-30
modified: 2026-02-04
publisher: Leibniz-Zentrum für Archäologie (LEIZA)
broader: Sedimentgestein
broader transitive: Material
broader transitive: Sedimentgestein
broader transitive: [Untersuchungsergebnisse]
broader transitive: Zustandserfassung
broader transitive: Objektuntersuchung
broader transitive: Gestein
broader transitive: silikatisches Material
broader transitive: Materialbestimmung
definition: Eine besonders feinplattig ausgebildete Art des Tonsteins. Schieferton zeichnet sich durch eine ausgeprägte Schieferung und Spaltbarkeit aus, die durch gerichteten Druck während der Diagenese entsteht. Die Struktur ist blättrig oder leistenförmig ausgebildet. Schiefertone sind deutlich weicher als Tonsteine und zeigen eine stumpfen Oberflächenbeschaffenheit.
definition:
  literal form: Eine besonders feinplattig ausgebildete Art des Tonsteins. Schieferton zeichnet sich durch eine ausgeprägte Schieferung und Spaltbarkeit aus, die durch gerichteten Druck während der Diagenese entsteht. Die Struktur ist blättrig oder leistenförmig ausgebildet. Schiefertone sind deutlich weicher als Tonsteine und zeigen eine stumpfen Oberflächenbeschaffenheit.
in scheme: Konservierungs- und Restaurierungsfachthesaurus für archäologische Kulturgüter
pref label: Schieferton
  type: Label
  rank: preferred
alternative label: Schiefer
alt label: Schiefer
  type: Label
  rank: preferred

Gips (Gestein)
type: Concept
notation: G734B3
created: 2026-01-30
issued: 2026-01-30
modified: 2026-02-04
publisher: Leibniz-Zentrum für Archäologie (LEIZA)
alternative label: Gipsstein
broader: Sedimentgestein
broader transitive: Gestein
broader transitive: Material
broader transitive: [Untersuchungsergebnisse]
broader transitive: Zustandserfassung
broader transitive: Objektuntersuchung
broader transitive: silikatisches Material
broader transitive: Materialbestimmung
broader transitive: Sedimentgestein
definition: hauptsächlich in weißen Färbungen vorkommendes Gestein, aber auch gelbe, rote, braune, graue bis schwarze Färbungen sind möglich. Bei Gips wird der Name sowohl für das Gestein, als auch das Mineral gleichermaßen verwendet. Gips als Gestein tritt häufig in Wechsellagerung mit Steinsalz, Dolomiten und bituminösen Tongesteinen auf. Die Strukur des Gipses als Gestein zeigt häufig eine stark gewellte, verbogene Schichtung ("Gekrösegips"). Im Gegensatz zu Kalkstein oder Dolomit ist Gips deutlich weicher und kann daher durch Härteprüfung leicht von diesen unterschieden werden.
definition:
  literal form: hauptsächlich in weißen Färbungen vorkommendes Gestein, aber auch gelbe, rote, braune, graue bis schwarze Färbungen sind möglich. Bei Gips wird der Name sowohl für das Gestein, als auch das Mineral gleichermaßen verwendet. Gips als Gestein tritt häufig in Wechsellagerung mit Steinsalz, Dolomiten und bituminösen Tongesteinen auf. Die Strukur des Gipses als Gestein zeigt häufig eine stark gewellte, verbogene Schichtung ("Gekrösegips"). Im Gegensatz zu Kalkstein oder Dolomit ist Gips deutlich weicher und kann daher durch Härteprüfung leicht von diesen unterschieden werden.
in scheme: Konservierungs- und Restaurierungsfachthesaurus für archäologische Kulturgüter
alt label: Gipsstein
  type: Label
  rank: preferred
pref label: Gips (Gestein)
  type: Label
  rank: preferred

Bentonit
type: Concept
notation: GG4BF9
created: 2026-01-30
issued: 2026-01-30
modified: 2026-02-04
publisher: Leibniz-Zentrum für Archäologie (LEIZA)
broader: Sedimentgestein
broader transitive: Material
broader transitive: Sedimentgestein
broader transitive: [Untersuchungsergebnisse]
broader transitive: Zustandserfassung
broader transitive: Objektuntersuchung
broader transitive: Gestein
broader transitive: silikatisches Material
broader transitive: Materialbestimmung
definition: polymineralisches Sedimentgestein, welches durch die Verwitterung von vulkanischer Asche oder Gläsern entsteht. Hauptbestandteil ist das Mineral Montmorillonit, mit Beimengungen von u.A. Quarz, Feldspäten, Pyrit und Biotit. Abhängig von der mineralischen Zusammensetzung treten Farben zwischen weiß, gelb, grünlich, grau bis braun auf. Bentonit ist ein sehr weiches Gestein mit einer körnigen Textur und einem matten Oberflächenglanz
definition:
  literal form: polymineralisches Sedimentgestein, welches durch die Verwitterung von vulkanischer Asche oder Gläsern entsteht. Hauptbestandteil ist das Mineral Montmorillonit, mit Beimengungen von u.A. Quarz, Feldspäten, Pyrit und Biotit. Abhängig von der mineralischen Zusammensetzung treten Farben zwischen weiß, gelb, grünlich, grau bis braun auf. Bentonit ist ein sehr weiches Gestein mit einer körnigen Textur und einem matten Oberflächenglanz
in scheme: Konservierungs- und Restaurierungsfachthesaurus für archäologische Kulturgüter
pref label: Bentonit
  type: Label
  rank: preferred

Dolomit (Gestein)
type: Concept
notation: GGCA4G
created: 2026-01-30
issued: 2026-01-30
modified: 2026-02-04
publisher: Leibniz-Zentrum für Archäologie (LEIZA)
broader: Sedimentgestein
broader transitive: Material
broader transitive: Sedimentgestein
broader transitive: [Untersuchungsergebnisse]
broader transitive: Zustandserfassung
broader transitive: Objektuntersuchung
broader transitive: Gestein
broader transitive: silikatisches Material
broader transitive: Materialbestimmung
definition: großbkörniges, sedimentäres Gestein, das hauptsächlich aus dem gleichnamigen Mineral besteht. Die genaue Bildung von Dolomit ist nicht geklärt, jedoch kommen sie ausschließlich in marinen Sedimentabfolgen vor. Farbe, Korngröße und Gefüge ähneln den Kalksteinen, jedoch ist Dolomit härter und weniger reaktiv gegenüber Säuren.
definition:
  literal form: großbkörniges, sedimentäres Gestein, das hauptsächlich aus dem gleichnamigen Mineral besteht. Die genaue Bildung von Dolomit ist nicht geklärt, jedoch kommen sie ausschließlich in marinen Sedimentabfolgen vor. Farbe, Korngröße und Gefüge ähneln den Kalksteinen, jedoch ist Dolomit härter und weniger reaktiv gegenüber Säuren.
in scheme: Konservierungs- und Restaurierungsfachthesaurus für archäologische Kulturgüter
pref label: Dolomit (Gestein)
  type: Label
  rank: preferred

Einlieferungszustand
type: Concept
notation: A4G52F
created: 2026-01-30
issued: 2026-01-30
modified: 2026-02-04
publisher: Leibniz-Zentrum für Archäologie (LEIZA)
alternative label: Vorzustand
broader: Erhaltungszustand
broader transitive: Erhaltungszustand
broader transitive: Zustandserfassung
definition: Erhaltungszustand eines Objektes zum Zeitpunkt der Einlieferung in die Restaurierungswerkstatt
in scheme: Konservierungs- und Restaurierungsfachthesaurus für archäologische Kulturgüter
alt label: Vorzustand
  type: Label
  rank: preferred
pref label: Einlieferungszustand
  type: Label
  rank: preferred

Marmor
type: Concept
notation: BAB939
created: 2026-01-30
issued: 2026-01-30
modified: 2026-02-04
publisher: Leibniz-Zentrum für Archäologie (LEIZA)
broader: Metamorphit
broader transitive: Metamorphit
broader transitive: Gestein
broader transitive: Material
broader transitive: [Untersuchungsergebnisse]
broader transitive: Zustandserfassung
broader transitive: Objektuntersuchung
broader transitive: silikatisches Material
broader transitive: Materialbestimmung
definition: metamorphes Gestein, welches überwiegend aus Calcit und/oder Dolomit besteht und durch unterschiedliche Metamorphosebedingungen entstanden sein kann. Die Farbigkeit kann von schneeweiß über grau, schwarz, blassgelb, braun, rosa, dunkelrot, bläulich, lila bis grünlich reichen. Häufig sind Mehrfarbigkeiten in Form von Flecken, einheitlichen Bänderungen oder willkürliche "Marmorierung" zu beobachten. In der Industrie werden häufig alle Karbonatgesteine als "Marmor" bezeichnet, in der hier vorliegenden Definition ist jedoch die streng petrographische Definition des Begriffs, als Gestein mit kristallinem Gefüge das eine Metamorphose erfahren hat, gemeint.
definition:
  literal form: metamorphes Gestein, welches überwiegend aus Calcit und/oder Dolomit besteht und durch unterschiedliche Metamorphosebedingungen entstanden sein kann. Die Farbigkeit kann von schneeweiß über grau, schwarz, blassgelb, braun, rosa, dunkelrot, bläulich, lila bis grünlich reichen. Häufig sind Mehrfarbigkeiten in Form von Flecken, einheitlichen Bänderungen oder willkürliche "Marmorierung" zu beobachten. In der Industrie werden häufig alle Karbonatgesteine als "Marmor" bezeichnet, in der hier vorliegenden Definition ist jedoch die streng petrographische Definition des Begriffs, als Gestein mit kristallinem Gefüge das eine Metamorphose erfahren hat, gemeint.
in scheme: Konservierungs- und Restaurierungsfachthesaurus für archäologische Kulturgüter
pref label: Marmor
  type: Label
  rank: preferred

Quarzit
type: Concept
notation: D6959D
created: 2026-01-30
issued: 2026-01-30
modified: 2026-02-04
publisher: Leibniz-Zentrum für Archäologie (LEIZA)
broader: Metamorphit
broader transitive: Metamorphit
broader transitive: Gestein
broader transitive: Material
broader transitive: [Untersuchungsergebnisse]
broader transitive: Zustandserfassung
broader transitive: Objektuntersuchung
broader transitive: silikatisches Material
broader transitive: Materialbestimmung
definition: metamorphoses Gestein, welches zu mindestens 80% aus Quarz besteht. Die metamorphosen Bedingungen, unter denen sich der Quarzit bildet, können dabei ganz unterschiedlich sein. Durch den hohen Quarzanteil tritt der Quarzit vorallem in weißlicher Farbe auf, kann jedoch auch in jeder anderen Farbe, wie grau, rot oder braun, vorkommen. Die Struktur und Textur ist fein lamelliert bis massig und Schieferungen sind undeutlich ausgebildet oder fehlen ganz.
definition:
  literal form: metamorphoses Gestein, welches zu mindestens 80% aus Quarz besteht. Die metamorphosen Bedingungen, unter denen sich der Quarzit bildet, können dabei ganz unterschiedlich sein. Durch den hohen Quarzanteil tritt der Quarzit vorallem in weißlicher Farbe auf, kann jedoch auch in jeder anderen Farbe, wie grau, rot oder braun, vorkommen. Die Struktur und Textur ist fein lamelliert bis massig und Schieferungen sind undeutlich ausgebildet oder fehlen ganz.
in scheme: Konservierungs- und Restaurierungsfachthesaurus für archäologische Kulturgüter
pref label: Quarzit
  type: Label
  rank: preferred

Speckstein
type: Concept
notation: DF1279
created: 2026-01-30
issued: 2026-01-30
modified: 2026-02-04
publisher: Leibniz-Zentrum für Archäologie (LEIZA)
alternative label: Steatit
broader: Metamorphit
broader transitive: Metamorphit
broader transitive: Gestein
broader transitive: Material
broader transitive: [Untersuchungsergebnisse]
broader transitive: Zustandserfassung
broader transitive: Objektuntersuchung
broader transitive: silikatisches Material
broader transitive: Materialbestimmung
definition: metamorphoses Gestein, das nahezu ausschließlich aus dem Mineral Talk besteht. Speckstein zeichnet sich, aufgrund des hohen Talkgehaltes, durch seine Weichheit, leichte Bearbeitbarkeit und eine glatte, fettige Oberfläche aus. Die Farbe ist meist lichtgrau.
definition:
  literal form: metamorphoses Gestein, das nahezu ausschließlich aus dem Mineral Talk besteht. Speckstein zeichnet sich, aufgrund des hohen Talkgehaltes, durch seine Weichheit, leichte Bearbeitbarkeit und eine glatte, fettige Oberfläche aus. Die Farbe ist meist lichtgrau.
in scheme: Konservierungs- und Restaurierungsfachthesaurus für archäologische Kulturgüter
alt label: Steatit
  type: Label
  rank: preferred
pref label: Speckstein
  type: Label
  rank: preferred

Amphibolit
type: Concept
notation: F85G77
created: 2026-01-30
issued: 2026-01-30
modified: 2026-02-04
publisher: Leibniz-Zentrum für Archäologie (LEIZA)
alternative label: Hornblendegestein
broader: Metamorphit
broader transitive: Metamorphit
broader transitive: Gestein
broader transitive: Material
broader transitive: [Untersuchungsergebnisse]
broader transitive: Zustandserfassung
broader transitive: Objektuntersuchung
broader transitive: silikatisches Material
broader transitive: Materialbestimmung
definition: metamorphes Gestein, welches hauptsächlich aus Amphibolen und Feldspat besteht. Aufgrund des besonders hohen Vorkommens von Hornblende als Hauptbestandteil, wird der Amphibolit im deutschsprachigen Raum auch als Hornblendegestein bezeichnet. Je nach Zusammensetzung sind grau, graugrüne oder schwarzgrüne Farbigkeiten möglich, wobei durch einen hohen Anteil von Plagioklasen-Feldspäten auch ein weiß gepunktetes Aussehen zu finden ist. Die Textur ist als kristallin bis schiefrig zu bezeichnen mit mittel- bis grobkörnigen Korngrößen.
definition:
  literal form: metamorphes Gestein, welches hauptsächlich aus Amphibolen und Feldspat besteht. Aufgrund des besonders hohen Vorkommens von Hornblende als Hauptbestandteil, wird der Amphibolit im deutschsprachigen Raum auch als Hornblendegestein bezeichnet. Je nach Zusammensetzung sind grau, graugrüne oder schwarzgrüne Farbigkeiten möglich, wobei durch einen hohen Anteil von Plagioklasen-Feldspäten auch ein weiß gepunktetes Aussehen zu finden ist. Die Textur ist als kristallin bis schiefrig zu bezeichnen mit mittel- bis grobkörnigen Korngrößen.
in scheme: Konservierungs- und Restaurierungsfachthesaurus für archäologische Kulturgüter
alt label: Hornblendegestein
  type: Label
  rank: preferred
pref label: Amphibolit
  type: Label
  rank: preferred

Serpentinit
type: Concept
notation: G63684
created: 2026-01-30
issued: 2026-01-30
modified: 2026-02-04
publisher: Leibniz-Zentrum für Archäologie (LEIZA)
broader: Metamorphit
broader transitive: Metamorphit
broader transitive: Gestein
broader transitive: Material
broader transitive: [Untersuchungsergebnisse]
broader transitive: Zustandserfassung
broader transitive: Objektuntersuchung
broader transitive: silikatisches Material
broader transitive: Materialbestimmung
definition: metamorphes Gestein mit den mineralischen Hauptbestandteilen Serpentin, Olivin und Pyroxen. Zeigt häufig hell grünlich-graue bis dunkelgrüne Färbungen, aber auch rötliche Töne im Falle von Mangan-Gehalten. Auch fleckige, gebändert bis gestreifte oder völlig unregelmäßige Farbgebungen sind möglich. Die Textur kann schuppig, stumpf oder seidig-glänzend sein.
definition:
  literal form: metamorphes Gestein mit den mineralischen Hauptbestandteilen Serpentin, Olivin und Pyroxen. Zeigt häufig hell grünlich-graue bis dunkelgrüne Färbungen, aber auch rötliche Töne im Falle von Mangan-Gehalten. Auch fleckige, gebändert bis gestreifte oder völlig unregelmäßige Farbgebungen sind möglich. Die Textur kann schuppig, stumpf oder seidig-glänzend sein.
in scheme: Konservierungs- und Restaurierungsfachthesaurus für archäologische Kulturgüter
pref label: Serpentinit
  type: Label
  rank: preferred

Endzustand
type: Concept
notation: C2488A
created: 2026-01-30
issued: 2026-01-30
modified: 2026-02-04
publisher: Leibniz-Zentrum für Archäologie (LEIZA)
alternative label: Abschlusszustand
broader: Erhaltungszustand
broader transitive: Erhaltungszustand
broader transitive: Zustandserfassung
definition: Erhaltungszustand eines Objektes nach Abschluss der praktisch durchgeführten Konservierungs- und Restaurierungsmaßnahmen sowie Überprüfung in wie fern das zuvor festgelegte Restaurierung-/Konservierungsziel erreicht werden konnte.
definition:
  literal form: Erhaltungszustand eines Objektes nach Abschluss der praktisch durchgeführten Konservierungs- und Restaurierungsmaßnahmen sowie Überprüfung in wie fern das zuvor festgelegte Restaurierung-/Konservierungsziel erreicht werden konnte.
in scheme: Konservierungs- und Restaurierungsfachthesaurus für archäologische Kulturgüter
alt label: Abschlusszustand
  type: Label
  rank: preferred
pref label: Endzustand
  type: Label
  rank: preferred

Erhaltungszustand
type: Concept
notation: D9G51G
created: 2026-01-30
issued: 2026-01-30
modified: 2026-02-04
publisher: Leibniz-Zentrum für Archäologie (LEIZA)
alternative label: Ist-Zustand
alternative label: Zustand
broader: Zustandserfassung
broader transitive: Zustandserfassung
definition: Zustand eines Objektes zu einem bestimmten Zeitpunkt. Wird durch verschiedene zur Verfügung stehende Objektuntersuchungen ermittelt und durch die dabei festgestellten Ergebnisse/Beobachtungen beschrieben. Auch die bisherige Lagerung eines Objektes gibt erste Hinweise auf den zu erwartenden Erhaltungszustund
definition:
  literal form: Zustand eines Objektes zu einem bestimmten Zeitpunkt. Wird durch verschiedene zur Verfügung stehende Objektuntersuchungen ermittelt und durch die dabei festgestellten Ergebnisse/Beobachtungen beschrieben. Auch die bisherige Lagerung eines Objektes gibt erste Hinweise auf den zu erwartenden Erhaltungszustund
in scheme: Konservierungs- und Restaurierungsfachthesaurus für archäologische Kulturgüter
narrower: Einlieferungszustand
narrower: Endzustand
alt label: Zustand
  type: Label
  rank: preferred
alt label: Ist-Zustand
  type: Label
  rank: normal
pref label: Erhaltungszustand
  type: Label
  rank: preferred

Bisherige Lagerung
type: Concept
notation: DBC278
created: 2026-01-30
issued: 2026-01-30
modified: 2026-02-04
publisher: Leibniz-Zentrum für Archäologie (LEIZA)
alternative label: bisherige Umgebungsbedingungen
broader: Zustandserfassung
broader transitive: Zustandserfassung
definition: Bisheriger Verbleib und Aufbewahrung von Artefakten seit ihrer Entdeckung oder Ausgrabung bis zur gegenwärtigen Zeit.
in scheme: Konservierungs- und Restaurierungsfachthesaurus für archäologische Kulturgüter
alt label: bisherige Umgebungsbedingungen
  type: Label
  rank: preferred
pref label: Bisherige Lagerung
  type: Label
  rank: preferred
narrower: klimatisierte Lagerung
narrower: Grabungsfrischer Fund
narrower: Depotlagerung
narrower: Ausstellungsentnahme
narrower: unklimatisierte Lagerung
narrower: Rückgabe aus Leihverkehr

klimatisierte Individualverpackung
type: Concept
notation: A2BB42
preferred label: climate-controlled individual packaging @en
created: 2026-01-30
issued: 2026-01-30
modified: 2026-02-04
publisher: Leibniz-Zentrum für Archäologie (LEIZA)
alternative label: Klimabox
alternative label: Klimakiste
broader: klimatisierte Lagerung
broader transitive: Zustandserfassung
broader transitive: klimatisierte Lagerung
broader transitive: Bisherige Lagerung
definition: Das Objekt lagerte in einer individuellen Verpackung, die z.B. mittels Trockenmittel oder anderen Reagenzien auf einen speziellen Klimarwert eingestellt war.
in scheme: Konservierungs- und Restaurierungsfachthesaurus für archäologische Kulturgüter
alt label: Klimakiste
  type: Label
  rank: preferred
alt label: Klimabox
  type: Label
  rank: normal
pref label: klimatisierte Individualverpackung
  type: Label
  rank: preferred
pref label: climate-controlled individual packaging
  type: Label
  rank: normal

klimatisierte Lagerung
type: Concept
notation: A8ABBA
preferred label: climate-controlled storage @en
created: 2026-01-30
issued: 2026-01-30
modified: 2026-02-04
publisher: Leibniz-Zentrum für Archäologie (LEIZA)
broader: Bisherige Lagerung
broader transitive: Zustandserfassung
broader transitive: Bisherige Lagerung
definition: Das Objekt wurde bis zur Einlieferung in die Restaurierungswerkstatt unter kontrollierten, klimatischen Bedingungen aufbewahrt.
in scheme: Konservierungs- und Restaurierungsfachthesaurus für archäologische Kulturgüter
pref label: klimatisierte Lagerung
  type: Label
  rank: preferred
pref label: climate-controlled storage
  type: Label
  rank: normal
narrower: klimatisierte Individualverpackung
narrower: Klimaraum
narrower: Gefrierschrank
narrower: Kühlschrank

Klimaraum
type: Concept
notation: C2241C
preferred label: climate room @en
created: 2026-01-30
issued: 2026-01-30
modified: 2026-02-04
publisher: Leibniz-Zentrum für Archäologie (LEIZA)
alternative label: Klimakammer
broader: klimatisierte Lagerung
broader transitive: Zustandserfassung
broader transitive: klimatisierte Lagerung
broader transitive: Bisherige Lagerung
definition: Das Objekt lagerte bisher in einem Raum, der über eine kontrollierte Klimaregulierung verfügte und auf für das Objekt optimale klimatische Bedingungen eingestellt war
in scheme: Konservierungs- und Restaurierungsfachthesaurus für archäologische Kulturgüter
alt label: Klimakammer
  type: Label
  rank: preferred
pref label: Klimaraum
  type: Label
  rank: preferred
pref label: climate room
  type: Label
  rank: normal

Gefrierschrank
type: Concept
notation: C948F2
preferred label: freezer @en
created: 2026-01-30
issued: 2026-01-30
modified: 2026-02-04
publisher: Leibniz-Zentrum für Archäologie (LEIZA)
broader: klimatisierte Lagerung
broader transitive: Zustandserfassung
broader transitive: klimatisierte Lagerung
broader transitive: Bisherige Lagerung
definition: Die bisherige Lagerung des Objektes erfolgte tiefgefroren in einem Gefrierschrank
in scheme: Konservierungs- und Restaurierungsfachthesaurus für archäologische Kulturgüter
pref label: Gefrierschrank
  type: Label
  rank: preferred
pref label: freezer
  type: Label
  rank: normal

Kühlschrank
type: Concept
notation: D21459
preferred label: refrigerator @en
created: 2026-01-30
issued: 2026-01-30
modified: 2026-02-04
publisher: Leibniz-Zentrum für Archäologie (LEIZA)
broader: klimatisierte Lagerung
broader transitive: Zustandserfassung
broader transitive: klimatisierte Lagerung
broader transitive: Bisherige Lagerung
definition: Die bisherige Lagerung des Objektes erfolgte gekühlt in einem Kühlschrank
in scheme: Konservierungs- und Restaurierungsfachthesaurus für archäologische Kulturgüter
pref label: Kühlschrank
  type: Label
  rank: preferred
pref label: refrigerator
  type: Label
  rank: normal

Grabungsfrischer Fund
type: Concept
notation: C7C3B7
preferred label: freshly excavated find @en
created: 2026-01-30
issued: 2026-01-30
modified: 2026-02-04
publisher: Leibniz-Zentrum für Archäologie (LEIZA)
alternative label: Frischfund
broader: Bisherige Lagerung
broader transitive: Zustandserfassung
broader transitive: Bisherige Lagerung
definition: Das Objekt wurde im direkten Anschluss seiner Bergung von der Grabung in die Restaurierungswerkstatt eingeliefert
in scheme: Konservierungs- und Restaurierungsfachthesaurus für archäologische Kulturgüter
alt label: Frischfund
  type: Label
  rank: preferred
pref label: Grabungsfrischer Fund
  type: Label
  rank: preferred
pref label: freshly excavated find
  type: Label
  rank: normal

Depotlagerung
type: Concept
notation: F52262
preferred label: depot storage @en
created: 2026-01-30
issued: 2026-01-30
modified: 2026-02-04
publisher: Leibniz-Zentrum für Archäologie (LEIZA)
broader: Bisherige Lagerung
broader transitive: Zustandserfassung
broader transitive: Bisherige Lagerung
definition: Das Objekt wurde bis zur Einlieferung in die Restaurierungswerkstatt im Museumsdepot aufbewahrt
in scheme: Konservierungs- und Restaurierungsfachthesaurus für archäologische Kulturgüter
pref label: Depotlagerung
  type: Label
  rank: preferred
pref label: depot storage
  type: Label
  rank: normal

Ausstellungsentnahme
type: Concept
notation: FC3322
preferred label: exhibition withdrawal @en
created: 2026-01-30
issued: 2026-01-30
modified: 2026-02-04
publisher: Leibniz-Zentrum für Archäologie (LEIZA)
broader: Bisherige Lagerung
broader transitive: Zustandserfassung
broader transitive: Bisherige Lagerung
definition: Das Objekt war ausgestellt und wurde zur Bearbeitung aus der Ausstellung/der Vitirine entnommen.
in scheme: Konservierungs- und Restaurierungsfachthesaurus für archäologische Kulturgüter
pref label: Ausstellungsentnahme
  type: Label
  rank: preferred
pref label: exhibition withdrawal
  type: Label
  rank: normal

unklimatisierte Lagerung
type: Concept
notation: G79CA9
preferred label: unclimatized storage @en
created: 2026-01-30
issued: 2026-01-30
modified: 2026-02-04
publisher: Leibniz-Zentrum für Archäologie (LEIZA)
broader: Bisherige Lagerung
broader transitive: Zustandserfassung
broader transitive: Bisherige Lagerung
definition: Die Lagerung erfolgte ohne spezielle auf das Objekt abgestimmte, kontrollierte klimatische Bedingungen
in scheme: Konservierungs- und Restaurierungsfachthesaurus für archäologische Kulturgüter
pref label: unklimatisierte Lagerung
  type: Label
  rank: preferred
pref label: unclimatized storage
  type: Label
  rank: normal

Rückgabe aus Leihverkehr
type: Concept
notation: GC6983
preferred label: return from loans @en
created: 2026-01-30
issued: 2026-01-30
modified: 2026-02-04
publisher: Leibniz-Zentrum für Archäologie (LEIZA)
broader: Bisherige Lagerung
broader transitive: Zustandserfassung
broader transitive: Bisherige Lagerung
definition: Das Objekt war an eine andere Einrichtung verliehen und kommt im Zuge der Rückgabe zur Evaluierung des Zustandes in die Restaurierungswerkstatt.
in scheme: Konservierungs- und Restaurierungsfachthesaurus für archäologische Kulturgüter
pref label: Rückgabe aus Leihverkehr
  type: Label
  rank: preferred
pref label: return from loans
  type: Label
  rank: normal

Fügetechnik
type: Concept
notation: A15F83
created: 2026-01-30
issued: 2026-01-30
modified: 2026-02-04
publisher: Leibniz-Zentrum für Archäologie (LEIZA)
alternative label: Verbindungstechnik
broader: Herstellungstechnik
broader transitive: Herstellungstechnik
broader transitive: [Untersuchungsergebnisse]
broader transitive: Zustandserfassung
broader transitive: Objektuntersuchung
broader transitive: Technologische Auswertung
definition: Oberbegriff für Techniken, die zwei oder mehr Teile mit einander verbindet.
in scheme: Konservierungs- und Restaurierungsfachthesaurus für archäologische Kulturgüter
narrower: gedübelt
narrower: gefalzt
narrower: gezapft
narrower: Millefiori
narrower: gebördelt
narrower: gehäkelt
narrower: gefilzt
narrower: verschraubt
narrower: geklammert
narrower: geschweißt
narrower: genagelt
narrower: genäht
narrower: verstiftet
narrower: gewebt
narrower: geknotet
narrower: geflochten
narrower: verzwirnt
narrower: gestrickt
narrower: verdrillt
narrower: angegossen
narrower: laminiert
narrower: gekittet
narrower: geklebt
narrower: gesteckt
narrower: geklemmt
narrower: gelötet
narrower: gesponnen
narrower: genietet
alt label: Verbindungstechnik
  type: Label
  rank: preferred
pref label: Fügetechnik
  type: Label
  rank: preferred

Herstellungstechnik
type: Concept
notation: F8F594
created: 2026-01-30
issued: 2026-01-30
modified: 2026-02-04
publisher: Leibniz-Zentrum für Archäologie (LEIZA)
alternative label: Produktionstechnik
broader: Technologische Auswertung
broader transitive: [Untersuchungsergebnisse]
broader transitive: Zustandserfassung
broader transitive: Objektuntersuchung
broader transitive: Technologische Auswertung
definition: basierend auf den festgestellten Spuren angenommene Art und Weise wie das Objekt hergestellt worden ist
in scheme: Konservierungs- und Restaurierungsfachthesaurus für archäologische Kulturgüter
narrower: Fügetechnik
narrower: formgebende Technik
alt label: Produktionstechnik
  type: Label
  rank: preferred
pref label: Herstellungstechnik
  type: Label
  rank: preferred

Technologische Auswertung
type: Concept
notation: D6BCC2
created: 2026-01-30
issued: 2026-01-30
modified: 2026-02-04
publisher: Leibniz-Zentrum für Archäologie (LEIZA)
broader: [Untersuchungsergebnisse]
broader transitive: [Untersuchungsergebnisse]
broader transitive: Zustandserfassung
broader transitive: Objektuntersuchung
definition: Identifizierung der Techniken, Verfahren und Konstruktionsprinzipien, die zur Herstellung des Objektes eingesetzt wurden.
in scheme: Konservierungs- und Restaurierungsfachthesaurus für archäologische Kulturgüter
narrower: Herstellungstechnik
narrower: [Technologische Spuren]
narrower: Verzierungstechnik
pref label: Technologische Auswertung
  type: Label
  rank: preferred

gedübelt
type: Concept
notation: A2B2CD
created: 2026-01-30
issued: 2026-01-30
modified: 2026-02-04
publisher: Leibniz-Zentrum für Archäologie (LEIZA)
alternative label: Dübelung
alternative label: verdübelt
broader: Fügetechnik
broader transitive: Fügetechnik
broader transitive: [Untersuchungsergebnisse]
broader transitive: Zustandserfassung
broader transitive: Objektuntersuchung
broader transitive: Technologische Auswertung
broader transitive: Herstellungstechnik
in scheme: Konservierungs- und Restaurierungsfachthesaurus für archäologische Kulturgüter
alt label: Dübelung
  type: Label
  rank: preferred
alt label: verdübelt
  type: Label
  rank: normal
pref label: gedübelt
  type: Label
  rank: preferred

gefalzt
type: Concept
notation: A6CD9G
created: 2026-01-30
issued: 2026-01-30
modified: 2026-02-04
publisher: Leibniz-Zentrum für Archäologie (LEIZA)
alternative label: Falzung
broader: Fügetechnik
broader transitive: Fügetechnik
broader transitive: [Untersuchungsergebnisse]
broader transitive: Zustandserfassung
broader transitive: Objektuntersuchung
broader transitive: Technologische Auswertung
broader transitive: Herstellungstechnik
in scheme: Konservierungs- und Restaurierungsfachthesaurus für archäologische Kulturgüter
alt label: Falzung
  type: Label
  rank: preferred
pref label: gefalzt
  type: Label
  rank: preferred

gezapft
type: Concept
notation: ABAD42
created: 2026-01-30
issued: 2026-01-30
modified: 2026-02-04
publisher: Leibniz-Zentrum für Archäologie (LEIZA)
alternative label: Zapfung
alternative label: verzapft
broader: Fügetechnik
broader transitive: Fügetechnik
broader transitive: [Untersuchungsergebnisse]
broader transitive: Zustandserfassung
broader transitive: Objektuntersuchung
broader transitive: Technologische Auswertung
broader transitive: Herstellungstechnik
in scheme: Konservierungs- und Restaurierungsfachthesaurus für archäologische Kulturgüter
alt label: Zapfung
  type: Label
  rank: preferred
alt label: verzapft
  type: Label
  rank: normal
pref label: gezapft
  type: Label
  rank: preferred

Millefiori
type: Concept
notation: AC92GG
created: 2026-01-30
issued: 2026-01-30
modified: 2026-02-04
publisher: Leibniz-Zentrum für Archäologie (LEIZA)
broader: Fügetechnik
broader transitive: Fügetechnik
broader transitive: [Untersuchungsergebnisse]
broader transitive: Zustandserfassung
broader transitive: Objektuntersuchung
broader transitive: Technologische Auswertung
broader transitive: Herstellungstechnik
in scheme: Konservierungs- und Restaurierungsfachthesaurus für archäologische Kulturgüter
pref label: Millefiori
  type: Label
  rank: preferred

gebördelt
type: Concept
notation: AFFB47
created: 2026-01-30
issued: 2026-01-30
modified: 2026-02-04
publisher: Leibniz-Zentrum für Archäologie (LEIZA)
alternative label: Bördeln
alternative label: Bördelung
alternative label: Umlegen
alternative label: umgelegt
broader: Fügetechnik
broader transitive: Fügetechnik
broader transitive: [Untersuchungsergebnisse]
broader transitive: Zustandserfassung
broader transitive: Objektuntersuchung
broader transitive: Technologische Auswertung
broader transitive: Herstellungstechnik
in scheme: Konservierungs- und Restaurierungsfachthesaurus für archäologische Kulturgüter
alt label: Bördelung
  type: Label
  rank: preferred
alt label: Bördeln
  type: Label
  rank: normal
alt label: umgelegt
  type: Label
  rank: normal
alt label: Umlegen
  type: Label
  rank: normal
pref label: gebördelt
  type: Label
  rank: preferred
definition: umformendes Fertigungsverfahren, bei dem der Rand eines Blechs durch plastische Verformung um eine Schlagunterlage gebogen wird. Es dient zur Verstärkung von Kanten, zur Verbindung von Bauteilen oder zur Herstellung einer glatten und sicheren Abschlusskante.
definition:
  literal form: umformendes Fertigungsverfahren, bei dem der Rand eines Blechs durch plastische Verformung um eine Schlagunterlage gebogen wird. Es dient zur Verstärkung von Kanten, zur Verbindung von Bauteilen oder zur Herstellung einer glatten und sicheren Abschlusskante.

gehäkelt
type: Concept
notation: B24ADG
created: 2026-01-30
issued: 2026-01-30
modified: 2026-02-04
publisher: Leibniz-Zentrum für Archäologie (LEIZA)
alternative label: Häkeln
alternative label: Häkelung
broader: Fügetechnik
broader transitive: Fügetechnik
broader transitive: [Untersuchungsergebnisse]
broader transitive: Zustandserfassung
broader transitive: Objektuntersuchung
broader transitive: Technologische Auswertung
broader transitive: Herstellungstechnik
definition: Fertigungstechnik, bei der ein fortlaufender Faden durch Bilden von Schlingen und Maschen zu einem flexiblen Gewebe verarbeitet wird. Dabei können eine Reihe unterschiedlicher Maschenformen (Luftmaschen, Kettenmaschen, feste Maschen, etc.) variiert und kombiniert werden, wodurch sich eine dichte, oft strukturierte Oberfläche mit vielfältigen Mustermöglichkeiten ergibt. Die Technik kann dabei nur mit den Fingern oder mit Hilfe einer speziellen Nadel mit kleinem Häkchen ausgeführt werden. Häkeln ist eng verwandt mit Stricken. Im Unterschied zum Stricken wird beim Häkeln jedoch nur eine einzelne Häkelnadel (oder Finger) genutzt, wodurch stets nur eine Masche aktiv bearbeitet wird und ein dichteres und stabileres Gewebe entsteht.
definition:
  literal form: Fertigungstechnik, bei der ein fortlaufender Faden durch Bilden von Schlingen und Maschen zu einem flexiblen Gewebe verarbeitet wird. Dabei können eine Reihe unterschiedlicher Maschenformen (Luftmaschen, Kettenmaschen, feste Maschen, etc.) variiert und kombiniert werden, wodurch sich eine dichte, oft strukturierte Oberfläche mit vielfältigen Mustermöglichkeiten ergibt. Die Technik kann dabei nur mit den Fingern oder mit Hilfe einer speziellen Nadel mit kleinem Häkchen ausgeführt werden. Häkeln ist eng verwandt mit Stricken. Im Unterschied zum Stricken wird beim Häkeln jedoch nur eine einzelne Häkelnadel (oder Finger) genutzt, wodurch stets nur eine Masche aktiv bearbeitet wird und ein dichteres und stabileres Gewebe entsteht.
in scheme: Konservierungs- und Restaurierungsfachthesaurus für archäologische Kulturgüter
alt label: Häkelung
  type: Label
  rank: preferred
alt label: Häkeln
  type: Label
  rank: normal
pref label: gehäkelt
  type: Label
  rank: preferred

gefilzt
type: Concept
notation: B2CC48
created: 2026-01-30
issued: 2026-01-30
modified: 2026-02-04
publisher: Leibniz-Zentrum für Archäologie (LEIZA)
alternative label: Filzung
broader: Fügetechnik
broader transitive: Fügetechnik
broader transitive: [Untersuchungsergebnisse]
broader transitive: Zustandserfassung
broader transitive: Objektuntersuchung
broader transitive: Technologische Auswertung
broader transitive: Herstellungstechnik
definition: Technik bei der Fasern, meist aus Wolle oder anderen tierischen Haaren, durch mechanische Bearbeitung und Feuchtigkeit miteinander verbunden werden, ohne dass ein zusätzliches Bindemittel erforderlich ist. Durch Walken, Pressen oder Nadelfilzen verhaken sich die Fasern dauerhaft und bilden eine dichte, textile Struktur.
definition:
  literal form: Technik bei der Fasern, meist aus Wolle oder anderen tierischen Haaren, durch mechanische Bearbeitung und Feuchtigkeit miteinander verbunden werden, ohne dass ein zusätzliches Bindemittel erforderlich ist. Durch Walken, Pressen oder Nadelfilzen verhaken sich die Fasern dauerhaft und bilden eine dichte, textile Struktur.
in scheme: Konservierungs- und Restaurierungsfachthesaurus für archäologische Kulturgüter
alt label: Filzung
  type: Label
  rank: preferred
pref label: gefilzt
  type: Label
  rank: preferred

verschraubt
type: Concept
notation: B5D998
created: 2026-01-30
issued: 2026-01-30
modified: 2026-02-04
publisher: Leibniz-Zentrum für Archäologie (LEIZA)
alternative label: Schrauben
alternative label: Verschrauben
alternative label: geschraubt
broader: Fügetechnik
broader transitive: Fügetechnik
broader transitive: [Untersuchungsergebnisse]
broader transitive: Zustandserfassung
broader transitive: Objektuntersuchung
broader transitive: Technologische Auswertung
broader transitive: Herstellungstechnik
in scheme: Konservierungs- und Restaurierungsfachthesaurus für archäologische Kulturgüter
alt label: geschraubt
  type: Label
  rank: preferred
alt label: Schrauben
  type: Label
  rank: normal
alt label: Verschrauben
  type: Label
  rank: normal
pref label: verschraubt
  type: Label
  rank: preferred
definition: Verbindungstechnik, bei der zwei oder mehr Teile durch das Eindrehen einer Schraube miteinander verbunden werden. Dabei wird die Schraube in ein entsprechendes Gewinde des Werkstücks oder einer Mutter eingeführt, wodurch eine feste und sichere Verbindung entsteht.
definition:
  literal form: Verbindungstechnik, bei der zwei oder mehr Teile durch das Eindrehen einer Schraube miteinander verbunden werden. Dabei wird die Schraube in ein entsprechendes Gewinde des Werkstücks oder einer Mutter eingeführt, wodurch eine feste und sichere Verbindung entsteht.

geklammert
type: Concept
notation: B61CC6
created: 2026-01-30
issued: 2026-01-30
modified: 2026-02-04
publisher: Leibniz-Zentrum für Archäologie (LEIZA)
alternative label: Klammerung
alternative label: verklammert
broader: Fügetechnik
broader transitive: Fügetechnik
broader transitive: [Untersuchungsergebnisse]
broader transitive: Zustandserfassung
broader transitive: Objektuntersuchung
broader transitive: Technologische Auswertung
broader transitive: Herstellungstechnik
in scheme: Konservierungs- und Restaurierungsfachthesaurus für archäologische Kulturgüter
alt label: verklammert
  type: Label
  rank: preferred
alt label: Klammerung
  type: Label
  rank: normal
pref label: geklammert
  type: Label
  rank: preferred

geschweißt
type: Concept
notation: BABA94
created: 2026-01-30
issued: 2026-01-30
modified: 2026-02-04
publisher: Leibniz-Zentrum für Archäologie (LEIZA)
alternative label: Schweißung
alternative label: Verschweißung
alternative label: verschweißt
broader: Fügetechnik
broader transitive: Fügetechnik
broader transitive: Zustandserfassung
broader transitive: Objektuntersuchung
broader transitive: [Untersuchungsergebnisse]
broader transitive: Technologische Auswertung
broader transitive: Herstellungstechnik
in scheme: Konservierungs- und Restaurierungsfachthesaurus für archäologische Kulturgüter
alt label: Schweißung
  type: Label
  rank: preferred
alt label: Verschweißung
  type: Label
  rank: normal
alt label: verschweißt
  type: Label
  rank: normal
pref label: geschweißt
  type: Label
  rank: preferred
definition: stoffschlüssige Fügetechnik, bei der Materialien mit annähernd gleichem Schmelzintervall durch Wärme und/oder Druck in einen flüssigen oder plastischen Zustand versetzt werden, um sie miteinander zu vereinigen. Dabei kann mit oder ohne Zusatzwerkstoffen oder Flussmitteln gearbeitet werden.
definition:
  literal form: stoffschlüssige Fügetechnik, bei der Materialien mit annähernd gleichem Schmelzintervall durch Wärme und/oder Druck in einen flüssigen oder plastischen Zustand versetzt werden, um sie miteinander zu vereinigen. Dabei kann mit oder ohne Zusatzwerkstoffen oder Flussmitteln gearbeitet werden.

genagelt
type: Concept
notation: BD18A1
created: 2026-01-30
issued: 2026-01-30
modified: 2026-02-04
publisher: Leibniz-Zentrum für Archäologie (LEIZA)
alternative label: Nagelung
broader: Fügetechnik
broader transitive: Fügetechnik
broader transitive: [Untersuchungsergebnisse]
broader transitive: Zustandserfassung
broader transitive: Objektuntersuchung
broader transitive: Technologische Auswertung
broader transitive: Herstellungstechnik
in scheme: Konservierungs- und Restaurierungsfachthesaurus für archäologische Kulturgüter
alt label: Nagelung
  type: Label
  rank: preferred
pref label: genagelt
  type: Label
  rank: preferred

genäht
type: Concept
notation: C26D24
created: 2026-01-30
issued: 2026-01-30
modified: 2026-02-04
publisher: Leibniz-Zentrum für Archäologie (LEIZA)
alternative label: Nähen
alternative label: vernäht
broader: Fügetechnik
broader transitive: Fügetechnik
broader transitive: [Untersuchungsergebnisse]
broader transitive: Zustandserfassung
broader transitive: Objektuntersuchung
broader transitive: Technologische Auswertung
broader transitive: Herstellungstechnik
definition: Fügetechnik, bei der zwei oder mehr Materialien mit Hilfe eines fortlaufenden Fadens und eines spitzen Werkzeugs (z.B. Nadel) durch mehrmaliges Durchstechen miteinander verbunden werden. Die Technik erzeugt eine Naht, die nicht nur funktionale sondern auch dekorative Zwecke erfüllen kann.
definition:
  literal form: Fügetechnik, bei der zwei oder mehr Materialien mit Hilfe eines fortlaufenden Fadens und eines spitzen Werkzeugs (z.B. Nadel) durch mehrmaliges Durchstechen miteinander verbunden werden. Die Technik erzeugt eine Naht, die nicht nur funktionale sondern auch dekorative Zwecke erfüllen kann.
in scheme: Konservierungs- und Restaurierungsfachthesaurus für archäologische Kulturgüter
alt label: vernäht
  type: Label
  rank: preferred
alt label: Nähen
  type: Label
  rank: normal
pref label: genäht
  type: Label
  rank: preferred

verstiftet
type: Concept
notation: C5FAFF
created: 2026-01-30
issued: 2026-01-30
modified: 2026-02-04
publisher: Leibniz-Zentrum für Archäologie (LEIZA)
alternative label: Verstiftung
broader: Fügetechnik
broader transitive: Fügetechnik
broader transitive: [Untersuchungsergebnisse]
broader transitive: Zustandserfassung
broader transitive: Objektuntersuchung
broader transitive: Technologische Auswertung
broader transitive: Herstellungstechnik
in scheme: Konservierungs- und Restaurierungsfachthesaurus für archäologische Kulturgüter
alt label: Verstiftung
  type: Label
  rank: preferred
pref label: verstiftet
  type: Label
  rank: preferred
definition: Fügetechnik, bei der zwei Werkteile durch das Einführen und Fixieren eines Scharnierstiftes in ein Scharnier (oder eine ähnliche Bewegung) mit einander verbunden werden. Um den Scharnierstift zu fixieren, werden seine Enden wie bei einem Niet breitgeschmiedet. Dabei kann eines der Enden bereits vor dem Einführen des Stiftes verbreitert worden sein, im Goldschmiedehandwerk z.B. etwa durch Anschmelzen eines Kügelchens o.Ä. Im Gegensatz zur Vernietung handelt es sich bei verstifteten Verbindungen in der Regel um bewegliche Verbindungen.
definition:
  literal form: Fügetechnik, bei der zwei Werkteile durch das Einführen und Fixieren eines Scharnierstiftes in ein Scharnier (oder eine ähnliche Bewegung) mit einander verbunden werden. Um den Scharnierstift zu fixieren, werden seine Enden wie bei einem Niet breitgeschmiedet. Dabei kann eines der Enden bereits vor dem Einführen des Stiftes verbreitert worden sein, im Goldschmiedehandwerk z.B. etwa durch Anschmelzen eines Kügelchens o.Ä. Im Gegensatz zur Vernietung handelt es sich bei verstifteten Verbindungen in der Regel um bewegliche Verbindungen.

gewebt
type: Concept
notation: CAF8AF
preferred label: weave @en
created: 2026-01-30
issued: 2026-01-30
modified: 2026-02-04
publisher: Leibniz-Zentrum für Archäologie (LEIZA)
alternative label: Weben
alternative label: Webung
alternative label: verwebt
broader: Fügetechnik
broader transitive: Fügetechnik
broader transitive: [Untersuchungsergebnisse]
broader transitive: Zustandserfassung
broader transitive: Objektuntersuchung
broader transitive: Technologische Auswertung
broader transitive: Herstellungstechnik
in scheme: Konservierungs- und Restaurierungsfachthesaurus für archäologische Kulturgüter
alt label: Webung
  type: Label
  rank: preferred
alt label: verwebt
  type: Label
  rank: normal
alt label: Weben
  type: Label
  rank: normal
pref label: gewebt
  type: Label
  rank: preferred
pref label: weave
  type: Label
  rank: normal
definition: textile Fertigungstechnik, bei der zwei Fadensysteme, Kette und Schuss, rechtwinklig ineinander verflochten werden, um ein stabiles Gewebe zu erzeugen. Dabei werden die Kettfäden in einem Webrahmen oder einer Webmaschine gespannt, während der Schussfaden durch sie hindurchgeführt wird.
definition:
  literal form: textile Fertigungstechnik, bei der zwei Fadensysteme, Kette und Schuss, rechtwinklig ineinander verflochten werden, um ein stabiles Gewebe zu erzeugen. Dabei werden die Kettfäden in einem Webrahmen oder einer Webmaschine gespannt, während der Schussfaden durch sie hindurchgeführt wird.
narrower: Leinwandbindung
narrower: Köperbindung
narrower: Kompositbindung
narrower: Atlasbindung
narrower: Ripsbindung

geknotet
type: Concept
notation: D1CA6B
created: 2026-01-30
issued: 2026-01-30
modified: 2026-02-04
publisher: Leibniz-Zentrum für Archäologie (LEIZA)
alternative label: Knotung
alternative label: Verknoten
alternative label: verknotet
broader: Fügetechnik
broader transitive: Fügetechnik
broader transitive: [Untersuchungsergebnisse]
broader transitive: Zustandserfassung
broader transitive: Objektuntersuchung
broader transitive: Technologische Auswertung
broader transitive: Herstellungstechnik
definition: Fertigungstechnik, bei der zwei oder mehrere Fäden durch straffes Anziehen von Schleifen, Verschlingungen oder Maschen miteinander verbunden werden. Knotungen können zur einfachen Verbindung loser Enden oder zur Bildung flächiger Gewebe verwendet werden.
definition:
  literal form: Fertigungstechnik, bei der zwei oder mehrere Fäden durch straffes Anziehen von Schleifen, Verschlingungen oder Maschen miteinander verbunden werden. Knotungen können zur einfachen Verbindung loser Enden oder zur Bildung flächiger Gewebe verwendet werden.
in scheme: Konservierungs- und Restaurierungsfachthesaurus für archäologische Kulturgüter
alt label: Knotung
  type: Label
  rank: preferred
alt label: verknotet
  type: Label
  rank: normal
alt label: Verknoten
  type: Label
  rank: normal
pref label: geknotet
  type: Label
  rank: preferred
narrower: geknüpft

geflochten
type: Concept
notation: D6DFDB
created: 2026-01-30
issued: 2026-01-30
modified: 2026-02-04
publisher: Leibniz-Zentrum für Archäologie (LEIZA)
alternative label: Flechten
alternative label: Flechtung
alternative label: verflochten
broader: Fügetechnik
broader transitive: Fügetechnik
broader transitive: [Untersuchungsergebnisse]
broader transitive: Zustandserfassung
broader transitive: Objektuntersuchung
broader transitive: Technologische Auswertung
broader transitive: Herstellungstechnik
in scheme: Konservierungs- und Restaurierungsfachthesaurus für archäologische Kulturgüter
alt label: Flechtung
  type: Label
  rank: preferred
alt label: verflochten
  type: Label
  rank: normal
alt label: Flechten
  type: Label
  rank: normal
pref label: geflochten
  type: Label
  rank: preferred
definition: Verbindungstechnik, bei der drei oder mehrere Fäden, Drähte oder Bänder durch systematisches Überkreuzen zu einem textilen Gewebe verbunden werden. Je nach Art der Verflechtungen lassen sich Systeme in zwei oder mehrere Richtungen sowie zwei- oder auch dreidimensionales Flechten unterscheiden. Häufiges Produkt der Flechttechnik sind Zöpfe, Kordeln bis hin zu flächigen Textilgebilden.
definition:
  literal form: Verbindungstechnik, bei der drei oder mehrere Fäden, Drähte oder Bänder durch systematisches Überkreuzen zu einem textilen Gewebe verbunden werden. Je nach Art der Verflechtungen lassen sich Systeme in zwei oder mehrere Richtungen sowie zwei- oder auch dreidimensionales Flechten unterscheiden. Häufiges Produkt der Flechttechnik sind Zöpfe, Kordeln bis hin zu flächigen Textilgebilden.

verzwirnt
type: Concept
notation: D9165B
preferred label: twist @en
created: 2026-01-30
issued: 2026-01-30
modified: 2026-02-04
publisher: Leibniz-Zentrum für Archäologie (LEIZA)
broader: Fügetechnik
broader transitive: Fügetechnik
broader transitive: [Untersuchungsergebnisse]
broader transitive: Zustandserfassung
broader transitive: Objektuntersuchung
broader transitive: Technologische Auswertung
broader transitive: Herstellungstechnik
in scheme: Konservierungs- und Restaurierungsfachthesaurus für archäologische Kulturgüter
pref label: verzwirnt
  type: Label
  rank: preferred
pref label: twist
  type: Label
  rank: normal
definition: kontrollierterer und gezielterer Fertigungsprozess, zur Herstellung von Garnen/Zwirn. Dabei werden zwei oder mehr gesponnene Einzelfäden mit entgegengesetzter Drehrichtung fest miteinander verdreht (Z- oder S-Drehung), um eine stabile, gleichmäßige und glattere Struktur mit höherer Festigkeit und Elastizität zu erzeugen.
definition:
  literal form: kontrollierterer und gezielterer Fertigungsprozess, zur Herstellung von Garnen/Zwirn. Dabei werden zwei oder mehr gesponnene Einzelfäden mit entgegengesetzter Drehrichtung fest miteinander verdreht (Z- oder S-Drehung), um eine stabile, gleichmäßige und glattere Struktur mit höherer Festigkeit und Elastizität zu erzeugen.

gestrickt
type: Concept
notation: D96833
created: 2026-01-30
issued: 2026-01-30
modified: 2026-02-04
publisher: Leibniz-Zentrum für Archäologie (LEIZA)
alternative label: Stricken
broader: Fügetechnik
broader transitive: Fügetechnik
broader transitive: [Untersuchungsergebnisse]
broader transitive: Zustandserfassung
broader transitive: Objektuntersuchung
broader transitive: Technologische Auswertung
broader transitive: Herstellungstechnik
definition: Fertigungstechnik, bei der ein fortlaufender Faden mit Hilfe von Stricknadeln oder einer Maschine mit sich selbst zu einem flexiblen Maschengewebe verarbeitet wird. Dabei wird der Faden zu einzelnen Maschenreihen geformt, die ineinander verschlungen werden. Auf diese Weise entsteht ein dehnbares und elastisches Gewebe, welches sich in Muster und Struktur variieren lässt. Stricken ist eng verwandt mit der Technik des Häkelns, wobei der Unterschied in der Anzahl verwendeter Nadeln und aktiver Maschen liegt. Beim Stricken kommen zwei oder mehr Nadeln zum Einsatz, wobei jeweils mehrere Maschen gleichzeitig auf der Nadel gehalten werden.
definition:
  literal form: Fertigungstechnik, bei der ein fortlaufender Faden mit Hilfe von Stricknadeln oder einer Maschine mit sich selbst zu einem flexiblen Maschengewebe verarbeitet wird. Dabei wird der Faden zu einzelnen Maschenreihen geformt, die ineinander verschlungen werden. Auf diese Weise entsteht ein dehnbares und elastisches Gewebe, welches sich in Muster und Struktur variieren lässt. Stricken ist eng verwandt mit der Technik des Häkelns, wobei der Unterschied in der Anzahl verwendeter Nadeln und aktiver Maschen liegt. Beim Stricken kommen zwei oder mehr Nadeln zum Einsatz, wobei jeweils mehrere Maschen gleichzeitig auf der Nadel gehalten werden.
in scheme: Konservierungs- und Restaurierungsfachthesaurus für archäologische Kulturgüter
alt label: Stricken
  type: Label
  rank: preferred
pref label: gestrickt
  type: Label
  rank: preferred

verdrillt
type: Concept
notation: D9G8B5
preferred label: twist @en
created: 2026-01-30
issued: 2026-01-30
modified: 2026-02-04
publisher: Leibniz-Zentrum für Archäologie (LEIZA)
alternative label: Verdrillen
broader: Fügetechnik
broader transitive: Fügetechnik
broader transitive: [Untersuchungsergebnisse]
broader transitive: Zustandserfassung
broader transitive: Objektuntersuchung
broader transitive: Technologische Auswertung
broader transitive: Herstellungstechnik
in scheme: Konservierungs- und Restaurierungsfachthesaurus für archäologische Kulturgüter
alt label: Verdrillen
  type: Label
  rank: preferred
pref label: verdrillt
  type: Label
  rank: preferred
pref label: twist
  type: Label
  rank: normal
definition: Verbindungstechnik, bei der zwei oder mehr Fasern, Drähte oder Fäden durch einfaches Verdrehen von Hand miteinander verbunden werden. Diese Technik wird häufig bei der Herstellung von Seilen oder Kordeln angewendet, um die Zugfestigkeit und Stabilität des Materials zu erhöhen. Durch die Verdrehung entsteht eine gleichmäßige, widerstandsfähige Struktur, die je nach Material und Stärke der Verdrillung in ihrer Festigkeit und Elastizität variieren kann.
definition:
  literal form: Verbindungstechnik, bei der zwei oder mehr Fasern, Drähte oder Fäden durch einfaches Verdrehen von Hand miteinander verbunden werden. Diese Technik wird häufig bei der Herstellung von Seilen oder Kordeln angewendet, um die Zugfestigkeit und Stabilität des Materials zu erhöhen. Durch die Verdrehung entsteht eine gleichmäßige, widerstandsfähige Struktur, die je nach Material und Stärke der Verdrillung in ihrer Festigkeit und Elastizität variieren kann.

angegossen
type: Concept
notation: DA7G45
created: 2026-01-30
issued: 2026-01-30
modified: 2026-02-04
publisher: Leibniz-Zentrum für Archäologie (LEIZA)
alternative label: Anguss
broader: Fügetechnik
broader transitive: Fügetechnik
broader transitive: Zustandserfassung
broader transitive: Objektuntersuchung
broader transitive: [Untersuchungsergebnisse]
broader transitive: Technologische Auswertung
broader transitive: Herstellungstechnik
in scheme: Konservierungs- und Restaurierungsfachthesaurus für archäologische Kulturgüter
alt label: Anguss
  type: Label
  rank: preferred
pref label: angegossen
  type: Label
  rank: preferred
narrower: Überfangguss

laminiert
type: Concept
notation: F93B74
created: 2026-01-30
issued: 2026-01-30
modified: 2026-02-04
publisher: Leibniz-Zentrum für Archäologie (LEIZA)
alternative label: Laminierung (Herstellung)
broader: Fügetechnik
broader transitive: Fügetechnik
broader transitive: [Untersuchungsergebnisse]
broader transitive: Zustandserfassung
broader transitive: Objektuntersuchung
broader transitive: Technologische Auswertung
broader transitive: Herstellungstechnik
in scheme: Konservierungs- und Restaurierungsfachthesaurus für archäologische Kulturgüter
alt label: Laminierung (Herstellung)
  type: Label
  rank: preferred
pref label: laminiert
  type: Label
  rank: preferred

gekittet
type: Concept
notation: F988F4
created: 2026-01-30
issued: 2026-01-30
modified: 2026-02-04
publisher: Leibniz-Zentrum für Archäologie (LEIZA)
alternative label: Kittung
alternative label: verkittet
broader: Fügetechnik
broader transitive: Fügetechnik
broader transitive: [Untersuchungsergebnisse]
broader transitive: Zustandserfassung
broader transitive: Objektuntersuchung
broader transitive: Technologische Auswertung
broader transitive: Herstellungstechnik
in scheme: Konservierungs- und Restaurierungsfachthesaurus für archäologische Kulturgüter
alt label: Kittung
  type: Label
  rank: preferred
alt label: verkittet
  type: Label
  rank: normal
pref label: gekittet
  type: Label
  rank: preferred
definition: Fügetechnik, bei der Werkstücke mit Hilfe von festen Klebstoffen (Kitt) miteinander verbunden werden. Der Kitt wird in schmelzflüssiger Form auf die zu verbindenden Werkteile aufgetragen und erstarrt beim anschließenden Abkühlen. Auf diese Art bildet sich eine feste Verbindung, die durch erneutes Erwärmen des Kittes leicht wieder gelöst werden kann. Verkittungen werden oft eingesetzt, um größere Zwischenräume zu füllen, Fugen abzudichten oder als Unterlage für Treib-, Gravur- oder Ziselierarbeiten.
definition:
  literal form: Fügetechnik, bei der Werkstücke mit Hilfe von festen Klebstoffen (Kitt) miteinander verbunden werden. Der Kitt wird in schmelzflüssiger Form auf die zu verbindenden Werkteile aufgetragen und erstarrt beim anschließenden Abkühlen. Auf diese Art bildet sich eine feste Verbindung, die durch erneutes Erwärmen des Kittes leicht wieder gelöst werden kann. Verkittungen werden oft eingesetzt, um größere Zwischenräume zu füllen, Fugen abzudichten oder als Unterlage für Treib-, Gravur- oder Ziselierarbeiten.

geklebt
type: Concept
notation: FB76BC
created: 2026-01-30
issued: 2026-01-30
modified: 2026-02-04
publisher: Leibniz-Zentrum für Archäologie (LEIZA)
alternative label: Klebung (Herstellungstechnik)
alternative label: verklebt
broader: Fügetechnik
broader transitive: Fügetechnik
broader transitive: [Untersuchungsergebnisse]
broader transitive: Zustandserfassung
broader transitive: Objektuntersuchung
broader transitive: Technologische Auswertung
broader transitive: Herstellungstechnik
in scheme: Konservierungs- und Restaurierungsfachthesaurus für archäologische Kulturgüter
alt label: Klebung (Herstellungstechnik)
  type: Label
  rank: preferred
alt label: verklebt
  type: Label
  rank: normal
pref label: geklebt
  type: Label
  rank: preferred
definition: Fügetechnik, bei der Werkteile mit Hilfe von flüssigen, pastenartigen oder festen Werkstoffen (Klebstoffe) mit einander verbunden werden. Die Haftung entsteht dabei aus Adhäsionskräften zwischen Klebstoff und Verbundfläche und Kohäsionskräften zwischen den Molekülen innerhalb des Klebstoffes.
definition:
  literal form: Fügetechnik, bei der Werkteile mit Hilfe von flüssigen, pastenartigen oder festen Werkstoffen (Klebstoffe) mit einander verbunden werden. Die Haftung entsteht dabei aus Adhäsionskräften zwischen Klebstoff und Verbundfläche und Kohäsionskräften zwischen den Molekülen innerhalb des Klebstoffes.

gesteckt
type: Concept
notation: FC7874
created: 2026-01-30
issued: 2026-01-30
modified: 2026-02-04
publisher: Leibniz-Zentrum für Archäologie (LEIZA)
alternative label: Steckung
broader: Fügetechnik
broader transitive: Fügetechnik
broader transitive: [Untersuchungsergebnisse]
broader transitive: Zustandserfassung
broader transitive: Objektuntersuchung
broader transitive: Technologische Auswertung
broader transitive: Herstellungstechnik
in scheme: Konservierungs- und Restaurierungsfachthesaurus für archäologische Kulturgüter
alt label: Steckung
  type: Label
  rank: preferred
pref label: gesteckt
  type: Label
  rank: preferred

geklemmt
type: Concept
notation: G4B128
created: 2026-01-30
issued: 2026-01-30
modified: 2026-02-04
publisher: Leibniz-Zentrum für Archäologie (LEIZA)
alternative label: Klemmung
alternative label: verklemmt
broader: Fügetechnik
broader transitive: Fügetechnik
broader transitive: [Untersuchungsergebnisse]
broader transitive: Zustandserfassung
broader transitive: Objektuntersuchung
broader transitive: Technologische Auswertung
broader transitive: Herstellungstechnik
in scheme: Konservierungs- und Restaurierungsfachthesaurus für archäologische Kulturgüter
alt label: verklemmt
  type: Label
  rank: preferred
alt label: Klemmung
  type: Label
  rank: normal
pref label: geklemmt
  type: Label
  rank: preferred

gelötet
type: Concept
notation: G6GG4C
created: 2026-01-30
issued: 2026-01-30
modified: 2026-02-04
publisher: Leibniz-Zentrum für Archäologie (LEIZA)
alternative label: Lötung
broader: Fügetechnik
broader transitive: Fügetechnik
broader transitive: Herstellungstechnik
broader transitive: [Untersuchungsergebnisse]
broader transitive: Zustandserfassung
broader transitive: Objektuntersuchung
broader transitive: Technologische Auswertung
definition: Fügetechnik, bei der metallische Werkstücke durch geschmolzene metallische Bindemittel (Lote) stoffschlüssig verbunden werden. Dabei wird die zu lötende Stelle erhitzt, bis das Lot schmilzt und die Fuge der Verbindungsstelle ausfüllt. Die zu verbindenden Metalle bleiben während der Lötung im festen Zustand und werden durch die Diffusion des geschmolzenen Lotes verbunden.
definition:
  literal form: Fügetechnik, bei der metallische Werkstücke durch geschmolzene metallische Bindemittel (Lote) stoffschlüssig verbunden werden. Dabei wird die zu lötende Stelle erhitzt, bis das Lot schmilzt und die Fuge der Verbindungsstelle ausfüllt. Die zu verbindenden Metalle bleiben während der Lötung im festen Zustand und werden durch die Diffusion des geschmolzenen Lotes verbunden.
in scheme: Konservierungs- und Restaurierungsfachthesaurus für archäologische Kulturgüter
narrower: weichgelötet
narrower: hartgelötet
alt label: Lötung
  type: Label
  rank: preferred
pref label: gelötet
  type: Label
  rank: preferred

gesponnen
type: Concept
notation: G859A7
preferred label: spinning @en
created: 2026-01-30
issued: 2026-01-30
modified: 2026-02-04
publisher: Leibniz-Zentrum für Archäologie (LEIZA)
alternative label: Spinnen
broader: Fügetechnik
broader transitive: Fügetechnik
broader transitive: [Untersuchungsergebnisse]
broader transitive: Zustandserfassung
broader transitive: Objektuntersuchung
broader transitive: Technologische Auswertung
broader transitive: Herstellungstechnik
in scheme: Konservierungs- und Restaurierungsfachthesaurus für archäologische Kulturgüter
alt label: Spinnen
  type: Label
  rank: preferred
pref label: gesponnen
  type: Label
  rank: preferred
pref label: spinning
  type: Label
  rank: normal
definition: textile Fertigungstechnik, bei der Fasern oder Haare (z.B. Wolle) durch Verdrehen zu einem kontinuierlichen Faden verarbeitet werden. Dieser Prozess kann mechanisch oder manuell erfolgen und dient dazu, lose Fasern zu einem festen, belastbaren und verarbeitungsfähigen Faden zu verbinden. Gesponnene Garne bilden die Grundlage für textile Gewebe, Strickwaren oder Seile und können je nach Verwendungszweck in ihrer Feinheit, Festigkeit und Elastizität variieren.
definition:
  literal form: textile Fertigungstechnik, bei der Fasern oder Haare (z.B. Wolle) durch Verdrehen zu einem kontinuierlichen Faden verarbeitet werden. Dieser Prozess kann mechanisch oder manuell erfolgen und dient dazu, lose Fasern zu einem festen, belastbaren und verarbeitungsfähigen Faden zu verbinden. Gesponnene Garne bilden die Grundlage für textile Gewebe, Strickwaren oder Seile und können je nach Verwendungszweck in ihrer Feinheit, Festigkeit und Elastizität variieren.

genietet
type: Concept
notation: G887B8
created: 2026-01-30
issued: 2026-01-30
modified: 2026-02-04
publisher: Leibniz-Zentrum für Archäologie (LEIZA)
alternative label: Nietung
alternative label: Vernietung
alternative label: vernietet
broader: Fügetechnik
broader transitive: Fügetechnik
broader transitive: [Untersuchungsergebnisse]
broader transitive: Zustandserfassung
broader transitive: Objektuntersuchung
broader transitive: Technologische Auswertung
broader transitive: Herstellungstechnik
in scheme: Konservierungs- und Restaurierungsfachthesaurus für archäologische Kulturgüter
alt label: vernietet
  type: Label
  rank: preferred
alt label: Vernietung
  type: Label
  rank: normal
alt label: Nietung
  type: Label
  rank: normal
pref label: genietet
  type: Label
  rank: preferred
definition: Fügetechnik, bei der zwei Werkteile durch ein oder mehrere Nietstifte fest miteinander fixiert werden. Der Niet wird dafür in ein entsprechend vorbereites Loch durch beide Werkteile geführt und seine Enden aufgeweitet, wobei die Nietköpfe in unterschiedlichen Arten ausgeformt sein können (Senkniet, Halbrundniet, Flachniet, etc.). Häufig wurde der Setzkopf (Nietkopf) auf einer Seite des Nietes bereits bei der Herstellung des Nietes angelegt, im Goldschmiedehandwerk z.B. durch Anschmelzen eines Kügelchens. Bei Vernietungen mit einem Niet, sind die Werkteile unlösbar mit einander verbunden, jedoch weiterhin um den Niet herum beweglich. Bei mehreren Nieten werden die beiden Werketeile starr miteinander verbunden, sodass keine Bewegung mehr möglich ist.
definition:
  literal form: Fügetechnik, bei der zwei Werkteile durch ein oder mehrere Nietstifte fest miteinander fixiert werden. Der Niet wird dafür in ein entsprechend vorbereites Loch durch beide Werkteile geführt und seine Enden aufgeweitet, wobei die Nietköpfe in unterschiedlichen Arten ausgeformt sein können (Senkniet, Halbrundniet, Flachniet, etc.). Häufig wurde der Setzkopf (Nietkopf) auf einer Seite des Nietes bereits bei der Herstellung des Nietes angelegt, im Goldschmiedehandwerk z.B. durch Anschmelzen eines Kügelchens. Bei Vernietungen mit einem Niet, sind die Werkteile unlösbar mit einander verbunden, jedoch weiterhin um den Niet herum beweglich. Bei mehreren Nieten werden die beiden Werketeile starr miteinander verbunden, sodass keine Bewegung mehr möglich ist.

[Untersuchungsgerät]
type: Concept
type: NonIndexingConcept
type: GuideTerm
notation: AA6941
preferred label: analytical device @en
created: 2026-01-30
issued: 2026-01-30
modified: 2026-02-04
publisher: Leibniz-Zentrum für Archäologie (LEIZA)
broader: Objektuntersuchung
broader transitive: Zustandserfassung
broader transitive: Objektuntersuchung
definition: Zur Untersuchung/Analyse des Objektes bzw. seines Werkstoffs verwendete Gerätschaft
in scheme: Konservierungs- und Restaurierungsfachthesaurus für archäologische Kulturgüter
narrower: Spektrometer
narrower: Mikroskop
narrower: Computertomograph
narrower: UV-Lampe
narrower: konventionelles Röntgengerät
pref label: [Untersuchungsgerät]
  type: Label
  rank: preferred
pref label: analytical device
  type: Label
  rank: normal
alternative label: Analysegerät
alt label: Analysegerät
  type: Label
  rank: preferred

formgebende Technik
type: Concept
notation: AGG387
created: 2026-01-30
issued: 2026-01-30
modified: 2026-02-04
publisher: Leibniz-Zentrum für Archäologie (LEIZA)
alternative label: Formgebungstechnik
alternative label: Formung
broader: Herstellungstechnik
broader transitive: [Untersuchungsergebnisse]
broader transitive: Zustandserfassung
broader transitive: Objektuntersuchung
broader transitive: Technologische Auswertung
broader transitive: Herstellungstechnik
definition: Oberbegriff für Verfahren und Methoden, mit denen Materialien in eine gewünschte Form gebracht werden.
in scheme: Konservierungs- und Restaurierungsfachthesaurus für archäologische Kulturgüter
alt label: Formung
  type: Label
  rank: preferred
alt label: Formgebungstechnik
  type: Label
  rank: normal
pref label: formgebende Technik
  type: Label
  rank: preferred
narrower: gedengelt
narrower: geprägt
narrower: gebohrt
narrower: gewickelt
narrower: gepresst
narrower: gespalten
narrower: gespitzt
narrower: nachgedreht
narrower: gebeilt
narrower: durchgeschlagen
narrower: gerollt
narrower: geschmiedet
narrower: gemeißelt
narrower: gegossen
narrower: gezahnt
narrower: gesägt
narrower: gebrannt
narrower: geschmolzen
narrower: geschnitten
narrower: gefeilt
narrower: modelliert
narrower: geschnitzt (formgebende Technik)
narrower: getrieben
narrower: gedreht
narrower: geschabt
narrower: gebogen
narrower: handaufgebaut
narrower: geblasen
narrower: gehobelt
narrower: gedrückt
narrower: geraspelt
narrower: gedrechselt
narrower: scheibengedreht
narrower: geglättet
narrower: gezogen
narrower: gefräst
narrower: geschliffen [Formgebung]

weichgelötet
type: Concept
notation: B7A13A
created: 2026-01-30
issued: 2026-01-30
modified: 2026-02-04
publisher: Leibniz-Zentrum für Archäologie (LEIZA)
alternative label: Weichlötung
broader: gelötet
broader transitive: Fügetechnik
broader transitive: Zustandserfassung
broader transitive: Objektuntersuchung
broader transitive: gelötet
broader transitive: [Untersuchungsergebnisse]
broader transitive: Technologische Auswertung
broader transitive: Herstellungstechnik
in scheme: Konservierungs- und Restaurierungsfachthesaurus für archäologische Kulturgüter
alt label: Weichlötung
  type: Label
  rank: preferred
pref label: weichgelötet
  type: Label
  rank: preferred
definition: Lötung mit niedrigschmelzenden Loten (Weichloten), bei einer Arbeitstemperatur unterhalb 450°C.

Schadensphänomen
type: Concept
notation: DAC996
preferred label: Damage type @en
created: 2026-01-30
issued: 2026-01-30
modified: 2026-02-04
publisher: Leibniz-Zentrum für Archäologie (LEIZA)
alternative label: Beschädigungsart
alternative label: Schadensbild
broader: [Untersuchungsergebnisse]
broader transitive: [Untersuchungsergebnisse]
broader transitive: Zustandserfassung
broader transitive: Objektuntersuchung
definition: Art der beobachteten negativen Veränderungen des Objekts im Vergleich zu seinem als ursprünglich angenommenen Zustandes.
in scheme: Konservierungs- und Restaurierungsfachthesaurus für archäologische Kulturgüter
alt label: Schadensbild
  type: Label
  rank: preferred
alt label: Beschädigungsart
  type: Label
  rank: normal
pref label: Schadensphänomen
  type: Label
  rank: preferred
pref label: Damage type
  type: Label
  rank: normal
narrower: [materialspezifische Schadensphänomene]
narrower: [allgemeine Schadensphänomene]

Schadenssursache
type: Concept
notation: F964CG
preferred label: Cause of damage @en
created: 2026-01-30
issued: 2026-01-30
modified: 2026-02-04
publisher: Leibniz-Zentrum für Archäologie (LEIZA)
broader: [Untersuchungsergebnisse]
broader transitive: [Untersuchungsergebnisse]
broader transitive: Zustandserfassung
broader transitive: Objektuntersuchung
definition: Für die Beschädigung/den Abbau als ursächlich angesehene negative Beeinträchtigung eines Objektes
in scheme: Konservierungs- und Restaurierungsfachthesaurus für archäologische Kulturgüter
pref label: Schadenssursache
  type: Label
  rank: preferred
pref label: Cause of damage
  type: Label
  rank: normal
alternative label: Abbaufaktor
alternative label: schädlicher Einfluss
alt label: Abbaufaktor
  type: Label
  rank: preferred
alt label: schädlicher Einfluss
  type: Label
  rank: normal
narrower: materialbedingter Schaden
narrower: Verschmutzung
narrower: lichtinduzierter Schaden
narrower: Verwitterung
narrower: Vandalismus
narrower: Klimaschaden
narrower: Korrosionsinduzierter Schaden
narrower: Feuerschaden
narrower: Transportschaden
narrower: Bodenlagerungsschaden
narrower: Schaden durch mechanische Beanspruchung
narrower: Lagerungsschaden
narrower: Salzbelastung
narrower: Biologischer Befall
narrower: Bergungsschaden
narrower: Schadstoffe
narrower: Wasserschaden

Zustandsbeschreibung
type: Concept
notation: GDF8C2
preferred label: physical condition @en
created: 2026-01-30
issued: 2026-01-30
modified: 2026-02-04
publisher: Leibniz-Zentrum für Archäologie (LEIZA)
broader: [Untersuchungsergebnisse]
broader transitive: [Untersuchungsergebnisse]
broader transitive: Zustandserfassung
broader transitive: Objektuntersuchung
definition: Überbegriff für Informationen, die die konkreten Merkmale und Eigenschaften eines Objektes zu einem bestimmten Zeitpunkt beschreiben.
in scheme: Konservierungs- und Restaurierungsfachthesaurus für archäologische Kulturgüter
pref label: Zustandsbeschreibung
  type: Label
  rank: preferred
pref label: physical condition
  type: Label
  rank: normal
alternative label: Beschaffenheit
alternative label: Merkmalidentifikation
alternative label: Physischer Objektzustand
narrower: Feuchtigkeitsgehalt
narrower: Festigkeit
narrower: Veränderung
narrower: Vollständigkeit
narrower: Stabilität
narrower: Maße
alt label: Merkmalidentifikation
  type: Label
  rank: preferred
alt label: Beschaffenheit
  type: Label
  rank: normal
alt label: Physischer Objektzustand
  type: Label
  rank: normal

[Technologische Spuren]
type: Concept
type: NonIndexingConcept
type: GuideTerm
notation: C3648A
created: 2026-01-30
issued: 2026-01-30
modified: 2026-02-04
publisher: Leibniz-Zentrum für Archäologie (LEIZA)
broader: Technologische Auswertung
broader transitive: [Untersuchungsergebnisse]
broader transitive: Zustandserfassung
broader transitive: Objektuntersuchung
broader transitive: Technologische Auswertung
definition: struktureller Oberbegriff, für an bzw. auf einem Objekt festgestellte Merkmale, die Rückschlüsse auf die Herstellung und/oder den Gebrauch des Objektes ermöglichen.
in scheme: Konservierungs- und Restaurierungsfachthesaurus für archäologische Kulturgüter
pref label: [Technologische Spuren]
  type: Label
  rank: preferred
alternative label: Hinweise auf Techniken
alternative label: Spurformen
alternative label: technologische Beobachtungen
narrower: Vertiefung
narrower: Glättung (technologische Spur)
narrower: Materialanhaftung (technologische Spur)
narrower: Durchbruch (technologische Spur)
narrower: texturierte Oberfläche
narrower: Erhebung
alt label: Spurformen
  type: Label
  rank: preferred
alt label: Hinweise auf Techniken
  type: Label
  rank: normal
alt label: technologische Beobachtungen
  type: Label
  rank: normal

[Untersuchungsmethode]
type: Concept
type: NonIndexingConcept
type: GuideTerm
notation: D4A13D
preferred label: examination method @en
created: 2026-01-30
issued: 2026-01-30
modified: 2026-02-04
publisher: Leibniz-Zentrum für Archäologie (LEIZA)
broader: Objektuntersuchung
broader transitive: Zustandserfassung
broader transitive: Objektuntersuchung
definition: strukturierender Sammelbegriff für verschiedene Vorgehensweisen bei der Untersuchung von Objekten
in scheme: Konservierungs- und Restaurierungsfachthesaurus für archäologische Kulturgüter
pref label: [Untersuchungsmethode]
  type: Label
  rank: preferred
pref label: examination method
  type: Label
  rank: normal
narrower: Photogrammetrie
narrower: visuelle Begutachtung
narrower: Materialanalyse

Verzierungstechnik
type: Concept
notation: F2244D
created: 2026-01-30
issued: 2026-01-30
modified: 2026-02-04
publisher: Leibniz-Zentrum für Archäologie (LEIZA)
alternative label: Dekor
alternative label: Veredelungstechnik
broader: Technologische Auswertung
broader transitive: [Untersuchungsergebnisse]
broader transitive: Zustandserfassung
broader transitive: Objektuntersuchung
broader transitive: Technologische Auswertung
definition: Methode(n), die zur Ausarbeitung der an dem Objekt festgestellten Verzierungselemente verwendet wurden
in scheme: Konservierungs- und Restaurierungsfachthesaurus für archäologische Kulturgüter
narrower: nielliert
narrower: eingedrückt
narrower: ziseliert
narrower: inkrustiert
narrower: aufgeraut
narrower: patiniert
narrower: emailliert
narrower: brüniert
narrower: eingeritzt
narrower: geätzt
narrower: Intarsieneinlage
narrower: filigranverziert
narrower: gestempelt
narrower: Kerbschnittdekor
narrower: verzinnt
narrower: granuliert
narrower: damasziert
narrower: plattiert
narrower: tordiert
narrower: gefasst
narrower: versilbert
narrower: gebläut
narrower: aufgefädelt
narrower: gepicht
narrower: graviert
narrower: glasiert
narrower: bemalt
narrower: graphiert
narrower: profiliert
narrower: poliert
narrower: gesandet
narrower: punziert
narrower: durchbrochen (Verzierungstechnik)
narrower: überzogen
narrower: appliziert
narrower: engobiert
narrower: broschiert
narrower: geschliffen (Verzierungstechnik)
narrower: gefärbt
narrower: bestickt
narrower: vergoldet
narrower: geschnitzt (Verzierungstechnik)
alt label: Dekor
  type: Label
  rank: preferred
alt label: Veredelungstechnik
  type: Label
  rank: normal
pref label: Verzierungstechnik
  type: Label
  rank: preferred

hartgelötet
type: Concept
notation: G3GB79
created: 2026-01-30
issued: 2026-01-30
modified: 2026-02-04
publisher: Leibniz-Zentrum für Archäologie (LEIZA)
alternative label: Hartlötung
broader: gelötet
broader transitive: Fügetechnik
broader transitive: Zustandserfassung
broader transitive: Objektuntersuchung
broader transitive: gelötet
broader transitive: [Untersuchungsergebnisse]
broader transitive: Technologische Auswertung
broader transitive: Herstellungstechnik
in scheme: Konservierungs- und Restaurierungsfachthesaurus für archäologische Kulturgüter
alt label: Hartlötung
  type: Label
  rank: preferred
pref label: hartgelötet
  type: Label
  rank: preferred
definition: Lötung mit hochschmelzenden Loten (Hartloten), bei einer Arbeitstemperatur über 650°C.

Multicollector-Inductively Coupled Plasma Mass Spectrometry
type: Concept
notation: A17652
created: 2026-01-30
issued: 2026-01-30
modified: 2026-02-04
publisher: Leibniz-Zentrum für Archäologie (LEIZA)
alternative label: MC-ICP-MS
broader: Analyse der isotopischen Zusammensetzung
broader transitive: Analyse der isotopischen Zusammensetzung
broader transitive: Zustandserfassung
broader transitive: Objektuntersuchung
broader transitive: [Untersuchungsmethode]
broader transitive: Materialanalyse
in scheme: Konservierungs- und Restaurierungsfachthesaurus für archäologische Kulturgüter
alt label: MC-ICP-MS
  type: Label
  rank: preferred
pref label: Multicollector-Inductively Coupled Plasma Mass Spectrometry
  type: Label
  rank: preferred

Analyse der isotopischen Zusammensetzung
type: Concept
notation: CG676B
preferred label: Analysis of isotopic composition @en
created: 2026-01-30
issued: 2026-01-30
modified: 2026-02-04
publisher: Leibniz-Zentrum für Archäologie (LEIZA)
broader: Materialanalyse
broader transitive: Zustandserfassung
broader transitive: Objektuntersuchung
broader transitive: [Untersuchungsmethode]
broader transitive: Materialanalyse
in scheme: Konservierungs- und Restaurierungsfachthesaurus für archäologische Kulturgüter
pref label: Analyse der isotopischen Zusammensetzung
  type: Label
  rank: preferred
pref label: Analysis of isotopic composition
  type: Label
  rank: normal
narrower: Multicollector-Inductively Coupled Plasma Mass Spectrometry
narrower: Gaschromatographie mit Massenspektrometrie
narrower: Thermoionisations-Massenspektrometrie

Materialanalyse
type: Concept
notation: G9B788
preferred label: material analysis @en
created: 2026-01-30
issued: 2026-01-30
modified: 2026-02-04
publisher: Leibniz-Zentrum für Archäologie (LEIZA)
broader: [Untersuchungsmethode]
broader transitive: Zustandserfassung
broader transitive: Objektuntersuchung
broader transitive: [Untersuchungsmethode]
in scheme: Konservierungs- und Restaurierungsfachthesaurus für archäologische Kulturgüter
pref label: Materialanalyse
  type: Label
  rank: preferred
pref label: material analysis
  type: Label
  rank: normal
definition: Analyse des Objektswerkstoffes auf spezifische Eigenschaften
narrower: chemische Untersuchung
narrower: Laser Ablation – Inductively Coupled Plasma – Mass Spectrometry
narrower: Analyse der chemischen Zusammensetzung
narrower: Datierung
narrower: Analyse der isotopischen Zusammensetzung
narrower: Brennprobe
narrower: Probennahme
narrower: Röntgenfluoresezenzanalyse
narrower: Strukturanalyse

Überfangguss
type: Concept
notation: C388AA
created: 2026-01-30
issued: 2026-01-30
modified: 2026-02-04
publisher: Leibniz-Zentrum für Archäologie (LEIZA)
broader: angegossen
broader transitive: Fügetechnik
broader transitive: [Untersuchungsergebnisse]
broader transitive: Zustandserfassung
broader transitive: Objektuntersuchung
broader transitive: Technologische Auswertung
broader transitive: Herstellungstechnik
broader transitive: angegossen
in scheme: Konservierungs- und Restaurierungsfachthesaurus für archäologische Kulturgüter
pref label: Überfangguss
  type: Label
  rank: preferred

Gaschromatographie mit Massenspektrometrie
type: Concept
notation: D5F8G2
created: 2026-01-30
issued: 2026-01-30
modified: 2026-02-04
publisher: Leibniz-Zentrum für Archäologie (LEIZA)
alternative label: GC-MS
broader: Analyse der isotopischen Zusammensetzung
broader transitive: Analyse der isotopischen Zusammensetzung
broader transitive: Zustandserfassung
broader transitive: Objektuntersuchung
broader transitive: [Untersuchungsmethode]
broader transitive: Materialanalyse
in scheme: Konservierungs- und Restaurierungsfachthesaurus für archäologische Kulturgüter
alt label: GC-MS
  type: Label
  rank: preferred
pref label: Gaschromatographie mit Massenspektrometrie
  type: Label
  rank: preferred

Thermoionisations-Massenspektrometrie
type: Concept
notation: G87B12
preferred label: thermal ionization mass spectrometry @en
created: 2026-01-30
issued: 2026-01-30
modified: 2026-02-04
publisher: Leibniz-Zentrum für Archäologie (LEIZA)
alternative label: TIMS
broader: Analyse der isotopischen Zusammensetzung
broader transitive: Analyse der isotopischen Zusammensetzung
broader transitive: Zustandserfassung
broader transitive: Objektuntersuchung
broader transitive: [Untersuchungsmethode]
broader transitive: Materialanalyse
in scheme: Konservierungs- und Restaurierungsfachthesaurus für archäologische Kulturgüter
alt label: TIMS
  type: Label
  rank: preferred
pref label: Thermoionisations-Massenspektrometrie
  type: Label
  rank: preferred
pref label: thermal ionization mass spectrometry
  type: Label
  rank: normal

Rasterelektronenmikroskopie
type: Concept
notation: D3BFFF
preferred label: scanning electron microscopy @en
created: 2026-01-30
issued: 2026-01-30
modified: 2026-02-04
publisher: Leibniz-Zentrum für Archäologie (LEIZA)
alternative label: REM (Analysemethode)
alternative label: SEM @en
broader: Strukturanalyse
broader transitive: Zustandserfassung
broader transitive: Objektuntersuchung
broader transitive: [Untersuchungsmethode]
broader transitive: Strukturanalyse
broader transitive: Materialanalyse
definition: Methode mit dem die Objektoberfläche durch das Abrastern mit einem Elektronenstrahl vergrößert abgebildet wird. Erzeugt wird das Bild der Objektoberfläche durch die Wechselwirkungen der Elektronen mit dem Objekt.
definition:
  literal form: Methode mit dem die Objektoberfläche durch das Abrastern mit einem Elektronenstrahl vergrößert abgebildet wird. Erzeugt wird das Bild der Objektoberfläche durch die Wechselwirkungen der Elektronen mit dem Objekt.
in scheme: Konservierungs- und Restaurierungsfachthesaurus für archäologische Kulturgüter
alt label: REM (Analysemethode)
  type: Label
  rank: preferred
alt label: SEM
  type: Label
  rank: normal
pref label: Rasterelektronenmikroskopie
  type: Label
  rank: preferred
pref label: scanning electron microscopy
  type: Label
  rank: normal

Röntgenuntersuchung
type: Concept
notation: FB231A
created: 2026-01-30
issued: 2026-01-30
modified: 2026-02-04
publisher: Leibniz-Zentrum für Archäologie (LEIZA)
broader: Strukturanalyse
broader transitive: Zustandserfassung
broader transitive: Objektuntersuchung
broader transitive: [Untersuchungsmethode]
broader transitive: Strukturanalyse
broader transitive: Materialanalyse
definition: Sammelbegriff für Verfahren zur bildhaften Darstellung inneren Strukturen eines Objektes mit Hilfe von Röntgenstrahlen
in scheme: Konservierungs- und Restaurierungsfachthesaurus für archäologische Kulturgüter
pref label: Röntgenuntersuchung
  type: Label
  rank: preferred
narrower: konventionelle Radiographie
narrower: Röntgen-Computertomographie

Ramanspektroskopie
type: Concept
notation: FFA1AC
created: 2026-01-30
issued: 2026-01-30
modified: 2026-02-04
publisher: Leibniz-Zentrum für Archäologie (LEIZA)
broader: Strukturanalyse
broader transitive: Zustandserfassung
broader transitive: Objektuntersuchung
broader transitive: [Untersuchungsmethode]
broader transitive: Materialanalyse
broader transitive: Strukturanalyse
in scheme: Konservierungs- und Restaurierungsfachthesaurus für archäologische Kulturgüter
pref label: Ramanspektroskopie
  type: Label
  rank: preferred

Strukturanalyse
type: Concept
notation: G13A7B
preferred label: structural analysis @en
created: 2026-01-30
issued: 2026-01-30
modified: 2026-02-04
publisher: Leibniz-Zentrum für Archäologie (LEIZA)
broader: Materialanalyse
broader transitive: Zustandserfassung
broader transitive: Objektuntersuchung
broader transitive: [Untersuchungsmethode]
broader transitive: Materialanalyse
in scheme: Konservierungs- und Restaurierungsfachthesaurus für archäologische Kulturgüter
pref label: Strukturanalyse
  type: Label
  rank: preferred
pref label: structural analysis
  type: Label
  rank: normal
definition: Sammelbegriff für Analysen, die die innere Struktur eines Objektes sichtbar machen bzw. diese auf spezifische Eigenschaften untersuchen
narrower: Rasterelektronenmikroskopie
narrower: Röntgenuntersuchung
narrower: Ramanspektroskopie
narrower: Röntgendiffraktion

Röntgendiffraktion
type: Concept
notation: FFAF3C
preferred label: X-ray diffraction @en
created: 2026-01-30
issued: 2026-01-30
modified: 2026-02-04
publisher: Leibniz-Zentrum für Archäologie (LEIZA)
alternative label: Röntgenbeugung
alternative label: XRD
broader: Strukturanalyse
broader transitive: Zustandserfassung
broader transitive: Objektuntersuchung
broader transitive: [Untersuchungsmethode]
broader transitive: Strukturanalyse
broader transitive: Materialanalyse
in scheme: Konservierungs- und Restaurierungsfachthesaurus für archäologische Kulturgüter
alt label: Röntgenbeugung
  type: Label
  rank: preferred
alt label: XRD
  type: Label
  rank: normal
pref label: Röntgendiffraktion
  type: Label
  rank: preferred
pref label: X-ray diffraction
  type: Label
  rank: normal

konventionelle Radiographie
type: Concept
notation: A2B5A3
created: 2026-01-30
issued: 2026-01-30
modified: 2026-02-04
publisher: Leibniz-Zentrum für Archäologie (LEIZA)
alternative label: Röntgen
broader: Röntgenuntersuchung
broader transitive: Röntgenuntersuchung
broader transitive: Zustandserfassung
broader transitive: Objektuntersuchung
broader transitive: [Untersuchungsmethode]
broader transitive: Strukturanalyse
broader transitive: Materialanalyse
definition: zerstörungsfreies, bildgebendes Verfahren bei dem das Objekt mit Röntgenstrahlen durchleuchtet und auf einem Röntgenfilm oder Detektor abgebildet wird. Das Röntgenbild zeigt eine Abbildung des dreidimensionalen Objektes auf einer zweidimensionalen Fläche. Je nach Dichte des untersuchten Materials werden die Röntgenstrahlen unterschiedlich stark absorbiert und zeigen eine dunklere oder hellere Darstellung auf dem belichteten Röntgenfilm. Mit Hilfe dieses Verfahrens lassen sich z.B. korrodierte Metalle untersuchen, da das Metall in seiner metallischen Form dichter ist als seine Korrosionsprodukte. Auf dem Röntgenfilm ist es daher heller abgebildet und lässt sich von den weniger deutlich sichtbaren Korrosionsprodukten unterscheiden.
definition:
  literal form: zerstörungsfreies, bildgebendes Verfahren bei dem das Objekt mit Röntgenstrahlen durchleuchtet und auf einem Röntgenfilm oder Detektor abgebildet wird. Das Röntgenbild zeigt eine Abbildung des dreidimensionalen Objektes auf einer zweidimensionalen Fläche. Je nach Dichte des untersuchten Materials werden die Röntgenstrahlen unterschiedlich stark absorbiert und zeigen eine dunklere oder hellere Darstellung auf dem belichteten Röntgenfilm. Mit Hilfe dieses Verfahrens lassen sich z.B. korrodierte Metalle untersuchen, da das Metall in seiner metallischen Form dichter ist als seine Korrosionsprodukte. Auf dem Röntgenfilm ist es daher heller abgebildet und lässt sich von den weniger deutlich sichtbaren Korrosionsprodukten unterscheiden.
in scheme: Konservierungs- und Restaurierungsfachthesaurus für archäologische Kulturgüter
alt label: Röntgen
  type: Label
  rank: preferred
pref label: konventionelle Radiographie
  type: Label
  rank: preferred

chemische Untersuchung
type: Concept
notation: A946B5
preferred label: chemical tests @en
created: 2026-01-30
issued: 2026-01-30
modified: 2026-02-04
publisher: Leibniz-Zentrum für Archäologie (LEIZA)
broader: Materialanalyse
broader transitive: Zustandserfassung
broader transitive: Objektuntersuchung
broader transitive: [Untersuchungsmethode]
broader transitive: Materialanalyse
definition: Untersuchungsmethode von Materialien und ihren Eigenschaften mit Hilfe chemischer Reagenzien. Bei dieser Untersuchungsart können zum einen unbekannte Materialien identifiziert, bzw. näher eingegrenzt und zum anderen Verhaltensweisen von Materialien in klar definierten Rahmenbedingungen untersucht werden.
definition:
  literal form: Untersuchungsmethode von Materialien und ihren Eigenschaften mit Hilfe chemischer Reagenzien. Bei dieser Untersuchungsart können zum einen unbekannte Materialien identifiziert, bzw. näher eingegrenzt und zum anderen Verhaltensweisen von Materialien in klar definierten Rahmenbedingungen untersucht werden.
in scheme: Konservierungs- und Restaurierungsfachthesaurus für archäologische Kulturgüter
pref label: chemische Untersuchung
  type: Label
  rank: preferred
pref label: chemical tests
  type: Label
  rank: normal
narrower: Oddy-Test
narrower: Mikro-Quelltest
narrower: Spot-Test

Oddy-Test
type: Concept
notation: DAA4F8
created: 2026-01-30
issued: 2026-01-30
modified: 2026-02-04
publisher: Leibniz-Zentrum für Archäologie (LEIZA)
in scheme: Konservierungs- und Restaurierungsfachthesaurus für archäologische Kulturgüter
pref label: Oddy-Test
  type: Label
  rank: preferred
broader: chemische Untersuchung
broader transitive: chemische Untersuchung
broader transitive: Zustandserfassung
broader transitive: Objektuntersuchung
broader transitive: [Untersuchungsmethode]
broader transitive: Materialanalyse

Mikro-Quelltest
type: Concept
notation: DCD522
created: 2026-01-30
issued: 2026-01-30
modified: 2026-02-04
publisher: Leibniz-Zentrum für Archäologie (LEIZA)
broader: chemische Untersuchung
broader transitive: Zustandserfassung
broader transitive: Objektuntersuchung
broader transitive: [Untersuchungsmethode]
broader transitive: Materialanalyse
broader transitive: chemische Untersuchung
in scheme: Konservierungs- und Restaurierungsfachthesaurus für archäologische Kulturgüter
pref label: Mikro-Quelltest
  type: Label
  rank: preferred

Spot-Test
type: Concept
notation: F66444
created: 2026-01-30
issued: 2026-01-30
modified: 2026-02-04
publisher: Leibniz-Zentrum für Archäologie (LEIZA)
definition: Qualitätive Untersuchungsmöglichkeit unbekannter Materialien. Eine Probe der unbekannten Substanz wird mit einer definierten chemischen Substanz oder Lösung in Kontakt gebracht und sämtliche auftretenden Reaktionen dokumentiert. Mit Hilfe von detaillierten Referenzbeschreibungen können die Beobachtungen ausgewertet und das unbekannte Material identifiziert oder zumindest die zugehörige Stoffklasse näher eingegrenzt werden.
definition:
  literal form: Qualitätive Untersuchungsmöglichkeit unbekannter Materialien. Eine Probe der unbekannten Substanz wird mit einer definierten chemischen Substanz oder Lösung in Kontakt gebracht und sämtliche auftretenden Reaktionen dokumentiert. Mit Hilfe von detaillierten Referenzbeschreibungen können die Beobachtungen ausgewertet und das unbekannte Material identifiziert oder zumindest die zugehörige Stoffklasse näher eingegrenzt werden.
in scheme: Konservierungs- und Restaurierungsfachthesaurus für archäologische Kulturgüter
pref label: Spot-Test
  type: Label
  rank: preferred
broader: chemische Untersuchung
broader transitive: chemische Untersuchung
broader transitive: Zustandserfassung
broader transitive: Objektuntersuchung
broader transitive: [Untersuchungsmethode]
broader transitive: Materialanalyse

Röntgen-Computertomographie
type: Concept
notation: AF9A88
created: 2026-01-30
issued: 2026-01-30
modified: 2026-02-04
publisher: Leibniz-Zentrum für Archäologie (LEIZA)
alternative label: CT (Analysemethode)
broader: Röntgenuntersuchung
broader transitive: Röntgenuntersuchung
broader transitive: Zustandserfassung
broader transitive: Objektuntersuchung
broader transitive: [Untersuchungsmethode]
broader transitive: Strukturanalyse
broader transitive: Materialanalyse
definition: Bildgebendes Verfahren, bei dem das Objekt aus mehreren Richtungen mit Röntgenstrahlen durchleuchtet wird. Je nach Dichte des untersuchten Materials werden die Röntgenstrahlen unterschiedlich stark absorbiert. Durch die verschiedenen Richtungen, aus denen die Röntgenstrahlen durch das Objekt treten, entstehen mehrere Absorptionsprofile. Diese werden nach Abschluss der Aufnahmen mit Hilfe des Computers zu digitalen Schnittbildern zusammengerechnet. In dem mehrere angrenzende Schnittbilder zusammengesetzt und die Volumengrafiken errechnet werden, lassen sich dreidimensionale Darstellungen der inneren Struktur des untersuchten Objektes erzeugen.
definition:
  literal form: Bildgebendes Verfahren, bei dem das Objekt aus mehreren Richtungen mit Röntgenstrahlen durchleuchtet wird. Je nach Dichte des untersuchten Materials werden die Röntgenstrahlen unterschiedlich stark absorbiert. Durch die verschiedenen Richtungen, aus denen die Röntgenstrahlen durch das Objekt treten, entstehen mehrere Absorptionsprofile. Diese werden nach Abschluss der Aufnahmen mit Hilfe des Computers zu digitalen Schnittbildern zusammengerechnet. In dem mehrere angrenzende Schnittbilder zusammengesetzt und die Volumengrafiken errechnet werden, lassen sich dreidimensionale Darstellungen der inneren Struktur des untersuchten Objektes erzeugen.
in scheme: Konservierungs- und Restaurierungsfachthesaurus für archäologische Kulturgüter
alt label: CT (Analysemethode)
  type: Label
  rank: preferred
pref label: Röntgen-Computertomographie
  type: Label
  rank: preferred

Dendrochronologie
type: Concept
notation: B3G5C7
created: 2026-01-30
issued: 2026-01-30
modified: 2026-02-04
publisher: Leibniz-Zentrum für Archäologie (LEIZA)
broader: Datierung
broader transitive: Zustandserfassung
broader transitive: Objektuntersuchung
broader transitive: [Untersuchungsmethode]
broader transitive: Materialanalyse
broader transitive: Datierung
in scheme: Konservierungs- und Restaurierungsfachthesaurus für archäologische Kulturgüter
pref label: Dendrochronologie
  type: Label
  rank: preferred

Datierung
type: Concept
notation: C5BD13
preferred label: dating @en
created: 2026-01-30
issued: 2026-01-30
modified: 2026-02-04
publisher: Leibniz-Zentrum für Archäologie (LEIZA)
broader: Materialanalyse
broader transitive: Zustandserfassung
broader transitive: Objektuntersuchung
broader transitive: [Untersuchungsmethode]
broader transitive: Materialanalyse
definition: Methode anhand spezifischer Materialeigenschaften das Alter des Materials, und damit des Objektes, zu bestimmen.
in scheme: Konservierungs- und Restaurierungsfachthesaurus für archäologische Kulturgüter
pref label: Datierung
  type: Label
  rank: preferred
pref label: dating
  type: Label
  rank: normal
narrower: Dendrochronologie
narrower: Radiokarbondatierung

Radiokarbondatierung
type: Concept
notation: F6739F
created: 2026-01-30
issued: 2026-01-30
modified: 2026-02-04
publisher: Leibniz-Zentrum für Archäologie (LEIZA)
alternative label: C14-Datierung
alternative label: Radiokarbonmethode
alternative label: Radiokohlenstoffdatierung
broader: Datierung
broader transitive: Zustandserfassung
broader transitive: Objektuntersuchung
broader transitive: [Untersuchungsmethode]
broader transitive: Materialanalyse
broader transitive: Datierung
in scheme: Konservierungs- und Restaurierungsfachthesaurus für archäologische Kulturgüter
alt label: C14-Datierung
  type: Label
  rank: preferred
alt label: Radiokarbonmethode
  type: Label
  rank: normal
alt label: Radiokohlenstoffdatierung
  type: Label
  rank: normal
pref label: Radiokarbondatierung
  type: Label
  rank: preferred

Konservierungskonzept
type: Concept
notation: A18D95
created: 2026-01-30
issued: 2026-01-30
modified: 2026-02-04
publisher: Leibniz-Zentrum für Archäologie (LEIZA)
alternative label: Konservierungsplanung
alternative label: Restaurierungskonzept
alternative label: Restaurierungsplanung
definition: Festlegung des anzustrebenden Konservierungs-/Restaurierungsziels, Planung/Entwicklung der methodischen Vorgehensweise zur Erhaltung und Wiederherstellung des Objektes, Zeitplanung und Risikoabschätzung, basierend auf den Ergebnissen der Zustandserfassung.
definition:
  literal form: Festlegung des anzustrebenden Konservierungs-/Restaurierungsziels, Planung/Entwicklung der methodischen Vorgehensweise zur Erhaltung und Wiederherstellung des Objektes, Zeitplanung und Risikoabschätzung, basierend auf den Ergebnissen der Zustandserfassung.
in scheme: Konservierungs- und Restaurierungsfachthesaurus für archäologische Kulturgüter
narrower: Zeitplanung
narrower: Risikobeurteilung
narrower: Konservierungs-/Restaurierungsziel
narrower: Methodik
top concept of: Konservierungs- und Restaurierungsfachthesaurus für archäologische Kulturgüter
alt label: Konservierungsplanung
  type: Label
  rank: preferred
alt label: Restaurierungsplanung
  type: Label
  rank: normal
alt label: Restaurierungskonzept
  type: Label
  rank: normal
pref label: Konservierungskonzept
  type: Label
  rank: preferred

Zeitplanung
type: Concept
notation: AC1786
created: 2026-01-30
issued: 2026-01-30
modified: 2026-02-04
publisher: Leibniz-Zentrum für Archäologie (LEIZA)
broader: Konservierungskonzept
broader transitive: Konservierungskonzept
definition: Einschätzung und Planung des für das Erreichen des Konservierungs-/Restaurierungsziels benötigten Zeitrahmens
in scheme: Konservierungs- und Restaurierungsfachthesaurus für archäologische Kulturgüter
pref label: Zeitplanung
  type: Label
  rank: preferred

Risikobeurteilung
type: Concept
notation: CDD6B5
preferred label: risk assessment @en
created: 2026-01-30
issued: 2026-01-30
modified: 2026-02-04
publisher: Leibniz-Zentrum für Archäologie (LEIZA)
broader: Konservierungskonzept
broader transitive: Konservierungskonzept
definition: Systematischer Prozess zur Bestimmung, Bewertung und Priorisierung potenzieller Gefahren, die das Objekt bzw. dessen Werkstoff beeinträchtigen könnten. Durch die Risikobeurteilung können die benötigten Maßnahmen zur Minimierung der festgestellten Risiken gezielt gewählt werden, um einen langfristigen Erhalt des Objektes zu gewährleisten.
definition:
  literal form: Systematischer Prozess zur Bestimmung, Bewertung und Priorisierung potenzieller Gefahren, die das Objekt bzw. dessen Werkstoff beeinträchtigen könnten. Durch die Risikobeurteilung können die benötigten Maßnahmen zur Minimierung der festgestellten Risiken gezielt gewählt werden, um einen langfristigen Erhalt des Objektes zu gewährleisten.
in scheme: Konservierungs- und Restaurierungsfachthesaurus für archäologische Kulturgüter
pref label: Risikobeurteilung
  type: Label
  rank: preferred
pref label: risk assessment
  type: Label
  rank: normal

Konservierungs-/Restaurierungsziel
type: Concept
notation: DA4158
created: 2026-01-30
issued: 2026-01-30
modified: 2026-02-04
publisher: Leibniz-Zentrum für Archäologie (LEIZA)
definition: Festlegung der spezifischen Ziele und Absichten, die bei der Restaurierung oder Konservierung eines Objektes verfolgt werden. Diese Ziele können vielfältig sein und umfassen typischerweise den Erhalt des Objekts in seiner gegenwärtigen Form, die Wiederherstellung seiner ästhetischen Erscheinung, die Sicherung seiner strukturellen Integrität sowie die Erhaltung seiner historischen oder kulturellen Bedeutung für zukünftige Generationen.
definition:
  literal form: Festlegung der spezifischen Ziele und Absichten, die bei der Restaurierung oder Konservierung eines Objektes verfolgt werden. Diese Ziele können vielfältig sein und umfassen typischerweise den Erhalt des Objekts in seiner gegenwärtigen Form, die Wiederherstellung seiner ästhetischen Erscheinung, die Sicherung seiner strukturellen Integrität sowie die Erhaltung seiner historischen oder kulturellen Bedeutung für zukünftige Generationen.
in scheme: Konservierungs- und Restaurierungsfachthesaurus für archäologische Kulturgüter
pref label: Konservierungs-/Restaurierungsziel
  type: Label
  rank: preferred
broader: Konservierungskonzept
broader transitive: Konservierungskonzept

Methodik
type: Concept
notation: GDF23F
preferred label: methodology @en
created: 2026-01-30
issued: 2026-01-30
modified: 2026-02-04
publisher: Leibniz-Zentrum für Archäologie (LEIZA)
alternative label: Vorgehensweise
broader: Konservierungskonzept
broader transitive: Konservierungskonzept
definition: Planung der strukturierten Vorgehensweise bei der praktischen Durchführung zur Erreichung des festgelegten Restaurierungs-/Konservierungsziel. Basierend auf den Erkenntnissen der Zustandserfassung sowie unter Berücksichtigung der Risikobeurteilung und der Zeitplanung werden die geeignetsten Methoden und Techniken, die benötigten Materialien sowie Werkzeuge festgelegt.
definition:
  literal form: Planung der strukturierten Vorgehensweise bei der praktischen Durchführung zur Erreichung des festgelegten Restaurierungs-/Konservierungsziel. Basierend auf den Erkenntnissen der Zustandserfassung sowie unter Berücksichtigung der Risikobeurteilung und der Zeitplanung werden die geeignetsten Methoden und Techniken, die benötigten Materialien sowie Werkzeuge festgelegt.
in scheme: Konservierungs- und Restaurierungsfachthesaurus für archäologische Kulturgüter
alt label: Vorgehensweise
  type: Label
  rank: preferred
pref label: Methodik
  type: Label
  rank: preferred
pref label: methodology
  type: Label
  rank: normal

UV-Lumineszenz-Untersuchung
type: Concept
notation: B53C8F
preferred label: uv fluorescence examination @en
created: 2026-01-30
issued: 2026-01-30
modified: 2026-02-04
publisher: Leibniz-Zentrum für Archäologie (LEIZA)
definition: zerstörungsfreie Untersuchungsmethode, bei der das Objekt mit UV-Licht bestrahlt wird. Befinden sich in dem Objektmaterial fluoreszierende Stoffe werden diese durch die kurzwelligen UV-Strahlen zum Leuchten angeregt und gegenüber den nicht fluoreszierenden Stoffen sichtbar. Auf diese Weise lassen sich z.B. Klebstoffe, Überzüge, Retuschen und Übermalungen auf bereits restaurierten Objekten sichtbar machen, die mit dem bloßen Auge im Tageslicht nicht zu erkennen sind. Als Methode zur Identifizierung eines Stoffes ist die UV-Fluoreszenz nur bedingt geeignet. Viele Stoffe zeigen zwar eine charakteristische Färbung in ihrer Fluoreszenz, die mit Hilfe von Referenztabellen bestimmt werden kann, allerdings können Verunreinigungen (wie z.B. Staub) die Fluoreszenz stark beeinträchtigen, indem sie entweder die natürliche Fluorezenz des Materials auslöschen oder selbst fluoreszieren.
definition:
  literal form: zerstörungsfreie Untersuchungsmethode, bei der das Objekt mit UV-Licht bestrahlt wird. Befinden sich in dem Objektmaterial fluoreszierende Stoffe werden diese durch die kurzwelligen UV-Strahlen zum Leuchten angeregt und gegenüber den nicht fluoreszierenden Stoffen sichtbar. Auf diese Weise lassen sich z.B. Klebstoffe, Überzüge, Retuschen und Übermalungen auf bereits restaurierten Objekten sichtbar machen, die mit dem bloßen Auge im Tageslicht nicht zu erkennen sind. Als Methode zur Identifizierung eines Stoffes ist die UV-Fluoreszenz nur bedingt geeignet. Viele Stoffe zeigen zwar eine charakteristische Färbung in ihrer Fluoreszenz, die mit Hilfe von Referenztabellen bestimmt werden kann, allerdings können Verunreinigungen (wie z.B. Staub) die Fluoreszenz stark beeinträchtigen, indem sie entweder die natürliche Fluorezenz des Materials auslöschen oder selbst fluoreszieren.
in scheme: Konservierungs- und Restaurierungsfachthesaurus für archäologische Kulturgüter
pref label: UV-Lumineszenz-Untersuchung
  type: Label
  rank: preferred
pref label: uv fluorescence examination
  type: Label
  rank: normal
broader: visuelle Begutachtung
broader transitive: visuelle Begutachtung
broader transitive: Zustandserfassung
broader transitive: Objektuntersuchung
broader transitive: [Untersuchungsmethode]

visuelle Begutachtung
type: Concept
notation: CA7279
preferred label: visual examination @en
created: 2026-01-30
issued: 2026-01-30
modified: 2026-02-04
publisher: Leibniz-Zentrum für Archäologie (LEIZA)
definition: Betrachtung und Einschätzung des optischen Erscheinungsbildes/Zustandes des Objektes mit dem menschlichen Auge
in scheme: Konservierungs- und Restaurierungsfachthesaurus für archäologische Kulturgüter
narrower: UV-Lumineszenz-Untersuchung
narrower: mikroskopische Untersuchung
pref label: visuelle Begutachtung
  type: Label
  rank: preferred
pref label: visual examination
  type: Label
  rank: normal
broader: [Untersuchungsmethode]
broader transitive: Zustandserfassung
broader transitive: Objektuntersuchung
broader transitive: [Untersuchungsmethode]

Photogrammetrie
type: Concept
notation: BAA12F
created: 2026-01-30
issued: 2026-01-30
modified: 2026-02-04
publisher: Leibniz-Zentrum für Archäologie (LEIZA)
in scheme: Konservierungs- und Restaurierungsfachthesaurus für archäologische Kulturgüter
pref label: Photogrammetrie
  type: Label
  rank: preferred
broader: [Untersuchungsmethode]
broader transitive: Zustandserfassung
broader transitive: Objektuntersuchung
broader transitive: [Untersuchungsmethode]

mikroskopische Untersuchung
type: Concept
notation: D4AC7A
created: 2026-01-30
issued: 2026-01-30
modified: 2026-02-04
publisher: Leibniz-Zentrum für Archäologie (LEIZA)
alternative label: Mikroskopie
definition: Begutachtung eines Objektes mit dem menschlichen Auge mit Hilfe eines Mikroskops
in scheme: Konservierungs- und Restaurierungsfachthesaurus für archäologische Kulturgüter
alt label: Mikroskopie
  type: Label
  rank: preferred
pref label: mikroskopische Untersuchung
  type: Label
  rank: preferred
broader: visuelle Begutachtung
broader transitive: visuelle Begutachtung
broader transitive: Zustandserfassung
broader transitive: Objektuntersuchung
broader transitive: [Untersuchungsmethode]

Brennprobe
type: Concept
notation: DD4383
created: 2026-01-30
issued: 2026-01-30
modified: 2026-02-04
publisher: Leibniz-Zentrum für Archäologie (LEIZA)
in scheme: Konservierungs- und Restaurierungsfachthesaurus für archäologische Kulturgüter
pref label: Brennprobe
  type: Label
  rank: preferred
broader: Materialanalyse
broader transitive: Zustandserfassung
broader transitive: Objektuntersuchung
broader transitive: [Untersuchungsmethode]
broader transitive: Materialanalyse

Probennahme
type: Concept
notation: F7AGD2
created: 2026-01-30
issued: 2026-01-30
modified: 2026-02-04
publisher: Leibniz-Zentrum für Archäologie (LEIZA)
alternative label: Probenentnahme
definition: Entnahme einer Stichprobe nach spezifischen Verfahren je nach angedachter Untersuchungsmethode. Die Probennahme dient dazu Aussagen zur Beschaffenheit, Zusammensetzung und/oder charakterischischen Eigenschaften eines Materials treffen zu können.
definition:
  literal form: Entnahme einer Stichprobe nach spezifischen Verfahren je nach angedachter Untersuchungsmethode. Die Probennahme dient dazu Aussagen zur Beschaffenheit, Zusammensetzung und/oder charakterischischen Eigenschaften eines Materials treffen zu können.
in scheme: Konservierungs- und Restaurierungsfachthesaurus für archäologische Kulturgüter
alt label: Probenentnahme
  type: Label
  rank: preferred
pref label: Probennahme
  type: Label
  rank: preferred
broader: Materialanalyse
broader transitive: Zustandserfassung
broader transitive: Objektuntersuchung
broader transitive: [Untersuchungsmethode]
broader transitive: Materialanalyse

Ausspülung
type: Concept
notation: A1B449
created: 2026-01-30
issued: 2026-01-30
modified: 2026-02-04
publisher: Leibniz-Zentrum für Archäologie (LEIZA)
broader: Entsalzung
broader transitive: Entsalzung
broader transitive: Maßnahme
broader transitive: Konservierung
broader transitive: [Behandlungsmethode]
broader transitive: stabilisierende Konservierung
definition: Entfernung von durch die Bodenlagerung eingedrungenen Salzen aus dem Objektwerkstoff, indem fließendes Wasser kontinuierlich über das Objekt geleitet wird.
in scheme: Konservierungs- und Restaurierungsfachthesaurus für archäologische Kulturgüter
pref label: Ausspülung
  type: Label
  rank: preferred

Verpacken
type: Concept
notation: AC16G1
created: 2026-01-30
issued: 2026-01-30
modified: 2026-02-04
publisher: Leibniz-Zentrum für Archäologie (LEIZA)
alternative label: Verpackung
broader: präventive Konservierung
broader transitive: präventive Konservierung
broader transitive: Maßnahme
broader transitive: Konservierung
broader transitive: [Behandlungsmethode]
definition: Maßnahme zur schützenden/sichernden Umhüllung des Objektes während eines Transportes und/oder der Depotlagerung
in scheme: Konservierungs- und Restaurierungsfachthesaurus für archäologische Kulturgüter
alt label: Verpackung
  type: Label
  rank: preferred
pref label: Verpacken
  type: Label
  rank: preferred

präventive Konservierung
type: Concept
notation: F5G576
preferred label: preventive conservation @en
created: 2026-01-30
issued: 2026-01-30
modified: 2026-02-04
publisher: Leibniz-Zentrum für Archäologie (LEIZA)
alternative label: preventive care @en
alternative label: präventive Maßnahmen
broader: Konservierung
broader transitive: Maßnahme
broader transitive: Konservierung
broader transitive: [Behandlungsmethode]
definition: Sammelbegriff für vorbeugende Maßnahmen zur Vermeidung oder Minimierung von künftigen Schaden, Abbau, Verlust und folglich invasivem Eingriff. Bei der präventiven Konservierung findet lediglich eine passive Einwirkung auf das Objekt statt.
definition:
  literal form: Sammelbegriff für vorbeugende Maßnahmen zur Vermeidung oder Minimierung von künftigen Schaden, Abbau, Verlust und folglich invasivem Eingriff. Bei der präventiven Konservierung findet lediglich eine passive Einwirkung auf das Objekt statt.
in scheme: Konservierungs- und Restaurierungsfachthesaurus für archäologische Kulturgüter
alt label: präventive Maßnahmen
  type: Label
  rank: preferred
alt label: preventive care
  type: Label
  rank: normal
pref label: präventive Konservierung
  type: Label
  rank: preferred
pref label: preventive conservation
  type: Label
  rank: normal
narrower: Verpacken
narrower: Montage
narrower: Risikomanagement
narrower: Monitoring

Konservierung
type: Concept
notation: D32A26
created: 2026-01-30
issued: 2026-01-30
modified: 2026-02-04
publisher: Leibniz-Zentrum für Archäologie (LEIZA)
broader: [Behandlungsmethode]
broader transitive: Maßnahme
broader transitive: [Behandlungsmethode]
definition: Vorkehrungen oder Eingriffe zur Stabilisierung eines Objektes.
in scheme: Konservierungs- und Restaurierungsfachthesaurus für archäologische Kulturgüter
narrower: stabilisierende Konservierung
narrower: präventive Konservierung
pref label: Konservierung
  type: Label
  rank: preferred

[Behandlungsmethode]
type: Concept
type: NonIndexingConcept
type: GuideTerm
notation: F37GBB
created: 2026-01-30
issued: 2026-01-30
modified: 2026-02-04
publisher: Leibniz-Zentrum für Archäologie (LEIZA)
broader: Maßnahme
broader transitive: Maßnahme
in scheme: Konservierungs- und Restaurierungsfachthesaurus für archäologische Kulturgüter
narrower: Konservierung
narrower: Restaurierung
pref label: [Behandlungsmethode]
  type: Label
  rank: preferred

Feuchtkammermethode
type: Concept
notation: B614CA
created: 2026-01-30
issued: 2026-01-30
modified: 2026-02-04
publisher: Leibniz-Zentrum für Archäologie (LEIZA)
broader: Entsalzung
broader transitive: Maßnahme
broader transitive: Konservierung
broader transitive: [Behandlungsmethode]
broader transitive: Entsalzung
broader transitive: stabilisierende Konservierung
definition: Methode zur Entfernung von Salzen aus Buntmetalllegierungen. Dabei wird das Objekt dünn mit einem Feuchthaltemittel (z.B. Agar-Agar oder Gelatine) eingestrichen und eng mit Aluminium- oder Zinnfolie umwickelt. Das auf diese Weite präparierte Objekt wird anschließend in eine Feuchtkammer (luftdicht verschlossenes Gefäß mit hoher Luftfeuchtigkeit) gelegt und mehrere Tage darin belassen. Das unedle und damit reaktionsfreudige Aluminium (bzw. Zinn) reagiert dabei mit den enthaltenen Chloridionen zu Aluminium- bzw Zinnchlorid.
definition:
  literal form: Methode zur Entfernung von Salzen aus Buntmetalllegierungen. Dabei wird das Objekt dünn mit einem Feuchthaltemittel (z.B. Agar-Agar oder Gelatine) eingestrichen und eng mit Aluminium- oder Zinnfolie umwickelt. Das auf diese Weite präparierte Objekt wird anschließend in eine Feuchtkammer (luftdicht verschlossenes Gefäß mit hoher Luftfeuchtigkeit) gelegt und mehrere Tage darin belassen. Das unedle und damit reaktionsfreudige Aluminium (bzw. Zinn) reagiert dabei mit den enthaltenen Chloridionen zu Aluminium- bzw Zinnchlorid.
in scheme: Konservierungs- und Restaurierungsfachthesaurus für archäologische Kulturgüter
pref label: Feuchtkammermethode
  type: Label
  rank: preferred

Entsalzung
type: Concept
notation: C6A532
preferred label: desalination @en
created: 2026-01-30
issued: 2026-01-30
modified: 2026-02-04
publisher: Leibniz-Zentrum für Archäologie (LEIZA)
alternative label: Entsalzen
broader: stabilisierende Konservierung
broader transitive: Maßnahme
broader transitive: Konservierung
broader transitive: [Behandlungsmethode]
broader transitive: stabilisierende Konservierung
definition: Methode zur Entfernung von durch die Bodenlagerung in ein Objekt/Material eingedrungenen Salzen
in scheme: Konservierungs- und Restaurierungsfachthesaurus für archäologische Kulturgüter
alt label: Entsalzen
  type: Label
  rank: preferred
pref label: Entsalzung
  type: Label
  rank: preferred
pref label: desalination
  type: Label
  rank: normal
narrower: Ausspülung
narrower: Feuchtkammermethode
narrower: Kompressenentsalzung
narrower: elektrochemische Entsalzung
narrower: Badentsalzung

stabilisierende Konservierung
type: Concept
notation: G98FD4
preferred label: conservation @en
created: 2026-01-30
issued: 2026-01-30
modified: 2026-02-04
publisher: Leibniz-Zentrum für Archäologie (LEIZA)
broader: Konservierung
broader transitive: Maßnahme
broader transitive: Konservierung
broader transitive: [Behandlungsmethode]
definition: Sammelbegriff für Methoden des aktive Eingriffs, der direkt an einem Objekt vorgenommen wird, um weiteren Abbau, Zerfall und/oder Schädigung zu verhindern, zu verzögern und/oder zu begrenzen
in scheme: Konservierungs- und Restaurierungsfachthesaurus für archäologische Kulturgüter
narrower: Verstärkung
narrower: Trocknung
narrower: Entsalzung
narrower: Festigung
narrower: Plasmabehandlung
narrower: Schutzüberzug aufbringen
pref label: stabilisierende Konservierung
  type: Label
  rank: preferred
pref label: conservation
  type: Label
  rank: normal
alternative label: remedial conservation @en
alternative label: stabilisierende Maßnahme
alt label: stabilisierende Maßnahme
  type: Label
  rank: preferred
alt label: remedial conservation
  type: Label
  rank: normal

Kompressenentsalzung
type: Concept
notation: C349C5
created: 2026-01-30
issued: 2026-01-30
modified: 2026-02-04
publisher: Leibniz-Zentrum für Archäologie (LEIZA)
broader: Entsalzung
broader transitive: Entsalzung
broader transitive: Maßnahme
broader transitive: Konservierung
broader transitive: [Behandlungsmethode]
broader transitive: stabilisierende Konservierung
definition: Entfernung von durch die Bodenlagerung eingedrungenen Salzen aus dem Objektwerkstoff durch die Auflage von feuchtigkeitsgetränktem Kompressenmaterial. Durch ein Feuchte- und/oder Konzentrationsgefälle zwischen Objekt und Kompresse werden die Salze durch Diffusion und den Kapillareffekt aus dem Objektmaterial in die Kompresse gezogen.
definition:
  literal form: Entfernung von durch die Bodenlagerung eingedrungenen Salzen aus dem Objektwerkstoff durch die Auflage von feuchtigkeitsgetränktem Kompressenmaterial. Durch ein Feuchte- und/oder Konzentrationsgefälle zwischen Objekt und Kompresse werden die Salze durch Diffusion und den Kapillareffekt aus dem Objektmaterial in die Kompresse gezogen.
in scheme: Konservierungs- und Restaurierungsfachthesaurus für archäologische Kulturgüter
pref label: Kompressenentsalzung
  type: Label
  rank: preferred

elektrochemische Entsalzung
type: Concept
notation: D66263
created: 2026-01-30
issued: 2026-01-30
modified: 2026-02-04
publisher: Leibniz-Zentrum für Archäologie (LEIZA)
broader: Entsalzung
broader transitive: Entsalzung
broader transitive: Maßnahme
broader transitive: Konservierung
broader transitive: [Behandlungsmethode]
broader transitive: stabilisierende Konservierung
definition: Entfernung von durch die Bodenlagerung eingedrungenen Salzen aus dem Objektwerkstoff durch das Anlegen elektrischer Spannung
in scheme: Konservierungs- und Restaurierungsfachthesaurus für archäologische Kulturgüter
pref label: elektrochemische Entsalzung
  type: Label
  rank: preferred

Badentsalzung
type: Concept
notation: DA9G57
created: 2026-01-30
issued: 2026-01-30
modified: 2026-02-04
publisher: Leibniz-Zentrum für Archäologie (LEIZA)
broader: Entsalzung
broader transitive: Entsalzung
broader transitive: Maßnahme
broader transitive: Konservierung
broader transitive: [Behandlungsmethode]
broader transitive: stabilisierende Konservierung
definition: Entfernung von durch die Bodenlagerung eingedrungenen Salzen aus dem Objektwerkstoff durch das Einlegen des Objektes in eine Badlösung. Durch den osmotischen Druck, basierend auf dem Konzentrationsgefälle zwischen Objekt und der Badlösung, werden die Salze aus dem Objekt gespült.
definition:
  literal form: Entfernung von durch die Bodenlagerung eingedrungenen Salzen aus dem Objektwerkstoff durch das Einlegen des Objektes in eine Badlösung. Durch den osmotischen Druck, basierend auf dem Konzentrationsgefälle zwischen Objekt und der Badlösung, werden die Salze aus dem Objekt gespült.
in scheme: Konservierungs- und Restaurierungsfachthesaurus für archäologische Kulturgüter
pref label: Badentsalzung
  type: Label
  rank: preferred

Montage
type: Concept
notation: D78721
created: 2026-01-30
issued: 2026-01-30
modified: 2026-02-04
publisher: Leibniz-Zentrum für Archäologie (LEIZA)
broader: präventive Konservierung
broader transitive: präventive Konservierung
broader transitive: Maßnahme
broader transitive: Konservierung
broader transitive: [Behandlungsmethode]
in scheme: Konservierungs- und Restaurierungsfachthesaurus für archäologische Kulturgüter
pref label: Montage
  type: Label
  rank: preferred

Risikomanagement
type: Concept
notation: F285B2
created: 2026-01-30
issued: 2026-01-30
modified: 2026-02-04
publisher: Leibniz-Zentrum für Archäologie (LEIZA)
broader: präventive Konservierung
broader transitive: präventive Konservierung
broader transitive: Maßnahme
broader transitive: Konservierung
broader transitive: [Behandlungsmethode]
in scheme: Konservierungs- und Restaurierungsfachthesaurus für archäologische Kulturgüter
pref label: Risikomanagement
  type: Label
  rank: preferred

Monitoring
type: Concept
notation: GG1924
created: 2026-01-30
issued: 2026-01-30
modified: 2026-02-04
publisher: Leibniz-Zentrum für Archäologie (LEIZA)
broader: präventive Konservierung
broader transitive: präventive Konservierung
broader transitive: Maßnahme
broader transitive: Konservierung
broader transitive: [Behandlungsmethode]
in scheme: Konservierungs- und Restaurierungsfachthesaurus für archäologische Kulturgüter
pref label: Monitoring
  type: Label
  rank: preferred

Nassreinigung
type: Concept
notation: A194CF
preferred label: washing @en
created: 2026-01-30
issued: 2026-01-30
modified: 2026-02-04
publisher: Leibniz-Zentrum für Archäologie (LEIZA)
alternative label: Auswaschung
alternative label: Spülung
alternative label: nasse Reinigung
broader: Reinigung
broader transitive: Restaurierung
broader transitive: Maßnahme
broader transitive: [Behandlungsmethode]
broader transitive: Reinigung
definition: Entfernung ungewollter Substanzen durch Durchfeuchtung/ Durchnässung des Objektes, z.B. durch Abspülen unter laufendem Wasser oder Eintauchen in eine Reinigungsflüssigkeit.
in scheme: Konservierungs- und Restaurierungsfachthesaurus für archäologische Kulturgüter
alt label: Spülung
  type: Label
  rank: preferred
alt label: Auswaschung
  type: Label
  rank: normal
alt label: nasse Reinigung
  type: Label
  rank: normal
pref label: Nassreinigung
  type: Label
  rank: preferred
pref label: washing
  type: Label
  rank: normal

Gefriertrocknung
type: Concept
notation: A44FD4
preferred label: freeze drying @en
created: 2026-01-30
issued: 2026-01-30
modified: 2026-02-04
publisher: Leibniz-Zentrum für Archäologie (LEIZA)
broader: Trocknung
broader transitive: Maßnahme
broader transitive: Konservierung
broader transitive: [Behandlungsmethode]
broader transitive: stabilisierende Konservierung
broader transitive: Trocknung
in scheme: Konservierungs- und Restaurierungsfachthesaurus für archäologische Kulturgüter
pref label: Gefriertrocknung
  type: Label
  rank: preferred
pref label: freeze drying
  type: Label
  rank: normal
alternative label: Lyophilisation
alternative label: Lyophilisierung
alternative label: Sublimationstrocknung
alt label: Sublimationstrocknung
  type: Label
  rank: preferred
alt label: Lyophilisierung
  type: Label
  rank: normal
alt label: Lyophilisation
  type: Label
  rank: normal

Trocknung
type: Concept
notation: AF1F5C
created: 2026-01-30
issued: 2026-01-30
modified: 2026-02-04
publisher: Leibniz-Zentrum für Archäologie (LEIZA)
broader: stabilisierende Konservierung
broader transitive: Maßnahme
broader transitive: Konservierung
broader transitive: [Behandlungsmethode]
broader transitive: stabilisierende Konservierung
definition: Methode zur Entfernung von Feuchtigkeit aus dem Objekt oder von dessen Oberfläche
in scheme: Konservierungs- und Restaurierungsfachthesaurus für archäologische Kulturgüter
pref label: Trocknung
  type: Label
  rank: preferred
narrower: Gefriertrocknung

Feuchtreinigung
type: Concept
notation: C3733A
preferred label: wet cleaning @en
created: 2026-01-30
issued: 2026-01-30
modified: 2026-02-04
publisher: Leibniz-Zentrum für Archäologie (LEIZA)
alternative label: feuchte Reinigung
broader: Reinigung
broader transitive: Restaurierung
broader transitive: Maßnahme
broader transitive: [Behandlungsmethode]
broader transitive: Reinigung
definition: Entfernung ungewollter Substanzen von der Objektoberfläche mit Hilfe leicht angefeuchteter Reinigungsmedien., die in wischenden, rollenden oder reibenden Bewegungen über die Objektfläche geführt werden.
definition:
  literal form: Entfernung ungewollter Substanzen von der Objektoberfläche mit Hilfe leicht angefeuchteter Reinigungsmedien., die in wischenden, rollenden oder reibenden Bewegungen über die Objektfläche geführt werden.
in scheme: Konservierungs- und Restaurierungsfachthesaurus für archäologische Kulturgüter
alt label: feuchte Reinigung
  type: Label
  rank: preferred
pref label: Feuchtreinigung
  type: Label
  rank: preferred
pref label: wet cleaning
  type: Label
  rank: normal

Restaurierung
type: Concept
notation: C79561
preferred label: restoration @en
created: 2026-01-30
issued: 2026-01-30
modified: 2026-02-04
publisher: Leibniz-Zentrum für Archäologie (LEIZA)
alternative label: Restaurierungsmaßnahme
alternative label: Restaurierungsmethode
alternative label: restoration method @en
broader: [Behandlungsmethode]
broader transitive: Maßnahme
broader transitive: [Behandlungsmethode]
in scheme: Konservierungs- und Restaurierungsfachthesaurus für archäologische Kulturgüter
alt label: Restaurierungsmethode
  type: Label
  rank: preferred
alt label: Restaurierungsmaßnahme
  type: Label
  rank: normal
alt label: restoration method
  type: Label
  rank: normal
pref label: Restaurierung
  type: Label
  rank: preferred
pref label: restoration
  type: Label
  rank: normal
definition: Sammelbegriff für Methoden des aktiven Eingriff an einem stabilen oder stabilisierten Objekt, der darauf abzielen, dessen Verständnis, Wahrnehmung und/oder Wertschätzung, zu verbessern, unter Beachtung dessen ursprünglicher Bedeutung sowie der vorgefundenen oder vermuteten Techniken und Materialien
definition:
  literal form: Sammelbegriff für Methoden des aktiven Eingriff an einem stabilen oder stabilisierten Objekt, der darauf abzielen, dessen Verständnis, Wahrnehmung und/oder Wertschätzung, zu verbessern, unter Beachtung dessen ursprünglicher Bedeutung sowie der vorgefundenen oder vermuteten Techniken und Materialien
narrower: Klebung
narrower: Formkorrektur
narrower: Reinigung
narrower: Ergänzung (Restaurierungsmethode)
narrower: Überarbeitung
narrower: Freilegung

Reinigung
type: Concept
notation: CDD613
preferred label: cleaning @en
created: 2026-01-30
issued: 2026-01-30
modified: 2026-02-04
publisher: Leibniz-Zentrum für Archäologie (LEIZA)
broader: Restaurierung
broader transitive: Maßnahme
broader transitive: [Behandlungsmethode]
broader transitive: Restaurierung
definition: Methode zur Entfernung unerwünschter und/oder potenziell schädlicher Materialien von/aus einem Objekt, um dessen optisches Erscheinungsbild und Lesbarkeit zu verbessern. Der Begriff wird in der Regel vor allem als allgemeinerer Begriff für die Entfernung von locker aufliegenden Verschmutzungen, wie Staub- oder Erdanhaftungen verwendet. Er weist enge Verwandschaft und einen fließenden Übergang zu dem Begriff "Freilegung" auf.
definition:
  literal form: Methode zur Entfernung unerwünschter und/oder potenziell schädlicher Materialien von/aus einem Objekt, um dessen optisches Erscheinungsbild und Lesbarkeit zu verbessern. Der Begriff wird in der Regel vor allem als allgemeinerer Begriff für die Entfernung von locker aufliegenden Verschmutzungen, wie Staub- oder Erdanhaftungen verwendet. Er weist enge Verwandschaft und einen fließenden Übergang zu dem Begriff "Freilegung" auf.
in scheme: Konservierungs- und Restaurierungsfachthesaurus für archäologische Kulturgüter
pref label: Reinigung
  type: Label
  rank: preferred
pref label: cleaning
  type: Label
  rank: normal
alternative label: Reinigen
alt label: Reinigen
  type: Label
  rank: preferred
narrower: Nassreinigung
narrower: Feuchtreinigung
narrower: Trockenreinigung

Trockenreinigung
type: Concept
notation: FF8792
preferred label: dry cleaning @en
created: 2026-01-30
issued: 2026-01-30
modified: 2026-02-04
publisher: Leibniz-Zentrum für Archäologie (LEIZA)
broader: Reinigung
broader transitive: Maßnahme
broader transitive: [Behandlungsmethode]
broader transitive: Restaurierung
broader transitive: Reinigung
definition: Entfernung ungewollter Substanzen ohne Verwendung von Flüssigkeiten.
in scheme: Konservierungs- und Restaurierungsfachthesaurus für archäologische Kulturgüter
pref label: Trockenreinigung
  type: Label
  rank: preferred
pref label: dry cleaning
  type: Label
  rank: normal
alternative label: mechanische Reinigung
alternative label: trockene Reinigung
alt label: trockene Reinigung
  type: Label
  rank: preferred
alt label: mechanische Reinigung
  type: Label
  rank: normal

Plasmabehandlung
type: Concept
notation: F72743
created: 2026-01-30
issued: 2026-01-30
modified: 2026-02-04
publisher: Leibniz-Zentrum für Archäologie (LEIZA)
broader: stabilisierende Konservierung
broader transitive: Maßnahme
broader transitive: Konservierung
broader transitive: [Behandlungsmethode]
broader transitive: stabilisierende Konservierung
definition: Methode, bei der mit Hilfe von ionisiertem Gas (Plasma) die korrodierte Oberfläche von Metallobjekten reduziert werden kann. Auf diese Weise lassen sich zum Beispiel dunkle Sulfidflecken entfernen, indem das Silbersulfid zu metallischem Silber reduziert wird.
definition:
  literal form: Methode, bei der mit Hilfe von ionisiertem Gas (Plasma) die korrodierte Oberfläche von Metallobjekten reduziert werden kann. Auf diese Weise lassen sich zum Beispiel dunkle Sulfidflecken entfernen, indem das Silbersulfid zu metallischem Silber reduziert wird.
in scheme: Konservierungs- und Restaurierungsfachthesaurus für archäologische Kulturgüter
pref label: Plasmabehandlung
  type: Label
  rank: preferred

Schutzüberzug aufbringen
type: Concept
notation: GF41DG
created: 2026-01-30
issued: 2026-01-30
modified: 2026-02-04
publisher: Leibniz-Zentrum für Archäologie (LEIZA)
broader: stabilisierende Konservierung
broader transitive: Maßnahme
broader transitive: Konservierung
broader transitive: [Behandlungsmethode]
broader transitive: stabilisierende Konservierung
definition: Methode zum Schutz der Objektoberfläche vor negativer Einwirkung von außen durch Auftrag eines schützenden Materials
in scheme: Konservierungs- und Restaurierungsfachthesaurus für archäologische Kulturgüter
pref label: Schutzüberzug aufbringen
  type: Label
  rank: preferred
alternative label: Überzug aufbringen
alternative label: überziehen
alt label: Überzug aufbringen
  type: Label
  rank: preferred
alt label: überziehen
  type: Label
  rank: normal

Klebung
type: Concept
notation: A13CD1
preferred label: bonding @en
created: 2026-01-30
issued: 2026-01-30
modified: 2026-02-04
publisher: Leibniz-Zentrum für Archäologie (LEIZA)
alternative label: Babbe
alternative label: Fügung
alternative label: Kleben
broader: Restaurierung
broader transitive: Restaurierung
broader transitive: Maßnahme
broader transitive: [Behandlungsmethode]
definition: Methode des Zusammenfügens von Fragmenten und/oder Materialien durch eine adhäsive und kohäsive Verbindung mit Klebstoff, ohne dass das Objektgefüge wesentlich verändert wird.
in scheme: Konservierungs- und Restaurierungsfachthesaurus für archäologische Kulturgüter
narrower: temporäre Fixierung
narrower: Aufbaumethode
narrower: punktuelle Heftung
narrower: Infiltrationsklebung
alt label: Kleben
  type: Label
  rank: preferred
alt label: Fügung
  type: Label
  rank: normal
alt label: Babbe
  type: Label
  rank: normal
pref label: Klebung
  type: Label
  rank: preferred
pref label: bonding
  type: Label
  rank: normal

temporäre Fixierung
type: Concept
notation: A24C1D
created: 2026-01-30
issued: 2026-01-30
modified: 2026-02-04
publisher: Leibniz-Zentrum für Archäologie (LEIZA)
alternative label: provisorische Fixierung
alternative label: temporäre Montage
broader: Klebung
broader transitive: Klebung
broader transitive: Restaurierung
broader transitive: Maßnahme
broader transitive: [Behandlungsmethode]
definition: Methode zur vorübergehenden, nicht dauerhaften Zusammenfügung fragmentierter Objekte, um deren ursprüngliche Form, Konstruktion oder gestalterische Aspekte zu untersuchen oder zu dokumentieren.
in scheme: Konservierungs- und Restaurierungsfachthesaurus für archäologische Kulturgüter
alt label: provisorische Fixierung
  type: Label
  rank: preferred
alt label: temporäre Montage
  type: Label
  rank: normal
pref label: temporäre Fixierung
  type: Label
  rank: preferred

Aufbaumethode
type: Concept
notation: AD143A
created: 2026-01-30
issued: 2026-01-30
modified: 2026-02-04
publisher: Leibniz-Zentrum für Archäologie (LEIZA)
broader: Klebung
broader transitive: Klebung
broader transitive: Restaurierung
broader transitive: Maßnahme
broader transitive: [Behandlungsmethode]
definition: Klebemethode, bei der die einzelnen Fragmente/Teile nacheinander angefügt/geklebt werden und die ursprüngliche Form des Objektes nach und nach wieder aufgebaut wird. Bei Gefäßen bietet es sich häufig an vom Boden zum Rand aufsteigend zu arbeiten, wobei dies von Objekt zu Objekt jeweils individuell entschieden werden sollte.
definition:
  literal form: Klebemethode, bei der die einzelnen Fragmente/Teile nacheinander angefügt/geklebt werden und die ursprüngliche Form des Objektes nach und nach wieder aufgebaut wird. Bei Gefäßen bietet es sich häufig an vom Boden zum Rand aufsteigend zu arbeiten, wobei dies von Objekt zu Objekt jeweils individuell entschieden werden sollte.
in scheme: Konservierungs- und Restaurierungsfachthesaurus für archäologische Kulturgüter
pref label: Aufbaumethode
  type: Label
  rank: preferred

punktuelle Heftung
type: Concept
notation: F2BDGC
created: 2026-01-30
issued: 2026-01-30
modified: 2026-02-04
publisher: Leibniz-Zentrum für Archäologie (LEIZA)
broader: Klebung
broader transitive: Klebung
broader transitive: Restaurierung
broader transitive: Maßnahme
broader transitive: [Behandlungsmethode]
definition: Methode, bei der Fragmente lediglich an einzelnen Punkten mit Klebstoffen zusammengefügt werden. Zum Beispiel um bei der Verwendung von Klebstoffen mit langer Aushärtzeit eine erste Fixierung in der gewünschten Position herzustellen.
definition:
  literal form: Methode, bei der Fragmente lediglich an einzelnen Punkten mit Klebstoffen zusammengefügt werden. Zum Beispiel um bei der Verwendung von Klebstoffen mit langer Aushärtzeit eine erste Fixierung in der gewünschten Position herzustellen.
in scheme: Konservierungs- und Restaurierungsfachthesaurus für archäologische Kulturgüter
pref label: punktuelle Heftung
  type: Label
  rank: preferred

Infiltrationsklebung
type: Concept
notation: F589G5
created: 2026-01-30
issued: 2026-01-30
modified: 2026-02-04
publisher: Leibniz-Zentrum für Archäologie (LEIZA)
broader: Klebung
broader transitive: Klebung
broader transitive: Restaurierung
broader transitive: Maßnahme
broader transitive: [Behandlungsmethode]
definition: Zweischrittige Klebemethode, bei der die einzelnen Fragmente/Teile zunächst temporär miteinander verbunden werden (z.B. durch kleine Klebebandstreifen, Omega-Häkchen, etc.), bis die ursprüngliche Form des Objektes wieder erkennbar ist. Die tatsächliche Klebung erfolgt im zweiten Schritt, durch den gleichzeitigen Auftrag eines dünnflüssigen Klebemittels auf alle Bruchfugen. Aufgrund des Kapillareffekts zwischen den vorfixierten Bruchkanten wird der niedrigviskose Klebstoff in die Bruchfuge gesogen.
definition:
  literal form: Zweischrittige Klebemethode, bei der die einzelnen Fragmente/Teile zunächst temporär miteinander verbunden werden (z.B. durch kleine Klebebandstreifen, Omega-Häkchen, etc.), bis die ursprüngliche Form des Objektes wieder erkennbar ist. Die tatsächliche Klebung erfolgt im zweiten Schritt, durch den gleichzeitigen Auftrag eines dünnflüssigen Klebemittels auf alle Bruchfugen. Aufgrund des Kapillareffekts zwischen den vorfixierten Bruchkanten wird der niedrigviskose Klebstoff in die Bruchfuge gesogen.
in scheme: Konservierungs- und Restaurierungsfachthesaurus für archäologische Kulturgüter
pref label: Infiltrationsklebung
  type: Label
  rank: preferred

maschinelle Freilegung
type: Concept
notation: A6A248
created: 2026-01-30
issued: 2026-01-30
modified: 2026-02-04
publisher: Leibniz-Zentrum für Archäologie (LEIZA)
broader: Freilegung
broader transitive: Restaurierung
broader transitive: Maßnahme
broader transitive: [Behandlungsmethode]
broader transitive: Freilegung
definition: Freilegung der originalen Objektoberfläche durch Verwendung von Maschinen/ maschinellen Geräten
in scheme: Konservierungs- und Restaurierungsfachthesaurus für archäologische Kulturgüter
pref label: maschinelle Freilegung
  type: Label
  rank: preferred

Freilegung
type: Concept
notation: G814D2
preferred label: uncovering @en
created: 2026-01-30
issued: 2026-01-30
modified: 2026-02-04
publisher: Leibniz-Zentrum für Archäologie (LEIZA)
alternative label: Freilegen
broader: Restaurierung
broader transitive: Restaurierung
broader transitive: Maßnahme
broader transitive: [Behandlungsmethode]
definition: Methode zur Entfernung unerwünschter und/oder potenziell schädlicher Materialien von der Oberfläche eines Objektes zur Offenlegung der zuvor verdeckten originalen Objektoberfläche. Der Begriff "Freilegung" wird, in Abgrenzung zum Begriff "Reinigung", in der Regel hauptsächlich im Bezug auf die Entfernung von Korrosions- oder Sinterauflagerungen verwendet. Der Übergang zwischen den Begriffen muss jedoch als fließend und zum Teil nicht scharf abgrenzbar betrachtet werden.
definition:
  literal form: Methode zur Entfernung unerwünschter und/oder potenziell schädlicher Materialien von der Oberfläche eines Objektes zur Offenlegung der zuvor verdeckten originalen Objektoberfläche. Der Begriff "Freilegung" wird, in Abgrenzung zum Begriff "Reinigung", in der Regel hauptsächlich im Bezug auf die Entfernung von Korrosions- oder Sinterauflagerungen verwendet. Der Übergang zwischen den Begriffen muss jedoch als fließend und zum Teil nicht scharf abgrenzbar betrachtet werden.
in scheme: Konservierungs- und Restaurierungsfachthesaurus für archäologische Kulturgüter
narrower: maschinelle Freilegung
narrower: manuelle Freilegung
narrower: nasschemische Freilegung
alt label: Freilegen
  type: Label
  rank: preferred
pref label: Freilegung
  type: Label
  rank: preferred
pref label: uncovering
  type: Label
  rank: normal

manuelle Freilegung
type: Concept
notation: G3GB59
created: 2026-01-30
issued: 2026-01-30
modified: 2026-02-04
publisher: Leibniz-Zentrum für Archäologie (LEIZA)
broader: Freilegung
broader transitive: Restaurierung
broader transitive: Maßnahme
broader transitive: [Behandlungsmethode]
broader transitive: Freilegung
definition: Per Hand ausgeführte Freilegung der originalen Oberfläche ohne Verwendung elektrischer Geräte
in scheme: Konservierungs- und Restaurierungsfachthesaurus für archäologische Kulturgüter
pref label: manuelle Freilegung
  type: Label
  rank: preferred

nasschemische Freilegung
type: Concept
notation: G8A626
created: 2026-01-30
issued: 2026-01-30
modified: 2026-02-04
publisher: Leibniz-Zentrum für Archäologie (LEIZA)
broader: Freilegung
broader transitive: Restaurierung
broader transitive: Maßnahme
broader transitive: [Behandlungsmethode]
broader transitive: Freilegung
definition: Freilegung der originalen Objektoberfläche durch Anwendung von Chemikalien
in scheme: Konservierungs- und Restaurierungsfachthesaurus für archäologische Kulturgüter
pref label: nasschemische Freilegung
  type: Label
  rank: preferred

Tonkernergänzung
type: Concept
notation: A6F2C7
created: 2026-01-30
issued: 2026-01-30
modified: 2026-02-04
publisher: Leibniz-Zentrum für Archäologie (LEIZA)
broader: Ergänzung (Restaurierungsmethode)
broader transitive: Restaurierung
broader transitive: Maßnahme
broader transitive: [Behandlungsmethode]
broader transitive: Ergänzung (Restaurierungsmethode)
definition: Ergänzungsmethode für Objekte (i.d.R. Keramikgefäße), bei denen nur noch wenige Teile/Scherben erhalten sind. Voraussetzung ist ein durchgehendes Profil oder eine eindeutige Zuordnung des Objektes zu einer standartisierten Gefäßform. Durch die Ermittlung der ursprünglichen Innenform und dem Durchmesser des Gefäßes wird ein Tonkern angefertig, der diesen Maßen entspricht. Darauf werden die vorhandenen Objektteile/Scherben positioniert und die Fehlstellen durch Auftrag des Ergänzungsmaterials (meist Gips) gefüllt. Durch den Tonkern erhält das aufgetragene Ergänzungsmaterial bereits die ermittelte ursprüngliche Innenform des Objektes/Gefäßes, sodass lediglich die Außenform an die Form der erhaltenen Objektteile angeglichen werden muss.
definition:
  literal form: Ergänzungsmethode für Objekte (i.d.R. Keramikgefäße), bei denen nur noch wenige Teile/Scherben erhalten sind. Voraussetzung ist ein durchgehendes Profil oder eine eindeutige Zuordnung des Objektes zu einer standartisierten Gefäßform. Durch die Ermittlung der ursprünglichen Innenform und dem Durchmesser des Gefäßes wird ein Tonkern angefertig, der diesen Maßen entspricht. Darauf werden die vorhandenen Objektteile/Scherben positioniert und die Fehlstellen durch Auftrag des Ergänzungsmaterials (meist Gips) gefüllt. Durch den Tonkern erhält das aufgetragene Ergänzungsmaterial bereits die ermittelte ursprüngliche Innenform des Objektes/Gefäßes, sodass lediglich die Außenform an die Form der erhaltenen Objektteile angeglichen werden muss.
in scheme: Konservierungs- und Restaurierungsfachthesaurus für archäologische Kulturgüter
pref label: Tonkernergänzung
  type: Label
  rank: preferred

Ergänzung (Restaurierungsmethode)
type: Concept
notation: CGC619
preferred label: filling @en
created: 2026-01-30
issued: 2026-01-30
modified: 2026-02-04
publisher: Leibniz-Zentrum für Archäologie (LEIZA)
alternative label: Ergänzen
broader: Restaurierung
broader transitive: Restaurierung
broader transitive: Maßnahme
broader transitive: [Behandlungsmethode]
definition: Methode zur Schließung von Fehlstellen und/oder Vervollständigung fehlender Objektteile durch das Hinzufügen von Material. Wird nach der modernen archäologischen Restaurierungsethik hauptsächlich aus statischen/stabilisierenden Gründen oder zu Rekonstruktion eines vollkommen unkenntlichen Erscheinungsbildes durchgeführt.
definition:
  literal form: Methode zur Schließung von Fehlstellen und/oder Vervollständigung fehlender Objektteile durch das Hinzufügen von Material. Wird nach der modernen archäologischen Restaurierungsethik hauptsächlich aus statischen/stabilisierenden Gründen oder zu Rekonstruktion eines vollkommen unkenntlichen Erscheinungsbildes durchgeführt.
in scheme: Konservierungs- und Restaurierungsfachthesaurus für archäologische Kulturgüter
alt label: Ergänzen
  type: Label
  rank: preferred
pref label: Ergänzung (Restaurierungsmethode)
  type: Label
  rank: preferred
pref label: filling
  type: Label
  rank: normal
narrower: Tonkernergänzung
narrower: Retusche
narrower: Manschettenergänzung
narrower: Einfügung

Retusche
type: Concept
notation: BD119A
created: 2026-01-30
issued: 2026-01-30
modified: 2026-02-04
publisher: Leibniz-Zentrum für Archäologie (LEIZA)
alternative label: Färben
alternative label: Kolorieren
broader: Ergänzung (Restaurierungsmethode)
broader transitive: Restaurierung
broader transitive: Maßnahme
broader transitive: [Behandlungsmethode]
broader transitive: Ergänzung (Restaurierungsmethode)
definition: Methode zur farbigen Nachfassung ergänzter Bereiche um sie, im Vergleich zum originalen Material, weniger stark in den Vordergrund treten zu lassen. In der Regel werden die Ergänzungen im gleichen Farbton, aber eine Nuance heller als das original Material, eingefärbt.
definition:
  literal form: Methode zur farbigen Nachfassung ergänzter Bereiche um sie, im Vergleich zum originalen Material, weniger stark in den Vordergrund treten zu lassen. In der Regel werden die Ergänzungen im gleichen Farbton, aber eine Nuance heller als das original Material, eingefärbt.
in scheme: Konservierungs- und Restaurierungsfachthesaurus für archäologische Kulturgüter
alt label: Kolorieren
  type: Label
  rank: preferred
alt label: Färben
  type: Label
  rank: normal
pref label: Retusche
  type: Label
  rank: preferred

frühere Restaurierungsmaterialien entfernt
type: Concept
notation: C6C3CF
preferred label: removal of previous restoration materials @en
created: 2026-01-30
issued: 2026-01-30
modified: 2026-02-04
publisher: Leibniz-Zentrum für Archäologie (LEIZA)
broader: Überarbeitung
broader transitive: Restaurierung
broader transitive: Maßnahme
broader transitive: Überarbeitung
broader transitive: [Behandlungsmethode]
definition: Methode, bei der im Zuge voran gegangener Konservierungs- und/oder Restaurierungsmaßnahmen eingebrachte Materialien von bzw. aus dem Objekt entfernt werden.
in scheme: Konservierungs- und Restaurierungsfachthesaurus für archäologische Kulturgüter
pref label: frühere Restaurierungsmaterialien entfernt
  type: Label
  rank: preferred
pref label: removal of previous restoration materials
  type: Label
  rank: normal
narrower: Oberflächenbeschichtungen entfernt
narrower: Klebungen entfernt
narrower: Ergänzungsmaterialien entfernt

Manschettenergänzung
type: Concept
notation: CBDC4A
created: 2026-01-30
issued: 2026-01-30
modified: 2026-02-04
publisher: Leibniz-Zentrum für Archäologie (LEIZA)
broader: Ergänzung (Restaurierungsmethode)
broader transitive: Restaurierung
broader transitive: Maßnahme
broader transitive: [Behandlungsmethode]
broader transitive: Ergänzung (Restaurierungsmethode)
definition: Ergänzungsmethode, bei der die fehlende Stelle des Objektes mit Hilfe einer, der Form des Objektes entsprechend ausgearbeiteten Manschette hinterlegt oder umschlossen wird. Auf diese Weise kann das Ergänzungsmaterial direkt an das Objekt angegossen und mit wenig Nacharbeit an die benötigte Form der zu ergänzenden Stelle angepasst werden.
definition:
  literal form: Ergänzungsmethode, bei der die fehlende Stelle des Objektes mit Hilfe einer, der Form des Objektes entsprechend ausgearbeiteten Manschette hinterlegt oder umschlossen wird. Auf diese Weise kann das Ergänzungsmaterial direkt an das Objekt angegossen und mit wenig Nacharbeit an die benötigte Form der zu ergänzenden Stelle angepasst werden.
in scheme: Konservierungs- und Restaurierungsfachthesaurus für archäologische Kulturgüter
pref label: Manschettenergänzung
  type: Label
  rank: preferred
narrower: beidseitige Manschettenergänzung
narrower: einseitige Manschettenergänzung

beidseitige Manschettenergänzung
type: Concept
notation: D152G6
created: 2026-01-30
issued: 2026-01-30
modified: 2026-02-04
publisher: Leibniz-Zentrum für Archäologie (LEIZA)
broader: Manschettenergänzung
broader transitive: Restaurierung
broader transitive: Maßnahme
broader transitive: [Behandlungsmethode]
broader transitive: Ergänzung (Restaurierungsmethode)
broader transitive: Manschettenergänzung
definition: Variante der Manschettenergänzung, bei der die Fehlstelle von beiden Seiten (Außen- und Innenseite bei Gefäßen) umschlossen wird. Hierzu werden zwei Manschetten angefertigt, die jeweils die beiden Seiten der Fehlstelle abdecken. Auf diese Weise wird ein der Materialstärke des Objektes entsprechender Holraum erzeugen, der mit einem Ergänzungsmaterial ausgefüllt werden kann. Diese Ergänzungsvariante wird insbesondere für Glasobjekte verwendet. Auch bei der Wahl von Kunstharzen als Ergänzungsmaterial ist diese Variante zu bevorzugen, da Kunstharze nach dem Aushärten nur noch mit relativ großem Aufwand nachbearbeitet werden können.
definition:
  literal form: Variante der Manschettenergänzung, bei der die Fehlstelle von beiden Seiten (Außen- und Innenseite bei Gefäßen) umschlossen wird. Hierzu werden zwei Manschetten angefertigt, die jeweils die beiden Seiten der Fehlstelle abdecken. Auf diese Weise wird ein der Materialstärke des Objektes entsprechender Holraum erzeugen, der mit einem Ergänzungsmaterial ausgefüllt werden kann. Diese Ergänzungsvariante wird insbesondere für Glasobjekte verwendet. Auch bei der Wahl von Kunstharzen als Ergänzungsmaterial ist diese Variante zu bevorzugen, da Kunstharze nach dem Aushärten nur noch mit relativ großem Aufwand nachbearbeitet werden können.
in scheme: Konservierungs- und Restaurierungsfachthesaurus für archäologische Kulturgüter
pref label: beidseitige Manschettenergänzung
  type: Label
  rank: preferred

einseitige Manschettenergänzung
type: Concept
notation: DAA82A
created: 2026-01-30
issued: 2026-01-30
modified: 2026-02-04
publisher: Leibniz-Zentrum für Archäologie (LEIZA)
broader: Manschettenergänzung
broader transitive: Restaurierung
broader transitive: Maßnahme
broader transitive: [Behandlungsmethode]
broader transitive: Ergänzung (Restaurierungsmethode)
broader transitive: Manschettenergänzung
definition: Variante der Manschettenergänzung, bei der die Fehlstelle nur von einer Seite (bei Gefäßen i.d.R. die Innenseite) hinterlegt wird, beispielsweise mit einer dünnen Plastilinplatte. Von der freien Seite aus kann dann das Ergänzungsmaterial aufgetragen werden. Diese Art der Ergänzung wird insbesondere für Keramikgefäße angewandt und verlangt die Verwendung eines Ergänzungsmaterials, welches auch nach dem Aushärten/Abbinden noch gut mechanisch bearbeitet werden kann (z.B. Gips).
definition:
  literal form: Variante der Manschettenergänzung, bei der die Fehlstelle nur von einer Seite (bei Gefäßen i.d.R. die Innenseite) hinterlegt wird, beispielsweise mit einer dünnen Plastilinplatte. Von der freien Seite aus kann dann das Ergänzungsmaterial aufgetragen werden. Diese Art der Ergänzung wird insbesondere für Keramikgefäße angewandt und verlangt die Verwendung eines Ergänzungsmaterials, welches auch nach dem Aushärten/Abbinden noch gut mechanisch bearbeitet werden kann (z.B. Gips).
in scheme: Konservierungs- und Restaurierungsfachthesaurus für archäologische Kulturgüter
pref label: einseitige Manschettenergänzung
  type: Label
  rank: preferred

Einfügung
type: Concept
notation: GAD222
created: 2026-01-30
issued: 2026-01-30
modified: 2026-02-04
publisher: Leibniz-Zentrum für Archäologie (LEIZA)
broader: Ergänzung (Restaurierungsmethode)
broader transitive: Restaurierung
broader transitive: Maßnahme
broader transitive: [Behandlungsmethode]
broader transitive: Ergänzung (Restaurierungsmethode)
definition: Ergänzungsmethode durch separate Herstellung des fehlenden Formteiles eines Objektes und anschließendes Einpassen/Einkleben in die Fehlstelle. Das separate Ausformen der Ergänzung kann durch freies Modellieren, Abnehmen der fehlenden Form an einer anderen Stelle des Objektes oder separate Abformung an einem dem fehlenden Teil ähnlichen Vergleichsobjekt erfolgen.
definition:
  literal form: Ergänzungsmethode durch separate Herstellung des fehlenden Formteiles eines Objektes und anschließendes Einpassen/Einkleben in die Fehlstelle. Das separate Ausformen der Ergänzung kann durch freies Modellieren, Abnehmen der fehlenden Form an einer anderen Stelle des Objektes oder separate Abformung an einem dem fehlenden Teil ähnlichen Vergleichsobjekt erfolgen.
in scheme: Konservierungs- und Restaurierungsfachthesaurus für archäologische Kulturgüter
pref label: Einfügung
  type: Label
  rank: preferred

Überarbeitung
type: Concept
notation: D865C3
created: 2026-01-30
issued: 2026-01-30
modified: 2026-02-04
publisher: Leibniz-Zentrum für Archäologie (LEIZA)
alternative label: Rerestaurierung
broader: Restaurierung
broader transitive: Restaurierung
broader transitive: Maßnahme
broader transitive: [Behandlungsmethode]
definition: Sammelbegriff für Methoden, bereits durchgeführte Maßnahmen (Altrestaurierungen/-Konservierungen) aber auch temporäre Stabilisierungen z.B. für die Bergung im Feld oder den Transport in die Werkstatt, zu überarbeiten bzw. zu entfernen. Dies kann der Fall sein, wenn z.B. verwendete Materialien im Laufe der Zeit selbst von Abbauprozessen negativ beeinflusst wurden oder ehemals angewandte Methoden/Materialien nicht mehr dem aktuellen Zeitgeist der Restaurierungsethik entsprechend.
definition:
  literal form: Sammelbegriff für Methoden, bereits durchgeführte Maßnahmen (Altrestaurierungen/-Konservierungen) aber auch temporäre Stabilisierungen z.B. für die Bergung im Feld oder den Transport in die Werkstatt, zu überarbeiten bzw. zu entfernen. Dies kann der Fall sein, wenn z.B. verwendete Materialien im Laufe der Zeit selbst von Abbauprozessen negativ beeinflusst wurden oder ehemals angewandte Methoden/Materialien nicht mehr dem aktuellen Zeitgeist der Restaurierungsethik entsprechend.
in scheme: Konservierungs- und Restaurierungsfachthesaurus für archäologische Kulturgüter
alt label: Rerestaurierung
  type: Label
  rank: preferred
pref label: Überarbeitung
  type: Label
  rank: preferred
narrower: frühere Restaurierungsmaterialien entfernt
narrower: Blockbergung aufgelöst
narrower: temporäre Stabilisierung entfernt

Blockbergung aufgelöst
type: Concept
notation: DGF99C
created: 2026-01-30
issued: 2026-01-30
modified: 2026-02-04
publisher: Leibniz-Zentrum für Archäologie (LEIZA)
broader: Überarbeitung
broader transitive: Restaurierung
broader transitive: Maßnahme
broader transitive: Überarbeitung
broader transitive: [Behandlungsmethode]
definition: Methode bei der ein en-bloc geborgenes Objekt bzw. Fundkomplex systematisch unter Laborbedingungen freigelegt, dokumentiert und aus dem Blockverbund herausgelöst wird.
in scheme: Konservierungs- und Restaurierungsfachthesaurus für archäologische Kulturgüter
pref label: Blockbergung aufgelöst
  type: Label
  rank: preferred
alternative label: Blockauflösung
alternative label: Blockbergung ausgeräumt
alt label: Blockauflösung
  type: Label
  rank: preferred
alt label: Blockbergung ausgeräumt
  type: Label
  rank: normal

temporäre Stabilisierung entfernt
type: Concept
notation: F57A2A
created: 2026-01-30
issued: 2026-01-30
modified: 2026-02-04
publisher: Leibniz-Zentrum für Archäologie (LEIZA)
broader: Überarbeitung
broader transitive: Restaurierung
broader transitive: Maßnahme
broader transitive: [Behandlungsmethode]
broader transitive: Überarbeitung
definition: Methode, bei der die für einen temporären Zeitraum gefertigten Stabilisierungen entfernt werden. Dies bezieht sich z.B. auf vorübergehende Einhausungen für den Transport von Objekten.
in scheme: Konservierungs- und Restaurierungsfachthesaurus für archäologische Kulturgüter
pref label: temporäre Stabilisierung entfernt
  type: Label
  rank: preferred

2-Butanon
type: Concept
notation: AFC696
preferred label: ethyl methyl ketone @en
created: 2026-01-30
issued: 2026-01-30
modified: 2026-02-04
publisher: Leibniz-Zentrum für Archäologie (LEIZA)
broader: Lösungsmittel
broader transitive: Konservierungs- und Restaurierungsmaterialien
broader transitive: Lösungsmittel
broader transitive: Maßnahme
definition: organische Verbindung mit der chemischen Formel C4H8O aus der Gruppe der Ketone. Es ist eine farblose, flüchtige Flüssigkeit mit charakteristischem Geruch, die sich durch eine moderate Polarität und hohe Lösekraft sowie eine Verdunstungsgeschwindigkeit zwischen Aceton und Ethanol auszeichnet, wodurch es in der Konservierung und Restaurierung zur Entfernung von Beschichtungen, Klebstoffen und zur Herstellung von Polymerlösungen verwendet wird.
definition:
  literal form: organische Verbindung mit der chemischen Formel C4H8O aus der Gruppe der Ketone. Es ist eine farblose, flüchtige Flüssigkeit mit charakteristischem Geruch, die sich durch eine moderate Polarität und hohe Lösekraft sowie eine Verdunstungsgeschwindigkeit zwischen Aceton und Ethanol auszeichnet, wodurch es in der Konservierung und Restaurierung zur Entfernung von Beschichtungen, Klebstoffen und zur Herstellung von Polymerlösungen verwendet wird.
in scheme: Konservierungs- und Restaurierungsfachthesaurus für archäologische Kulturgüter
pref label: 2-Butanon
  type: Label
  rank: preferred
pref label: ethyl methyl ketone
  type: Label
  rank: normal
alternative label: Butanon
alternative label: MEK
alternative label: Methyl Ethyl Keton
alt label: MEK
  type: Label
  rank: preferred
alt label: Methyl Ethyl Keton
  type: Label
  rank: normal
alt label: Butanon
  type: Label
  rank: normal

Oberflächenbeschichtungen entfernt
type: Concept
notation: B2642A
preferred label: removal of surface coatings @en
created: 2026-01-30
issued: 2026-01-30
modified: 2026-02-04
publisher: Leibniz-Zentrum für Archäologie (LEIZA)
broader: frühere Restaurierungsmaterialien entfernt
broader transitive: frühere Restaurierungsmaterialien entfernt
broader transitive: Restaurierung
broader transitive: Maßnahme
broader transitive: Überarbeitung
broader transitive: [Behandlungsmethode]
definition: Methode, bei der zu einem früheren Zeitpunkt auf die Objektoberfläche aufgebrachte Beschichtungen entfernt werden.
in scheme: Konservierungs- und Restaurierungsfachthesaurus für archäologische Kulturgüter
pref label: Oberflächenbeschichtungen entfernt
  type: Label
  rank: preferred
pref label: removal of surface coatings
  type: Label
  rank: normal

Ethylacetat
type: Concept
notation: B77A8F
preferred label: ethyl acetate @en
created: 2026-01-30
issued: 2026-01-30
modified: 2026-02-04
publisher: Leibniz-Zentrum für Archäologie (LEIZA)
broader: Lösungsmittel
broader transitive: Konservierungs- und Restaurierungsmaterialien
broader transitive: Lösungsmittel
broader transitive: Maßnahme
definition: flüchtiges, farbloses Lösungsmittel aus der Gruppe der Carbonsäureester, welches in der Lage ist verschiedene organische Stoffe, wie Polymere, zu lösen bzw. Lösungen einzugehen. Es verdunstet relativ langsam, hinterlässt kaum Rückstände und ist im Verhältnis zu anderen Lösungsmitteln weniger toxisch, wobei dennoch akute Gesundheitsgefahren von diesem Stoff ausgehen! In der Konservierung und Restaurierung wird Ethylacetat häufig als Ersatz für das hochgiftige Toluol verwendet, da es sich ähnlich langsam verflüchtigt und somit bei der Festigung instabiler Materialien zu einer ähnlich guten Eindringtiefe gelöster Polymere führt.
definition:
  literal form: flüchtiges, farbloses Lösungsmittel aus der Gruppe der Carbonsäureester, welches in der Lage ist verschiedene organische Stoffe, wie Polymere, zu lösen bzw. Lösungen einzugehen. Es verdunstet relativ langsam, hinterlässt kaum Rückstände und ist im Verhältnis zu anderen Lösungsmitteln weniger toxisch, wobei dennoch akute Gesundheitsgefahren von diesem Stoff ausgehen! In der Konservierung und Restaurierung wird Ethylacetat häufig als Ersatz für das hochgiftige Toluol verwendet, da es sich ähnlich langsam verflüchtigt und somit bei der Festigung instabiler Materialien zu einer ähnlich guten Eindringtiefe gelöster Polymere führt.
in scheme: Konservierungs- und Restaurierungsfachthesaurus für archäologische Kulturgüter
pref label: Ethylacetat
  type: Label
  rank: preferred
pref label: ethyl acetate
  type: Label
  rank: normal
alternative label: Essigester
alternative label: Essigsäureethylester
alternative label: Ethansäureethylester
alt label: Essigsäureethylester
  type: Label
  rank: preferred
alt label: Ethansäureethylester
  type: Label
  rank: normal
alt label: Essigester
  type: Label
  rank: normal

Ethanol
type: Concept
notation: BBA28A
preferred label: ethyl alcohol @en
created: 2026-01-30
issued: 2026-01-30
modified: 2026-02-04
publisher: Leibniz-Zentrum für Archäologie (LEIZA)
broader: Lösungsmittel
broader transitive: Konservierungs- und Restaurierungsmaterialien
broader transitive: Lösungsmittel
broader transitive: Maßnahme
definition: farblose, leicht entzündliche Flüssigkeit die in der Konservierung und Restaurierung als universelles Lösungsmittel für die Entfernung von Fetten, Proteinen und Polymeren sowie zur Herstellung von lösemittelbasierten Polymerlösungen verwendet wird. Ethanol zeigt eine relativ schnelle Verdunstung (jedoch langsamer als Aceton), eine gutes Peetrationsvermögen und die Fähigkeit als amphiphiles Lösungsmittel sowohl polare als auch unpolare Substanzen zu lösen. Aufgrund der aktuen Gesundheitsgefahren sind bei der Verwendung die gängigen Sicherheitsvorkehrungen einzuhalten.
definition:
  literal form: farblose, leicht entzündliche Flüssigkeit die in der Konservierung und Restaurierung als universelles Lösungsmittel für die Entfernung von Fetten, Proteinen und Polymeren sowie zur Herstellung von lösemittelbasierten Polymerlösungen verwendet wird. Ethanol zeigt eine relativ schnelle Verdunstung (jedoch langsamer als Aceton), eine gutes Peetrationsvermögen und die Fähigkeit als amphiphiles Lösungsmittel sowohl polare als auch unpolare Substanzen zu lösen. Aufgrund der aktuen Gesundheitsgefahren sind bei der Verwendung die gängigen Sicherheitsvorkehrungen einzuhalten.
in scheme: Konservierungs- und Restaurierungsfachthesaurus für archäologische Kulturgüter
pref label: Ethanol
  type: Label
  rank: preferred
pref label: ethyl alcohol
  type: Label
  rank: normal
alternative label: Alkohol
alternative label: Ethylalkohol
alternative label: Spiritus
alternative label: Äthanol
alt label: Spiritus
  type: Label
  rank: preferred
alt label: Ethylalkohol
  type: Label
  rank: normal
alt label: Äthanol
  type: Label
  rank: normal
alt label: Alkohol
  type: Label
  rank: normal

Xylol
type: Concept
notation: BDG3D5
preferred label: xylene @en
created: 2026-01-30
issued: 2026-01-30
modified: 2026-02-04
publisher: Leibniz-Zentrum für Archäologie (LEIZA)
broader: Lösungsmittel
broader transitive: Konservierungs- und Restaurierungsmaterialien
broader transitive: Maßnahme
broader transitive: Lösungsmittel
definition: aromatischer Kohlenwasserstoff und organisches Lösemittel mit der chemischen Summenformel C8H10, das in der Konservierung und Restaurierung zur Lösung unpolarer Substanzen wie Harze, Wachse oder Polymere verwendet wird. Xylol ist eng verwandt mit Toluol, zeigt jedoch eine geringere Flüchtigkeit und eine schwächerer Polarität. Ebenso wie Toluol ist Xylol gesundheitsgefährdend und die Verwendung sollte nach Möglichkeiten vermieden werden.
definition:
  literal form: aromatischer Kohlenwasserstoff und organisches Lösemittel mit der chemischen Summenformel C8H10, das in der Konservierung und Restaurierung zur Lösung unpolarer Substanzen wie Harze, Wachse oder Polymere verwendet wird. Xylol ist eng verwandt mit Toluol, zeigt jedoch eine geringere Flüchtigkeit und eine schwächerer Polarität. Ebenso wie Toluol ist Xylol gesundheitsgefährdend und die Verwendung sollte nach Möglichkeiten vermieden werden.
in scheme: Konservierungs- und Restaurierungsfachthesaurus für archäologische Kulturgüter
pref label: Xylol
  type: Label
  rank: preferred
pref label: xylene
  type: Label
  rank: normal

Lösungsmittel
type: Concept
notation: C421BF
preferred label: solvent @en
created: 2026-01-30
issued: 2026-01-30
modified: 2026-02-04
publisher: Leibniz-Zentrum für Archäologie (LEIZA)
broader: Konservierungs- und Restaurierungsmaterialien
broader transitive: Maßnahme
broader transitive: Konservierungs- und Restaurierungsmaterialien
definition: Substanz, die in der Lage ist andere Stoffe (Feststoffe, Flüssigkeiten oder Gase) zu lösen, ohne dabei selbst eine chemische Reaktion mit diesem Stoff einzugehen. Das Lösungsmittel bildet eine homogene Mischung (Lösung) mit dem gelösten Stoff, in der die Moleküle des gelösten Stoffes in der Matrix des Lösemittels fein verteilt sind. Diese Stoffe werden in der Konservierung/Restaurierung als Reinigungsmittel für die Entfernung unerwünschter Substanzen von/aus einem Objekt verwendet und gleichzeitig auch als Lösungsmittel von Polymeren für die Herstellung lösemittelbasierter Klebstoffe bzw. Lacke.
definition:
  literal form: Substanz, die in der Lage ist andere Stoffe (Feststoffe, Flüssigkeiten oder Gase) zu lösen, ohne dabei selbst eine chemische Reaktion mit diesem Stoff einzugehen. Das Lösungsmittel bildet eine homogene Mischung (Lösung) mit dem gelösten Stoff, in der die Moleküle des gelösten Stoffes in der Matrix des Lösemittels fein verteilt sind. Diese Stoffe werden in der Konservierung/Restaurierung als Reinigungsmittel für die Entfernung unerwünschter Substanzen von/aus einem Objekt verwendet und gleichzeitig auch als Lösungsmittel von Polymeren für die Herstellung lösemittelbasierter Klebstoffe bzw. Lacke.
in scheme: Konservierungs- und Restaurierungsfachthesaurus für archäologische Kulturgüter
pref label: Lösungsmittel
  type: Label
  rank: preferred
pref label: solvent
  type: Label
  rank: normal
alternative label: Lösemittel
alternative label: Reinigungsmittel
narrower: 2-Butanon
narrower: Ethylacetat
narrower: Ethanol
narrower: Xylol
narrower: Terpentinöl
narrower: Toloul
narrower: Aceton
narrower: Wasser
narrower: Siedegrenzbenzin
narrower: Propylacetat
narrower: Coloradol
alt label: Lösemittel
  type: Label
  rank: preferred
alt label: Reinigungsmittel
  type: Label
  rank: normal

Terpentinöl
type: Concept
notation: D347D6
preferred label: turpentine @en
created: 2026-01-30
issued: 2026-01-30
modified: 2026-02-04
publisher: Leibniz-Zentrum für Archäologie (LEIZA)
broader: Lösungsmittel
broader transitive: Konservierungs- und Restaurierungsmaterialien
broader transitive: Maßnahme
broader transitive: Lösungsmittel
definition: farbloses, ätherisches Öl, das durch Destillation von Baumharzen, insbesondere von Nadelbäumen, gewonnen wird. Es zeichnet sich durch seine gute Lösekraft für natürliche Harzen und Wachse aus und wird in der Konservierung und Restaurierung häufig als Lösungsmittel für Reinigungsarbeiten, die Entfernung von alten Firnissen oder das Anmischen traditioneller Mal- und Schutzmittel verwendet. Es gehen aktue und chronische Gesundheitsgefahren von Terpentinöl aus, wodurch es mit gewisser Vorsicht eingesetzt werden sollte.
definition:
  literal form: farbloses, ätherisches Öl, das durch Destillation von Baumharzen, insbesondere von Nadelbäumen, gewonnen wird. Es zeichnet sich durch seine gute Lösekraft für natürliche Harzen und Wachse aus und wird in der Konservierung und Restaurierung häufig als Lösungsmittel für Reinigungsarbeiten, die Entfernung von alten Firnissen oder das Anmischen traditioneller Mal- und Schutzmittel verwendet. Es gehen aktue und chronische Gesundheitsgefahren von Terpentinöl aus, wodurch es mit gewisser Vorsicht eingesetzt werden sollte.
in scheme: Konservierungs- und Restaurierungsfachthesaurus für archäologische Kulturgüter
pref label: Terpentinöl
  type: Label
  rank: preferred
pref label: turpentine
  type: Label
  rank: normal
alternative label: Balsamterpentinöl
alt label: Balsamterpentinöl
  type: Label
  rank: preferred

Toloul
type: Concept
notation: D627B2
preferred label: toluene @en
created: 2026-01-30
issued: 2026-01-30
modified: 2026-02-04
publisher: Leibniz-Zentrum für Archäologie (LEIZA)
broader: Lösungsmittel
broader transitive: Konservierungs- und Restaurierungsmaterialien
broader transitive: Lösungsmittel
broader transitive: Maßnahme
definition: aromatischer Kohlenwasserstoff und organisches, unpolares Lösungsmittel mit der chemischen Summenformel C7H8, das in der Konservierung und Restaurierung zur Entfernung von Wachsen, Ölen, Harzen und Polymeren von/aus Objekten sowie zur Herstellung von Polymerlösungen verwendet wird. Toluol ist höchst gesundheitsgefährdent, sodass seine Verwendung auf ein Minium beschränkt und nach Möglichkeiten auf weniger gefährliche Alternativen zurückgegriffen werden sollte. Toluol ist eng verwandt mit Xylol, zeigt jedoch eine höhere Flüchtigkeit und eine geringfügig bessere Lösungskraft aufgrund der etwas höheren Polarität
definition:
  literal form: aromatischer Kohlenwasserstoff und organisches, unpolares Lösungsmittel mit der chemischen Summenformel C7H8, das in der Konservierung und Restaurierung zur Entfernung von Wachsen, Ölen, Harzen und Polymeren von/aus Objekten sowie zur Herstellung von Polymerlösungen verwendet wird. Toluol ist höchst gesundheitsgefährdent, sodass seine Verwendung auf ein Minium beschränkt und nach Möglichkeiten auf weniger gefährliche Alternativen zurückgegriffen werden sollte. Toluol ist eng verwandt mit Xylol, zeigt jedoch eine höhere Flüchtigkeit und eine geringfügig bessere Lösungskraft aufgrund der etwas höheren Polarität
in scheme: Konservierungs- und Restaurierungsfachthesaurus für archäologische Kulturgüter
pref label: Toloul
  type: Label
  rank: preferred
pref label: toluene
  type: Label
  rank: normal
alternative label: Methylbenzol
alt label: Methylbenzol
  type: Label
  rank: preferred

Aceton
type: Concept
notation: D72F3A
preferred label: acetone @en
created: 2026-01-30
issued: 2026-01-30
modified: 2026-02-04
publisher: Leibniz-Zentrum für Archäologie (LEIZA)
broader: Lösungsmittel
broader transitive: Konservierungs- und Restaurierungsmaterialien
broader transitive: Lösungsmittel
broader transitive: Maßnahme
definition: klare, charakteristisch aromatisch-süßlich riechende Flüssigkeit, die als weitverbreitestes organisches Lösungsmittel für eine Vielzahl an Polymeren, Fetten, Wachsen und Ölen verwendet wird. Aceton ist stark flüchtig und eignet sich aufgrund seiner schnellen Verdunstung und starken Lösungskraft sehr gut für gezielte Reinigungsarbeiten, ohne das zu behandelne Material zu stark zu durchfeuchten. Darüber hinaus wird es häufig für die Herstellung von Polymerlösungen für Klebungen, Tränkungen oder Schutzüberzüge verwendet. Aceton ist akut gesundheitsgefährdend und sollte stets mit den nötigen Sicherheitsvorkehrungen verwendet werden.
definition:
  literal form: klare, charakteristisch aromatisch-süßlich riechende Flüssigkeit, die als weitverbreitestes organisches Lösungsmittel für eine Vielzahl an Polymeren, Fetten, Wachsen und Ölen verwendet wird. Aceton ist stark flüchtig und eignet sich aufgrund seiner schnellen Verdunstung und starken Lösungskraft sehr gut für gezielte Reinigungsarbeiten, ohne das zu behandelne Material zu stark zu durchfeuchten. Darüber hinaus wird es häufig für die Herstellung von Polymerlösungen für Klebungen, Tränkungen oder Schutzüberzüge verwendet. Aceton ist akut gesundheitsgefährdend und sollte stets mit den nötigen Sicherheitsvorkehrungen verwendet werden.
in scheme: Konservierungs- und Restaurierungsfachthesaurus für archäologische Kulturgüter
pref label: acetone
  type: Label
  rank: normal
pref label: Aceton
  type: Label
  rank: preferred

Wasser
type: Concept
notation: DFD1B7
created: 2026-01-30
issued: 2026-01-30
modified: 2026-02-04
publisher: Leibniz-Zentrum für Archäologie (LEIZA)
broader: Lösungsmittel
broader transitive: Konservierungs- und Restaurierungsmaterialien
broader transitive: Lösungsmittel
broader transitive: Maßnahme
definition: natürlich vorkommende, klare Flüssigkeit mit dem chemischen Symbol H2O. In der Konservierung und Restaurierung wird Wasser in verschiedenen Reinheitsgraden als universelles Lösungs- bzw. Reinigungsmittel verwendet, das aufgrund seiner Polarität und chemischen Neutralität für die schonende Entfernung von Schmutz, Ablagerungen und löslichen Salzen geeignet ist. Es kann dabei in reiner Form oder als Bestandteiler einer wässrigen Lösung mit anderen chemischen Substanzen angewandt werden, um die spezifischen Bedürfnisse verschiedener Materialien zu erfüllen. Bei unsachgemäßer Anwendung kann Wasser jedoch auch zu Schädigungen von wasserempfindlichen Materialien oder zur Förderung von Korrosion führen.
definition:
  literal form: natürlich vorkommende, klare Flüssigkeit mit dem chemischen Symbol H2O. In der Konservierung und Restaurierung wird Wasser in verschiedenen Reinheitsgraden als universelles Lösungs- bzw. Reinigungsmittel verwendet, das aufgrund seiner Polarität und chemischen Neutralität für die schonende Entfernung von Schmutz, Ablagerungen und löslichen Salzen geeignet ist. Es kann dabei in reiner Form oder als Bestandteiler einer wässrigen Lösung mit anderen chemischen Substanzen angewandt werden, um die spezifischen Bedürfnisse verschiedener Materialien zu erfüllen. Bei unsachgemäßer Anwendung kann Wasser jedoch auch zu Schädigungen von wasserempfindlichen Materialien oder zur Förderung von Korrosion führen.
in scheme: Konservierungs- und Restaurierungsfachthesaurus für archäologische Kulturgüter
pref label: Wasser
  type: Label
  rank: preferred
narrower: Destilliertes Wasser
narrower: Demineralisiertes Wasser

Siedegrenzbenzin
type: Concept
notation: G34563
preferred label: white spirit @en
created: 2026-01-30
issued: 2026-01-30
modified: 2026-02-04
publisher: Leibniz-Zentrum für Archäologie (LEIZA)
broader: Lösungsmittel
broader transitive: Konservierungs- und Restaurierungsmaterialien
broader transitive: Lösungsmittel
broader transitive: Maßnahme
definition: leichtflüchtige, klare Flüssigkeit mit charakteristisch benzinartigem Geruch. Je nach Produkt können unterschiedliche Zusammensetzungen aus aliphatischen und aromatischen Kohlenwasserstoffen enthalten sein, die zu spezifischen physikalischen und chemischen Eigenschaften führen. In der Restaurierung wird Siedegrenzbenzin aufgrund seiner Eigenschaften als unpolares Lösungsmittel zur Reinigung/Entfernung von apolaren Stoffen, zur Entfettung von Oberflächen, sowie zur Herstellung von Lösungen verwendet.
definition:
  literal form: leichtflüchtige, klare Flüssigkeit mit charakteristisch benzinartigem Geruch. Je nach Produkt können unterschiedliche Zusammensetzungen aus aliphatischen und aromatischen Kohlenwasserstoffen enthalten sein, die zu spezifischen physikalischen und chemischen Eigenschaften führen. In der Restaurierung wird Siedegrenzbenzin aufgrund seiner Eigenschaften als unpolares Lösungsmittel zur Reinigung/Entfernung von apolaren Stoffen, zur Entfettung von Oberflächen, sowie zur Herstellung von Lösungen verwendet.
in scheme: Konservierungs- und Restaurierungsfachthesaurus für archäologische Kulturgüter
pref label: Siedegrenzbenzin
  type: Label
  rank: preferred
pref label: white spirit
  type: Label
  rank: normal
alternative label: Leichtbenzin
alternative label: Reinigungsbenzin
alternative label: Terpentinersatz
alternative label: Waschbenzin
alt label: Reinigungsbenzin
  type: Label
  rank: preferred
alt label: Waschbenzin
  type: Label
  rank: normal
alt label: Terpentinersatz
  type: Label
  rank: normal
alt label: Leichtbenzin
  type: Label
  rank: normal
narrower: Shellsol A
narrower: Shellsol T

Propylacetat
type: Concept
notation: G46243
created: 2026-01-30
issued: 2026-01-30
modified: 2026-02-04
publisher: Leibniz-Zentrum für Archäologie (LEIZA)
broader: Lösungsmittel
broader transitive: Konservierungs- und Restaurierungsmaterialien
broader transitive: Maßnahme
broader transitive: Lösungsmittel
definition: farbloses, flüchtiges Lösungsmittel aus der Gruppe der Ester mit einem fruchtigen Geruch und der chemischen Formel C5H10O2. Es wird in der Konservierung und Restaurierung als Lösungsmittel für verschiedene organische Verbindungen eingesetzt, z.B. zur Herstellung von Kleb- oder Festigungsmitteln. Von dem Stoff gehen akute und chronische Gesundheitsgefahren aus, sodass bei dessen Verwendung die üblichen Sicherheitsvorkehrungen einzuhalten sind.
definition:
  literal form: farbloses, flüchtiges Lösungsmittel aus der Gruppe der Ester mit einem fruchtigen Geruch und der chemischen Formel C5H10O2. Es wird in der Konservierung und Restaurierung als Lösungsmittel für verschiedene organische Verbindungen eingesetzt, z.B. zur Herstellung von Kleb- oder Festigungsmitteln. Von dem Stoff gehen akute und chronische Gesundheitsgefahren aus, sodass bei dessen Verwendung die üblichen Sicherheitsvorkehrungen einzuhalten sind.
in scheme: Konservierungs- und Restaurierungsfachthesaurus für archäologische Kulturgüter
pref label: Propylacetat
  type: Label
  rank: preferred
alternative label: Essigsäurepropylester
alt label: Essigsäurepropylester
  type: Label
  rank: preferred

Coloradol
type: Concept
notation: GGD87G
created: 2026-01-30
issued: 2026-01-30
modified: 2026-02-04
publisher: Leibniz-Zentrum für Archäologie (LEIZA)
broader: Lösungsmittel
broader transitive: Konservierungs- und Restaurierungsmaterialien
broader transitive: Lösungsmittel
broader transitive: Maßnahme
definition: Produktname eines Lösungsmittelgemisches der Firma Ehserchemie GmbH bestehen aus Dichlormethan und Methanol. Aufgrund des starken organischen Lösungsmittels Dichlormethan, dessen Effektivität von Methanol noch unterstützt wird, ist Coloradol in der Lage ausgehärtete Epoxidharze aufzulösen bzw. soweit zu schwächen, dass sie entfernt werden können. Entsprechend wird Coloradol für die Lösung bzw. Entfernung von Epoxidsharz-Klebungen verwendet. Allerdings gehen höchste Gesundheitsgefahren von den Bestandteilen des Coloradols aus, sodass dessen Verwendung auf ein Minimum begrenzt werden sollte.
definition:
  literal form: Produktname eines Lösungsmittelgemisches der Firma Ehserchemie GmbH bestehen aus Dichlormethan und Methanol. Aufgrund des starken organischen Lösungsmittels Dichlormethan, dessen Effektivität von Methanol noch unterstützt wird, ist Coloradol in der Lage ausgehärtete Epoxidharze aufzulösen bzw. soweit zu schwächen, dass sie entfernt werden können. Entsprechend wird Coloradol für die Lösung bzw. Entfernung von Epoxidsharz-Klebungen verwendet. Allerdings gehen höchste Gesundheitsgefahren von den Bestandteilen des Coloradols aus, sodass dessen Verwendung auf ein Minimum begrenzt werden sollte.
in scheme: Konservierungs- und Restaurierungsfachthesaurus für archäologische Kulturgüter
pref label: Coloradol
  type: Label
  rank: preferred

Klebungen entfernt
type: Concept
notation: CA59C2
preferred label: removal of adhesives @en
created: 2026-01-30
issued: 2026-01-30
modified: 2026-02-04
publisher: Leibniz-Zentrum für Archäologie (LEIZA)
broader: frühere Restaurierungsmaterialien entfernt
broader transitive: frühere Restaurierungsmaterialien entfernt
broader transitive: Restaurierung
broader transitive: Maßnahme
broader transitive: Überarbeitung
broader transitive: [Behandlungsmethode]
definition: Methode, bei der zu einem früheren Zeitpunkt durchgeführte Klebungen gelöst und die verbliebenen Klebstoffreste entfernt werden.
in scheme: Konservierungs- und Restaurierungsfachthesaurus für archäologische Kulturgüter
pref label: Klebungen entfernt
  type: Label
  rank: preferred
pref label: removal of adhesives
  type: Label
  rank: normal

Ergänzungsmaterialien entfernt
type: Concept
notation: FGBB54
preferred label: removal of filling materials @en
created: 2026-01-30
issued: 2026-01-30
modified: 2026-02-04
publisher: Leibniz-Zentrum für Archäologie (LEIZA)
broader: frühere Restaurierungsmaterialien entfernt
broader transitive: frühere Restaurierungsmaterialien entfernt
broader transitive: Restaurierung
broader transitive: Maßnahme
broader transitive: Überarbeitung
broader transitive: [Behandlungsmethode]
definition: Methode, bei der zu einem früheren Zeitpunkt ausgeführte Ergänzungsarbeiten aus dem Objekt heraus gelöst und entfernt werden.
in scheme: Konservierungs- und Restaurierungsfachthesaurus für archäologische Kulturgüter
pref label: Ergänzungsmaterialien entfernt
  type: Label
  rank: preferred
pref label: removal of filling materials
  type: Label
  rank: normal

Silber
type: Concept
notation: F135A8
preferred label: silver @en
created: 2026-01-30
issued: 2026-01-30
modified: 2026-02-05
publisher: Leibniz-Zentrum für Archäologie (LEIZA)
broader: Edelmetall
broader transitive: [Untersuchungsergebnisse]
broader transitive: Zustandserfassung
broader transitive: Objektuntersuchung
broader transitive: Material
broader transitive: Metall
broader transitive: reines Metall
broader transitive: Materialbestimmung
broader transitive: Edelmetall
in scheme: Konservierungs- und Restaurierungsfachthesaurus für archäologische Kulturgüter
pref label: Silber
  type: Label
  rank: preferred
pref label: silver
  type: Label
  rank: normal
definition: weißlich-graues Metall mit dem chemischen Symbol Ag und der Ordnungszahl 47. Gehört, ebenso wie Gold und Kupfer, zu den ersten Metallen die von den Menschen verarbeitet wurde. Silber wurde als edler metallischer Werkstoff aufgrund seiner guten Verarbeitbarkeit, hohen Korrosionsbeständigkeit im Vergleich zu anderen Metallen und seiner reinen warm-glänzenden Erscheinung seit der Antike für Münzen, Schmuck und zeremonielle Gegenstände genutzt. Im Vergleich zu Gold war Silber überdies häufiger verfügbar. Als Edelmetall ist es relativ beständig gegen Korrosion, wird jedoch von Luftsauerstoff, Schwefel und chloridhaltigen Lösungen (z.B. in stark chloridhaltigen Böden) unter Bildung von Silberoxid, Silbersulfid und/oder Silberchlorid angegriffen.
definition:
  literal form: weißlich-graues Metall mit dem chemischen Symbol Ag und der Ordnungszahl 47. Gehört, ebenso wie Gold und Kupfer, zu den ersten Metallen die von den Menschen verarbeitet wurde. Silber wurde als edler metallischer Werkstoff aufgrund seiner guten Verarbeitbarkeit, hohen Korrosionsbeständigkeit im Vergleich zu anderen Metallen und seiner reinen warm-glänzenden Erscheinung seit der Antike für Münzen, Schmuck und zeremonielle Gegenstände genutzt. Im Vergleich zu Gold war Silber überdies häufiger verfügbar. Als Edelmetall ist es relativ beständig gegen Korrosion, wird jedoch von Luftsauerstoff, Schwefel und chloridhaltigen Lösungen (z.B. in stark chloridhaltigen Böden) unter Bildung von Silberoxid, Silbersulfid und/oder Silberchlorid angegriffen.

Edelmetall
type: Concept
notation: FGA46A
preferred label: nobel metal @en
created: 2026-01-30
issued: 2026-01-30
modified: 2026-02-04
publisher: Leibniz-Zentrum für Archäologie (LEIZA)
broader: reines Metall
broader transitive: Material
broader transitive: Materialbestimmung
broader transitive: [Untersuchungsergebnisse]
broader transitive: Zustandserfassung
broader transitive: Objektuntersuchung
broader transitive: Metall
broader transitive: reines Metall
definition: korrosionsbeständiges Metall, das aufgrund seiner chemischen und physikalischen Eigenschaften und ästhetischen Qualitäten hochgeschätzt wird.
in scheme: Konservierungs- und Restaurierungsfachthesaurus für archäologische Kulturgüter
pref label: Edelmetall
  type: Label
  rank: preferred
pref label: nobel metal
  type: Label
  rank: normal
alternative label: Edelmetalle
narrower: Silber
narrower: Gold
alt label: Edelmetalle
  type: Label
  rank: preferred

Gold
type: Concept
notation: FD5149
preferred label: gold @en
created: 2026-01-30
issued: 2026-01-30
modified: 2026-02-04
publisher: Leibniz-Zentrum für Archäologie (LEIZA)
broader: Edelmetall
broader transitive: [Untersuchungsergebnisse]
broader transitive: Zustandserfassung
broader transitive: Objektuntersuchung
broader transitive: Material
broader transitive: Metall
broader transitive: reines Metall
broader transitive: Materialbestimmung
broader transitive: Edelmetall
in scheme: Konservierungs- und Restaurierungsfachthesaurus für archäologische Kulturgüter
pref label: Gold
  type: Label
  rank: preferred
pref label: gold
  type: Label
  rank: normal
definition: gelbes Metall mit dem chemischen Symbol Au und der Ordnungszahl 79. Gehört zu den ersten Metallen, die in der frühen Menschheitsgeschichte verarbeitet wurden. Aufgrund seiner Seltenheit, der guten Bearbeitbarkeit sowie der schönen Farbe und dem auffälligen Glanz wird Gold seit Jahrtausenden für Schmuck und Prestigeobjekte verwendet. Durch die hohe Korrosionsbeständigkeit sind an Goldobjekten kaum materialbezogene, konservatorische Maßnahmen notwendig.
definition:
  literal form: gelbes Metall mit dem chemischen Symbol Au und der Ordnungszahl 79. Gehört zu den ersten Metallen, die in der frühen Menschheitsgeschichte verarbeitet wurden. Aufgrund seiner Seltenheit, der guten Bearbeitbarkeit sowie der schönen Farbe und dem auffälligen Glanz wird Gold seit Jahrtausenden für Schmuck und Prestigeobjekte verwendet. Durch die hohe Korrosionsbeständigkeit sind an Goldobjekten kaum materialbezogene, konservatorische Maßnahmen notwendig.

Kupfer
type: Concept
notation: B28FA6
preferred label: copper @en
created: 2026-01-30
issued: 2026-01-30
modified: 2026-02-04
publisher: Leibniz-Zentrum für Archäologie (LEIZA)
broader: Buntmetall
broader transitive: [Untersuchungsergebnisse]
broader transitive: Zustandserfassung
broader transitive: Objektuntersuchung
broader transitive: Buntmetall
broader transitive: Material
broader transitive: Metall
broader transitive: Unedelmetall
broader transitive: reines Metall
broader transitive: Materialbestimmung
in scheme: Konservierungs- und Restaurierungsfachthesaurus für archäologische Kulturgüter
pref label: Kupfer
  type: Label
  rank: preferred
pref label: copper
  type: Label
  rank: normal
alternative label: Cu
alternative label: reines Kupfer
definition: rot-bräunliches Metall mit dem chemischen Symbol Cu und der Ordnungszahl 29. Kupfer war wohl das erstes Metall, dass von den Menschen gezielt hergestellt und verarbeitet wurde. Kupfer ist in feuchter, verunreinigter Luft, sowie in chloridbelasteten Böden recht korrossionsanfällig. Mit den Bestandteilen der Luft (u.a. Schwefel- oder Carbonatverbindungen) bildet es eine Patina, die als Schutzschicht für das darunterliegende Metall gegenüber weiterem Korrosionsangriff dient. Diese Patina kann dem Objekt unter umständen ein recht ästhetisches Erscheinungsbild verleihen (sog. "Edelpatina").
definition:
  literal form: rot-bräunliches Metall mit dem chemischen Symbol Cu und der Ordnungszahl 29. Kupfer war wohl das erstes Metall, dass von den Menschen gezielt hergestellt und verarbeitet wurde. Kupfer ist in feuchter, verunreinigter Luft, sowie in chloridbelasteten Böden recht korrossionsanfällig. Mit den Bestandteilen der Luft (u.a. Schwefel- oder Carbonatverbindungen) bildet es eine Patina, die als Schutzschicht für das darunterliegende Metall gegenüber weiterem Korrosionsangriff dient. Diese Patina kann dem Objekt unter umständen ein recht ästhetisches Erscheinungsbild verleihen (sog. "Edelpatina").
alt label: Cu
  type: Label
  rank: preferred
alt label: reines Kupfer
  type: Label
  rank: normal

Eisen
type: Concept
notation: F71C6B
preferred label: fer @fr
preferred label: iron @en
created: 2026-01-30
issued: 2026-01-30
modified: 2026-02-04
publisher: Leibniz-Zentrum für Archäologie (LEIZA)
broader: Unedelmetall
broader transitive: [Untersuchungsergebnisse]
broader transitive: Zustandserfassung
broader transitive: Objektuntersuchung
broader transitive: Material
broader transitive: Metall
broader transitive: Unedelmetall
broader transitive: reines Metall
broader transitive: Materialbestimmung
in scheme: Konservierungs- und Restaurierungsfachthesaurus für archäologische Kulturgüter
pref label: Eisen
  type: Label
  rank: preferred
pref label: iron
  type: Label
  rank: normal
pref label: fer
  type: Label
  rank: normal
alternative label: Fe
definition: bläulich-gräuliches Metall mit dem chemischen Symbol Fe und der Ordnungszahl 26. Im archäologischen Kontext kommen in der Regel ausschließlich Eisen-Kohlenstoff-Legierungen vor, sodass reines Eisen kaum eine Rolle in der Restaurierung spielt. Eisen ist sehr unedel und neigt sowohl an der Luft, als auch bei der Bodenlagerung zu starken Korrosionsreaktionen.
definition:
  literal form: bläulich-gräuliches Metall mit dem chemischen Symbol Fe und der Ordnungszahl 26. Im archäologischen Kontext kommen in der Regel ausschließlich Eisen-Kohlenstoff-Legierungen vor, sodass reines Eisen kaum eine Rolle in der Restaurierung spielt. Eisen ist sehr unedel und neigt sowohl an der Luft, als auch bei der Bodenlagerung zu starken Korrosionsreaktionen.
alt label: Fe
  type: Label
  rank: preferred

Zink
type: Concept
notation: G8AG1C
preferred label: zinc @en
created: 2026-01-30
issued: 2026-01-30
modified: 2026-02-04
publisher: Leibniz-Zentrum für Archäologie (LEIZA)
broader: Buntmetall
broader transitive: [Untersuchungsergebnisse]
broader transitive: Zustandserfassung
broader transitive: Objektuntersuchung
broader transitive: Buntmetall
broader transitive: Material
broader transitive: Metall
broader transitive: Unedelmetall
broader transitive: reines Metall
broader transitive: Materialbestimmung
in scheme: Konservierungs- und Restaurierungsfachthesaurus für archäologische Kulturgüter
pref label: Zink
  type: Label
  rank: preferred
pref label: zinc
  type: Label
  rank: normal
definition: bläulich-weißes Metall mit dem chemischen Symbol Zn und der Ordnungszahl 30. Zink wurde in der Antike hauptsächlich als Erz bei der Kupferverhüttung bzw. -legierung verarbeitet. Erst im späten Mittelalter wird Zink gezielt als reines Metall hergestellt.
definition:
  literal form: bläulich-weißes Metall mit dem chemischen Symbol Zn und der Ordnungszahl 30. Zink wurde in der Antike hauptsächlich als Erz bei der Kupferverhüttung bzw. -legierung verarbeitet. Erst im späten Mittelalter wird Zink gezielt als reines Metall hergestellt.

Blei
type: Concept
notation: G992B6
preferred label: lead @en
created: 2026-01-30
issued: 2026-01-30
modified: 2026-02-04
publisher: Leibniz-Zentrum für Archäologie (LEIZA)
broader: Buntmetall
broader transitive: [Untersuchungsergebnisse]
broader transitive: Zustandserfassung
broader transitive: Objektuntersuchung
broader transitive: Buntmetall
broader transitive: Material
broader transitive: Metall
broader transitive: Unedelmetall
broader transitive: reines Metall
broader transitive: Materialbestimmung
in scheme: Konservierungs- und Restaurierungsfachthesaurus für archäologische Kulturgüter
pref label: Blei
  type: Label
  rank: preferred
pref label: lead
  type: Label
  rank: normal
definition: sehr weiches Metall, von bläulich-gräulicher Farbe mit dem chemischen Symbol Pb und der Ordnungszahl 82. Gehört zur Gruppe der Schwermetalle und wirkt giftig auf den menschlichen Körper. Wurde in der Antike sowohl für eigenständige Objektherstellung, als auch in Pigmenten und Glasuren sowie Legierungen mit anderen Metallen verwendet. Blei läuft an der Luft unter Bildung einer passivierenden Oxidschicht an und ist auch bei Kontak mit Wasser oder Säuren stark korrosionsanfällig.
definition:
  literal form: sehr weiches Metall, von bläulich-gräulicher Farbe mit dem chemischen Symbol Pb und der Ordnungszahl 82. Gehört zur Gruppe der Schwermetalle und wirkt giftig auf den menschlichen Körper. Wurde in der Antike sowohl für eigenständige Objektherstellung, als auch in Pigmenten und Glasuren sowie Legierungen mit anderen Metallen verwendet. Blei läuft an der Luft unter Bildung einer passivierenden Oxidschicht an und ist auch bei Kontak mit Wasser oder Säuren stark korrosionsanfällig.

Leinwandbindung
type: Concept
notation: CF39DD
preferred label: tabby weave @en
created: 2026-01-30
issued: 2026-01-30
modified: 2026-02-04
publisher: Leibniz-Zentrum für Archäologie (LEIZA)
alternative label: Taftbindung
alternative label: Tuchbindung
broader: gewebt
broader transitive: Fügetechnik
broader transitive: [Untersuchungsergebnisse]
broader transitive: Zustandserfassung
broader transitive: Objektuntersuchung
broader transitive: Technologische Auswertung
broader transitive: Herstellungstechnik
broader transitive: gewebt
in scheme: Konservierungs- und Restaurierungsfachthesaurus für archäologische Kulturgüter
alt label: Taftbindung
  type: Label
  rank: preferred
alt label: Tuchbindung
  type: Label
  rank: normal
pref label: Leinwandbindung
  type: Label
  rank: preferred
pref label: tabby weave
  type: Label
  rank: normal
definition: einfache Grundbindung in der Webtechnik, bei der jeder Schussfaden abwechselnd über und unter den Kettfäden verläuft. Diese dichte Verkreuzung sorgt für eine gleichmäßige, strapazierfähige Gewebestruktur mit hoher Reißfestigkeit. Aufgrund ihrer Robustheit und Vielseitigkeit wird die Leinwandbindung für eine Vielzahl von Textilien verwendet, darunter Baumwollstoffe, Leinen, Seide und technische Gewebe.
definition:
  literal form: einfache Grundbindung in der Webtechnik, bei der jeder Schussfaden abwechselnd über und unter den Kettfäden verläuft. Diese dichte Verkreuzung sorgt für eine gleichmäßige, strapazierfähige Gewebestruktur mit hoher Reißfestigkeit. Aufgrund ihrer Robustheit und Vielseitigkeit wird die Leinwandbindung für eine Vielzahl von Textilien verwendet, darunter Baumwollstoffe, Leinen, Seide und technische Gewebe.

Köperbindung
type: Concept
notation: DD149D
preferred label: twill weave @en
created: 2026-01-30
issued: 2026-01-30
modified: 2026-02-04
publisher: Leibniz-Zentrum für Archäologie (LEIZA)
broader: gewebt
broader transitive: Fügetechnik
broader transitive: [Untersuchungsergebnisse]
broader transitive: Zustandserfassung
broader transitive: Objektuntersuchung
broader transitive: Technologische Auswertung
broader transitive: Herstellungstechnik
broader transitive: gewebt
definition: textile Grundbindung, die durch eine diagonale Struktur im Gewebe gekennzeichnet ist. Sie entsteht, indem der Schussfaden in einem regelmäßigen Versatz über mindestens zwei Kettfäden hinweggeführt und dann unter mindestens einen Kettfaden hindurchgeführt wird.
definition:
  literal form: textile Grundbindung, die durch eine diagonale Struktur im Gewebe gekennzeichnet ist. Sie entsteht, indem der Schussfaden in einem regelmäßigen Versatz über mindestens zwei Kettfäden hinweggeführt und dann unter mindestens einen Kettfaden hindurchgeführt wird.
in scheme: Konservierungs- und Restaurierungsfachthesaurus für archäologische Kulturgüter
pref label: Köperbindung
  type: Label
  rank: preferred
pref label: twill weave
  type: Label
  rank: normal

Kompositbindung
type: Concept
notation: FB7AB6
preferred label: compound weave @en
created: 2026-01-30
issued: 2026-01-30
modified: 2026-02-04
publisher: Leibniz-Zentrum für Archäologie (LEIZA)
alternative label: abgeleitete Bindung
alternative label: zusammengesetzte Bindung
broader: gewebt
broader transitive: Fügetechnik
broader transitive: [Untersuchungsergebnisse]
broader transitive: Zustandserfassung
broader transitive: Objektuntersuchung
broader transitive: Technologische Auswertung
broader transitive: Herstellungstechnik
broader transitive: gewebt
definition: Gewebebindung, die sich auch verschiedenen Grundbindungsprinzipien und deren Ableitungen oder aus einem Grundgewebe und zusätzlichen Fadensystemen zusammensetzen.
in scheme: Konservierungs- und Restaurierungsfachthesaurus für archäologische Kulturgüter
alt label: zusammengesetzte Bindung
  type: Label
  rank: preferred
alt label: abgeleitete Bindung
  type: Label
  rank: normal
pref label: Kompositbindung
  type: Label
  rank: preferred
pref label: compound weave
  type: Label
  rank: normal

Atlasbindung
type: Concept
notation: FF5836
preferred label: satin weave @en
created: 2026-01-30
issued: 2026-01-30
modified: 2026-02-04
publisher: Leibniz-Zentrum für Archäologie (LEIZA)
alternative label: Satinbindung
broader: gewebt
broader transitive: Fügetechnik
broader transitive: [Untersuchungsergebnisse]
broader transitive: Zustandserfassung
broader transitive: Objektuntersuchung
broader transitive: Technologische Auswertung
broader transitive: Herstellungstechnik
broader transitive: gewebt
definition: textile Grundbindung, bei der die Verkreuzung von Kett- und Schussfäden eine glatte und glänzende Oberfläche erzeugt. Diese entsteht, indem der Schussfaden über mindestens vier Kettfäden hinweg verläuft um dann mit dem fünften Kettfaden zu binden. Die Bindungspunkte liegen dabei weit auseinander ohne sich zu berühren, wordurch sich eine äußerst dichte, weich fließende Struktur ergibt.
definition:
  literal form: textile Grundbindung, bei der die Verkreuzung von Kett- und Schussfäden eine glatte und glänzende Oberfläche erzeugt. Diese entsteht, indem der Schussfaden über mindestens vier Kettfäden hinweg verläuft um dann mit dem fünften Kettfaden zu binden. Die Bindungspunkte liegen dabei weit auseinander ohne sich zu berühren, wordurch sich eine äußerst dichte, weich fließende Struktur ergibt.
in scheme: Konservierungs- und Restaurierungsfachthesaurus für archäologische Kulturgüter
alt label: Satinbindung
  type: Label
  rank: preferred
pref label: Atlasbindung
  type: Label
  rank: preferred
pref label: satin weave
  type: Label
  rank: normal

Ripsbindung
type: Concept
notation: G49676
created: 2026-01-30
issued: 2026-01-30
modified: 2026-02-04
publisher: Leibniz-Zentrum für Archäologie (LEIZA)
alternative label: Cannelébindung
alternative label: Reps
alternative label: Rips
broader: gewebt
broader transitive: Fügetechnik
broader transitive: [Untersuchungsergebnisse]
broader transitive: Zustandserfassung
broader transitive: Objektuntersuchung
broader transitive: Technologische Auswertung
broader transitive: Herstellungstechnik
broader transitive: gewebt
definition: Abwandlung der Leinwandbindung, bei der durch eine gezielte Variation der Kett- oder Schussfäden eine gerippte Struktur entsteht, bei der nur eines der Fadensysteme sichtbar erscheint. Diese Rippen verlaufen entweder in Längsrichtung (Kettenrips) oder in Querrichtung (Schussrips) und verleihen dem Gewebe eine höhere Festigkeit sowie eine markante Oberflächenstruktur
definition:
  literal form: Abwandlung der Leinwandbindung, bei der durch eine gezielte Variation der Kett- oder Schussfäden eine gerippte Struktur entsteht, bei der nur eines der Fadensysteme sichtbar erscheint. Diese Rippen verlaufen entweder in Längsrichtung (Kettenrips) oder in Querrichtung (Schussrips) und verleihen dem Gewebe eine höhere Festigkeit sowie eine markante Oberflächenstruktur
in scheme: Konservierungs- und Restaurierungsfachthesaurus für archäologische Kulturgüter
alt label: Rips
  type: Label
  rank: preferred
alt label: Reps
  type: Label
  rank: normal
alt label: Cannelébindung
  type: Label
  rank: normal
pref label: Ripsbindung
  type: Label
  rank: preferred

geknüpft
type: Concept
notation: C79172
created: 2026-01-30
issued: 2026-01-30
modified: 2026-02-04
publisher: Leibniz-Zentrum für Archäologie (LEIZA)
alternative label: Knüpfen
broader: geknotet
broader transitive: Fügetechnik
broader transitive: [Untersuchungsergebnisse]
broader transitive: Zustandserfassung
broader transitive: Objektuntersuchung
broader transitive: Technologische Auswertung
broader transitive: Herstellungstechnik
broader transitive: geknotet
definition: spezielle Knotentechnik zur Stoffbildung, bei der Fäden in einer systematischen sich wiederholenden Anordnung so miteinander oder in bestehende Grundgewebe verknotet werden, dass Muster und/oder flächige textile Strukturen entstehen.
definition:
  literal form: spezielle Knotentechnik zur Stoffbildung, bei der Fäden in einer systematischen sich wiederholenden Anordnung so miteinander oder in bestehende Grundgewebe verknotet werden, dass Muster und/oder flächige textile Strukturen entstehen.
in scheme: Konservierungs- und Restaurierungsfachthesaurus für archäologische Kulturgüter
alt label: Knüpfen
  type: Label
  rank: preferred
pref label: geknüpft
  type: Label
  rank: preferred

gedengelt
type: Concept
notation: A8B581
created: 2026-01-30
issued: 2026-01-30
modified: 2026-02-04
publisher: Leibniz-Zentrum für Archäologie (LEIZA)
alternative label: Dengeln
broader: formgebende Technik
broader transitive: formgebende Technik
broader transitive: [Untersuchungsergebnisse]
broader transitive: Zustandserfassung
broader transitive: Objektuntersuchung
broader transitive: Technologische Auswertung
broader transitive: Herstellungstechnik
in scheme: Konservierungs- und Restaurierungsfachthesaurus für archäologische Kulturgüter
alt label: Dengeln
  type: Label
  rank: preferred
pref label: gedengelt
  type: Label
  rank: preferred

geprägt
type: Concept
notation: A8C667
created: 2026-01-30
issued: 2026-01-30
modified: 2026-02-04
publisher: Leibniz-Zentrum für Archäologie (LEIZA)
alternative label: Prägen
alternative label: Prägung
broader: formgebende Technik
broader transitive: formgebende Technik
broader transitive: [Untersuchungsergebnisse]
broader transitive: Zustandserfassung
broader transitive: Objektuntersuchung
broader transitive: Technologische Auswertung
broader transitive: Herstellungstechnik
definition: formgebende Technik, bei der ein Material durch Druck mechanisch verformt wird, um eine reliefartige Strukur oder Muster zu erzeugen. Dabei wird ein Stempel, welcher entsprechend des Negativmotives ausgearbeitet ist, in das Material eingedrückt, wodurch sich dessen Materialstärke verändert. Das Relief kann einseitig oder beidseitig aufgepräft werden.
definition:
  literal form: formgebende Technik, bei der ein Material durch Druck mechanisch verformt wird, um eine reliefartige Strukur oder Muster zu erzeugen. Dabei wird ein Stempel, welcher entsprechend des Negativmotives ausgearbeitet ist, in das Material eingedrückt, wodurch sich dessen Materialstärke verändert. Das Relief kann einseitig oder beidseitig aufgepräft werden.
in scheme: Konservierungs- und Restaurierungsfachthesaurus für archäologische Kulturgüter
alt label: Prägen
  type: Label
  rank: preferred
alt label: Prägung
  type: Label
  rank: normal
pref label: geprägt
  type: Label
  rank: preferred

gebohrt
type: Concept
notation: AC319F
preferred label: drilling @en
created: 2026-01-30
issued: 2026-01-30
modified: 2026-02-04
publisher: Leibniz-Zentrum für Archäologie (LEIZA)
alternative label: Bohren
alternative label: Bohrung
broader: formgebende Technik
broader transitive: formgebende Technik
broader transitive: [Untersuchungsergebnisse]
broader transitive: Zustandserfassung
broader transitive: Objektuntersuchung
broader transitive: Technologische Auswertung
broader transitive: Herstellungstechnik
definition: spangebendes Fertigungsverfahren, bei dem mit einem rotierenden Werkzeug (Bohrer) zylindrische Löcher in ein Werkstück eingebracht werden. Dabei wird Material durch eine Kombination aus Vorschubbewegung und Rotation des Bohrers entfernt. Es ist ein grundlegendes Verfahren zur Herstellung von Öffnungen in Metall, Holz, Kunststoff oder anderen Materialien.
definition:
  literal form: spangebendes Fertigungsverfahren, bei dem mit einem rotierenden Werkzeug (Bohrer) zylindrische Löcher in ein Werkstück eingebracht werden. Dabei wird Material durch eine Kombination aus Vorschubbewegung und Rotation des Bohrers entfernt. Es ist ein grundlegendes Verfahren zur Herstellung von Öffnungen in Metall, Holz, Kunststoff oder anderen Materialien.
in scheme: Konservierungs- und Restaurierungsfachthesaurus für archäologische Kulturgüter
alt label: Bohren
  type: Label
  rank: normal
alt label: Bohrung
  type: Label
  rank: preferred
pref label: gebohrt
  type: Label
  rank: preferred
pref label: drilling
  type: Label
  rank: normal

gewickelt
type: Concept
notation: ACA175
created: 2026-01-30
issued: 2026-01-30
modified: 2026-02-04
publisher: Leibniz-Zentrum für Archäologie (LEIZA)
broader: formgebende Technik
broader transitive: formgebende Technik
broader transitive: [Untersuchungsergebnisse]
broader transitive: Zustandserfassung
broader transitive: Objektuntersuchung
broader transitive: Technologische Auswertung
broader transitive: Herstellungstechnik
in scheme: Konservierungs- und Restaurierungsfachthesaurus für archäologische Kulturgüter
pref label: gewickelt
  type: Label
  rank: preferred
alternative label: Wickelung
alt label: Wickelung
  type: Label
  rank: preferred

gepresst
type: Concept
notation: ACG977
created: 2026-01-30
issued: 2026-01-30
modified: 2026-02-04
publisher: Leibniz-Zentrum für Archäologie (LEIZA)
alternative label: Pressen
alternative label: Pressung
broader: formgebende Technik
broader transitive: formgebende Technik
broader transitive: [Untersuchungsergebnisse]
broader transitive: Zustandserfassung
broader transitive: Objektuntersuchung
broader transitive: Technologische Auswertung
broader transitive: Herstellungstechnik
in scheme: Konservierungs- und Restaurierungsfachthesaurus für archäologische Kulturgüter
alt label: Pressen
  type: Label
  rank: preferred
alt label: Pressung
  type: Label
  rank: normal
pref label: gepresst
  type: Label
  rank: preferred

gespalten
type: Concept
notation: ADB89D
created: 2026-01-30
issued: 2026-01-30
modified: 2026-02-04
publisher: Leibniz-Zentrum für Archäologie (LEIZA)
alternative label: Spalten
alternative label: Spaltung
broader: formgebende Technik
broader transitive: formgebende Technik
broader transitive: [Untersuchungsergebnisse]
broader transitive: Zustandserfassung
broader transitive: Objektuntersuchung
broader transitive: Technologische Auswertung
broader transitive: Herstellungstechnik
definition: Trennvorgang an Materialen (z.B Holz, Stein) oft unter Nutzung natürlicher Schwachstellen/Wachstumslinien/Sedimentlagern. Bei Holz wird der Spaltvorgang radial ausgeführt und folgt den Wachstumsstrukturen (Holzstrahlen). Daher werden die Holzstrahlen nicht verletzt/getrennt wie beim Sägen, das gewonnene Werkstück ist besonders stabil und bruchfest.
definition:
  literal form: Trennvorgang an Materialen (z.B Holz, Stein) oft unter Nutzung natürlicher Schwachstellen/Wachstumslinien/Sedimentlagern. Bei Holz wird der Spaltvorgang radial ausgeführt und folgt den Wachstumsstrukturen (Holzstrahlen). Daher werden die Holzstrahlen nicht verletzt/getrennt wie beim Sägen, das gewonnene Werkstück ist besonders stabil und bruchfest.
in scheme: Konservierungs- und Restaurierungsfachthesaurus für archäologische Kulturgüter
alt label: Spaltung
  type: Label
  rank: preferred
alt label: Spalten
  type: Label
  rank: normal
pref label: gespalten
  type: Label
  rank: preferred

gespitzt
type: Concept
notation: B1B854
created: 2026-01-30
issued: 2026-01-30
modified: 2026-02-04
publisher: Leibniz-Zentrum für Archäologie (LEIZA)
broader: formgebende Technik
broader transitive: formgebende Technik
broader transitive: [Untersuchungsergebnisse]
broader transitive: Zustandserfassung
broader transitive: Objektuntersuchung
broader transitive: Technologische Auswertung
broader transitive: Herstellungstechnik
in scheme: Konservierungs- und Restaurierungsfachthesaurus für archäologische Kulturgüter
pref label: gespitzt
  type: Label
  rank: preferred

nachgedreht
type: Concept
notation: B28G12
created: 2026-01-30
issued: 2026-01-30
modified: 2026-02-04
publisher: Leibniz-Zentrum für Archäologie (LEIZA)
broader: formgebende Technik
broader transitive: formgebende Technik
broader transitive: [Untersuchungsergebnisse]
broader transitive: Zustandserfassung
broader transitive: Objektuntersuchung
broader transitive: Technologische Auswertung
broader transitive: Herstellungstechnik
in scheme: Konservierungs- und Restaurierungsfachthesaurus für archäologische Kulturgüter
pref label: nachgedreht
  type: Label
  rank: preferred
alternative label: überdreht
alt label: überdreht
  type: Label
  rank: preferred

gebeilt
type: Concept
notation: B437A9
created: 2026-01-30
issued: 2026-01-30
modified: 2026-02-04
publisher: Leibniz-Zentrum für Archäologie (LEIZA)
broader: formgebende Technik
broader transitive: formgebende Technik
broader transitive: [Untersuchungsergebnisse]
broader transitive: Zustandserfassung
broader transitive: Objektuntersuchung
broader transitive: Technologische Auswertung
broader transitive: Herstellungstechnik
in scheme: Konservierungs- und Restaurierungsfachthesaurus für archäologische Kulturgüter
pref label: gebeilt
  type: Label
  rank: preferred

durchgeschlagen
type: Concept
notation: B4AFF6
created: 2026-01-30
issued: 2026-01-30
modified: 2026-02-04
publisher: Leibniz-Zentrum für Archäologie (LEIZA)
broader: formgebende Technik
broader transitive: formgebende Technik
broader transitive: [Untersuchungsergebnisse]
broader transitive: Zustandserfassung
broader transitive: Objektuntersuchung
broader transitive: Technologische Auswertung
broader transitive: Herstellungstechnik
in scheme: Konservierungs- und Restaurierungsfachthesaurus für archäologische Kulturgüter
pref label: durchgeschlagen
  type: Label
  rank: preferred

gerollt
type: Concept
notation: B4FD9B
created: 2026-01-30
issued: 2026-01-30
modified: 2026-02-04
publisher: Leibniz-Zentrum für Archäologie (LEIZA)
broader: formgebende Technik
broader transitive: formgebende Technik
broader transitive: [Untersuchungsergebnisse]
broader transitive: Zustandserfassung
broader transitive: Objektuntersuchung
broader transitive: Technologische Auswertung
broader transitive: Herstellungstechnik
in scheme: Konservierungs- und Restaurierungsfachthesaurus für archäologische Kulturgüter
pref label: gerollt
  type: Label
  rank: preferred
alternative label: Rollung
alt label: Rollung
  type: Label
  rank: preferred
narrower: Block-twisting
narrower: Strip-twisting

geschmiedet
type: Concept
notation: B64825
created: 2026-01-30
issued: 2026-01-30
modified: 2026-02-04
publisher: Leibniz-Zentrum für Archäologie (LEIZA)
alternative label: Schmieden
broader: formgebende Technik
broader transitive: formgebende Technik
broader transitive: [Untersuchungsergebnisse]
broader transitive: Zustandserfassung
broader transitive: Objektuntersuchung
broader transitive: Technologische Auswertung
broader transitive: Herstellungstechnik
definition: umformendes Fertigungsverfahren von Metall, bei dem das Werkstück durch Schläge mit einem Hammer auf einem Amboss in die gewünschte Form gebracht wird. Bei der Eisen bzw. Stahlbearbeitung bezieht sich der Begriff in der Regel auf die Bearbeitung im glühenden Zustand, während er bei Nichteisenmetallen generell für spanlose Umformarbeiten des Querschnitts, unabhängig von der Temperatur des Werkstückes, verwendet wird. Je nach angestrebter Form werden unterschiedlich geformte Hämmer und Ambosse aus verschiedenen Materialien verwendet.
definition:
  literal form: umformendes Fertigungsverfahren von Metall, bei dem das Werkstück durch Schläge mit einem Hammer auf einem Amboss in die gewünschte Form gebracht wird. Bei der Eisen bzw. Stahlbearbeitung bezieht sich der Begriff in der Regel auf die Bearbeitung im glühenden Zustand, während er bei Nichteisenmetallen generell für spanlose Umformarbeiten des Querschnitts, unabhängig von der Temperatur des Werkstückes, verwendet wird. Je nach angestrebter Form werden unterschiedlich geformte Hämmer und Ambosse aus verschiedenen Materialien verwendet.
in scheme: Konservierungs- und Restaurierungsfachthesaurus für archäologische Kulturgüter
alt label: Schmieden
  type: Label
  rank: preferred
pref label: geschmiedet
  type: Label
  rank: preferred

gemeißelt
type: Concept
notation: BA1BB6
created: 2026-01-30
issued: 2026-01-30
modified: 2026-02-04
publisher: Leibniz-Zentrum für Archäologie (LEIZA)
alternative label: Meißeln
alternative label: Meißelung
broader: formgebende Technik
broader transitive: formgebende Technik
broader transitive: [Untersuchungsergebnisse]
broader transitive: Zustandserfassung
broader transitive: Objektuntersuchung
broader transitive: Technologische Auswertung
broader transitive: Herstellungstechnik
in scheme: Konservierungs- und Restaurierungsfachthesaurus für archäologische Kulturgüter
alt label: Meißelung
  type: Label
  rank: preferred
alt label: Meißeln
  type: Label
  rank: normal
pref label: gemeißelt
  type: Label
  rank: preferred

gegossen
type: Concept
notation: BA73A2
created: 2026-01-30
issued: 2026-01-30
modified: 2026-02-04
publisher: Leibniz-Zentrum für Archäologie (LEIZA)
alternative label: Guss
broader: formgebende Technik
broader transitive: formgebende Technik
broader transitive: [Untersuchungsergebnisse]
broader transitive: Zustandserfassung
broader transitive: Objektuntersuchung
broader transitive: Technologische Auswertung
broader transitive: Herstellungstechnik
definition: Technik, bei der flüssiges Material in eine vorgefertigte Form eingefüllt oder auf eine Oberfläche aufgetragen wird. Das flüssige Material erstarrt dabei in der entsprechend vorgegebenen Form.
in scheme: Konservierungs- und Restaurierungsfachthesaurus für archäologische Kulturgüter
alt label: Guss
  type: Label
  rank: preferred
pref label: gegossen
  type: Label
  rank: preferred
narrower: Schalenguss
narrower: Guss in verlorener Form
narrower: Kokillen-Guss

gezahnt
type: Concept
notation: BAB7B3
created: 2026-01-30
issued: 2026-01-30
modified: 2026-02-04
publisher: Leibniz-Zentrum für Archäologie (LEIZA)
broader: formgebende Technik
broader transitive: formgebende Technik
broader transitive: [Untersuchungsergebnisse]
broader transitive: Zustandserfassung
broader transitive: Objektuntersuchung
broader transitive: Technologische Auswertung
broader transitive: Herstellungstechnik
in scheme: Konservierungs- und Restaurierungsfachthesaurus für archäologische Kulturgüter
pref label: gezahnt
  type: Label
  rank: preferred

gesägt
type: Concept
notation: BC92AG
created: 2026-01-30
issued: 2026-01-30
modified: 2026-02-04
publisher: Leibniz-Zentrum für Archäologie (LEIZA)
alternative label: Sägen
alternative label: Sägung
broader: formgebende Technik
broader transitive: formgebende Technik
broader transitive: [Untersuchungsergebnisse]
broader transitive: Zustandserfassung
broader transitive: Objektuntersuchung
broader transitive: Technologische Auswertung
broader transitive: Herstellungstechnik
definition: spangebendes Trennverfahren, bei dem ein Werkstück mithilfe eines sägeartigen Werkzeugs durch eine Vielzahl feiner Schneidzähne bearbeitet wird. Dabei werden durch kreisförmige oder gerade Schnittbewegungen Materialspäne entlang der Trennlinie abgetragen, um das Werkstück in die gewünschte Form oder Größe zu bringen. Dieses Verfahren eignet sich für eine Vielzahl von Materialien und wird mit unterschiedlichen Ausführungen von Werkzeugen wie Handsägen, Bandsägen oder Kreissägen durchgeführt.
definition:
  literal form: spangebendes Trennverfahren, bei dem ein Werkstück mithilfe eines sägeartigen Werkzeugs durch eine Vielzahl feiner Schneidzähne bearbeitet wird. Dabei werden durch kreisförmige oder gerade Schnittbewegungen Materialspäne entlang der Trennlinie abgetragen, um das Werkstück in die gewünschte Form oder Größe zu bringen. Dieses Verfahren eignet sich für eine Vielzahl von Materialien und wird mit unterschiedlichen Ausführungen von Werkzeugen wie Handsägen, Bandsägen oder Kreissägen durchgeführt.
in scheme: Konservierungs- und Restaurierungsfachthesaurus für archäologische Kulturgüter
alt label: Sägung
  type: Label
  rank: preferred
alt label: Sägen
  type: Label
  rank: normal
pref label: gesägt
  type: Label
  rank: preferred

gebrannt
type: Concept
notation: BGFD79
created: 2026-01-30
issued: 2026-01-30
modified: 2026-02-04
publisher: Leibniz-Zentrum für Archäologie (LEIZA)
broader: formgebende Technik
broader transitive: formgebende Technik
broader transitive: [Untersuchungsergebnisse]
broader transitive: Zustandserfassung
broader transitive: Objektuntersuchung
broader transitive: Technologische Auswertung
broader transitive: Herstellungstechnik
in scheme: Konservierungs- und Restaurierungsfachthesaurus für archäologische Kulturgüter
pref label: gebrannt
  type: Label
  rank: preferred
alternative label: Brand
narrower: reduzierender Brand
narrower: oxidierender Brand
alt label: Brand
  type: Label
  rank: preferred

geschmolzen
type: Concept
notation: C16778
created: 2026-01-30
issued: 2026-01-30
modified: 2026-02-04
publisher: Leibniz-Zentrum für Archäologie (LEIZA)
alternative label: Schmelzung
broader: formgebende Technik
broader transitive: formgebende Technik
broader transitive: [Untersuchungsergebnisse]
broader transitive: Zustandserfassung
broader transitive: Objektuntersuchung
broader transitive: Technologische Auswertung
broader transitive: Herstellungstechnik
in scheme: Konservierungs- und Restaurierungsfachthesaurus für archäologische Kulturgüter
alt label: Schmelzung
  type: Label
  rank: preferred
pref label: geschmolzen
  type: Label
  rank: preferred

geschnitten
type: Concept
notation: C1A32C
created: 2026-01-30
issued: 2026-01-30
modified: 2026-02-04
publisher: Leibniz-Zentrum für Archäologie (LEIZA)
broader: formgebende Technik
broader transitive: formgebende Technik
broader transitive: [Untersuchungsergebnisse]
broader transitive: Zustandserfassung
broader transitive: Objektuntersuchung
broader transitive: Technologische Auswertung
broader transitive: Herstellungstechnik
in scheme: Konservierungs- und Restaurierungsfachthesaurus für archäologische Kulturgüter
pref label: geschnitten
  type: Label
  rank: preferred

gefeilt
type: Concept
notation: C3FGBG
created: 2026-01-30
issued: 2026-01-30
modified: 2026-02-04
publisher: Leibniz-Zentrum für Archäologie (LEIZA)
alternative label: Feilen
alternative label: Feilung
broader: formgebende Technik
broader transitive: formgebende Technik
broader transitive: [Untersuchungsergebnisse]
broader transitive: Zustandserfassung
broader transitive: Objektuntersuchung
broader transitive: Technologische Auswertung
broader transitive: Herstellungstechnik
definition: spangebendes Formungserfahren, bei dem Material von der Oberfläche eines Werkstücks durch die wiederholte Bewegung eines Werkzeugs (Feile) mit vielen kleinen, scharfen Schneidezähnen entfernt wird. Es dient zur Formgebung oder Glättung von Werkstücken aus Metall, Holz oder Kunststoff. Als Werkzeuge für dieses Verfahren kommen eine Reihe verschieden geformter und mit feiner oder gröberen Hieb versehener Feilen zum Einsatz.
definition:
  literal form: spangebendes Formungserfahren, bei dem Material von der Oberfläche eines Werkstücks durch die wiederholte Bewegung eines Werkzeugs (Feile) mit vielen kleinen, scharfen Schneidezähnen entfernt wird. Es dient zur Formgebung oder Glättung von Werkstücken aus Metall, Holz oder Kunststoff. Als Werkzeuge für dieses Verfahren kommen eine Reihe verschieden geformter und mit feiner oder gröberen Hieb versehener Feilen zum Einsatz.
in scheme: Konservierungs- und Restaurierungsfachthesaurus für archäologische Kulturgüter
alt label: Feilung
  type: Label
  rank: preferred
alt label: Feilen
  type: Label
  rank: normal
pref label: gefeilt
  type: Label
  rank: preferred

modelliert
type: Concept
notation: C5F279
created: 2026-01-30
issued: 2026-01-30
modified: 2026-02-04
publisher: Leibniz-Zentrum für Archäologie (LEIZA)
broader: formgebende Technik
broader transitive: formgebende Technik
broader transitive: [Untersuchungsergebnisse]
broader transitive: Zustandserfassung
broader transitive: Objektuntersuchung
broader transitive: Technologische Auswertung
broader transitive: Herstellungstechnik
in scheme: Konservierungs- und Restaurierungsfachthesaurus für archäologische Kulturgüter
pref label: modelliert
  type: Label
  rank: preferred
alternative label: geformt
alt label: geformt
  type: Label
  rank: preferred

geschnitzt (formgebende Technik)
type: Concept
notation: C61723
created: 2026-01-30
issued: 2026-01-30
modified: 2026-02-04
publisher: Leibniz-Zentrum für Archäologie (LEIZA)
broader: formgebende Technik
broader transitive: formgebende Technik
broader transitive: [Untersuchungsergebnisse]
broader transitive: Zustandserfassung
broader transitive: Objektuntersuchung
broader transitive: Technologische Auswertung
broader transitive: Herstellungstechnik
in scheme: Konservierungs- und Restaurierungsfachthesaurus für archäologische Kulturgüter
pref label: geschnitzt (formgebende Technik)
  type: Label
  rank: preferred
alternative label: Schnitzen (formgebende Technik)
alt label: Schnitzen (formgebende Technik)
  type: Label
  rank: preferred

getrieben
type: Concept
notation: D18BBG
created: 2026-01-30
issued: 2026-01-30
modified: 2026-02-04
publisher: Leibniz-Zentrum für Archäologie (LEIZA)
alternative label: Treiben
broader: formgebende Technik
broader transitive: formgebende Technik
broader transitive: [Untersuchungsergebnisse]
broader transitive: Zustandserfassung
broader transitive: Objektuntersuchung
broader transitive: Technologische Auswertung
broader transitive: Herstellungstechnik
definition: spanloses Umformungsverfahren für Metalle zur Herstellung von Gefäßen und Hohlkörpern sowie zur Reliefgestaltung aus Blech. Dabei wird das Blech mit verschiedenen Hämmern oder Punzen auf weichen bzw. nachgiebigen Unterlagen (Holz, Filz, Leder, Blei, Kitt) oder auf unterschiedlichen Stahlambossen durch gezielte Schläge unter Verminderung der Blechdicke in die gewünschte Form gebracht. Die Bearbeitung erfolgt dabei im kalten Zustand, sodass in regelmäßigen Abständen ein Rekristalisationsglühen des verspannten Metallgefüges notwendig ist. Für dieses Formungsverfahren müssen die bearbeiteten Materialien eine ausreichende Dehnungsfähigkeit aufweisen, weshalb sich vor allem Edelmetalle und deren Legierungen, sowie Kupfer und Kupferlegierungen eignen.
definition:
  literal form: spanloses Umformungsverfahren für Metalle zur Herstellung von Gefäßen und Hohlkörpern sowie zur Reliefgestaltung aus Blech. Dabei wird das Blech mit verschiedenen Hämmern oder Punzen auf weichen bzw. nachgiebigen Unterlagen (Holz, Filz, Leder, Blei, Kitt) oder auf unterschiedlichen Stahlambossen durch gezielte Schläge unter Verminderung der Blechdicke in die gewünschte Form gebracht. Die Bearbeitung erfolgt dabei im kalten Zustand, sodass in regelmäßigen Abständen ein Rekristalisationsglühen des verspannten Metallgefüges notwendig ist. Für dieses Formungsverfahren müssen die bearbeiteten Materialien eine ausreichende Dehnungsfähigkeit aufweisen, weshalb sich vor allem Edelmetalle und deren Legierungen, sowie Kupfer und Kupferlegierungen eignen.
in scheme: Konservierungs- und Restaurierungsfachthesaurus für archäologische Kulturgüter
alt label: Treiben
  type: Label
  rank: preferred
pref label: getrieben
  type: Label
  rank: preferred
narrower: aufgetieft
narrower: aufgezogen

gedreht
type: Concept
notation: D44BAD
created: 2026-01-30
issued: 2026-01-30
modified: 2026-02-04
publisher: Leibniz-Zentrum für Archäologie (LEIZA)
alternative label: Drehen
broader: formgebende Technik
broader transitive: formgebende Technik
broader transitive: [Untersuchungsergebnisse]
broader transitive: Zustandserfassung
broader transitive: Objektuntersuchung
broader transitive: Technologische Auswertung
broader transitive: Herstellungstechnik
definition: spanabhebendes Fertigungsverfahren, bei dem das Werkstück auf einer Drehmaschine in Rotation versetzt wird, während ein einschneidiges Werkzeug Material abträgt. Die Formgebung erfolgt durch die quer zur Rotationsbewegung des Werkstücks ausgeführte Vorschubbewegung eines Werkzeugs entlang der Werkstückoberfläche, wodurch zylindrische, kegelförmige oder profilierte Bauteile hergestellt werden können. Dieses Verfahren wird häufig für die Bearbeitung von Metall, Kunststoff oder Holz eingesetzt und eignet sich besonders für die Herstellung rotationssymmetrischer Teile.
definition:
  literal form: spanabhebendes Fertigungsverfahren, bei dem das Werkstück auf einer Drehmaschine in Rotation versetzt wird, während ein einschneidiges Werkzeug Material abträgt. Die Formgebung erfolgt durch die quer zur Rotationsbewegung des Werkstücks ausgeführte Vorschubbewegung eines Werkzeugs entlang der Werkstückoberfläche, wodurch zylindrische, kegelförmige oder profilierte Bauteile hergestellt werden können. Dieses Verfahren wird häufig für die Bearbeitung von Metall, Kunststoff oder Holz eingesetzt und eignet sich besonders für die Herstellung rotationssymmetrischer Teile.
in scheme: Konservierungs- und Restaurierungsfachthesaurus für archäologische Kulturgüter
alt label: Drehen
  type: Label
  rank: preferred
pref label: gedreht
  type: Label
  rank: preferred

geschabt
type: Concept
notation: D642BC
created: 2026-01-30
issued: 2026-01-30
modified: 2026-02-04
publisher: Leibniz-Zentrum für Archäologie (LEIZA)
alternative label: Schaben
alternative label: Schabung
broader: formgebende Technik
broader transitive: formgebende Technik
broader transitive: [Untersuchungsergebnisse]
broader transitive: Zustandserfassung
broader transitive: Objektuntersuchung
broader transitive: Technologische Auswertung
broader transitive: Herstellungstechnik
in scheme: Konservierungs- und Restaurierungsfachthesaurus für archäologische Kulturgüter
alt label: Schabung
  type: Label
  rank: preferred
alt label: Schaben
  type: Label
  rank: normal
pref label: geschabt
  type: Label
  rank: preferred

gebogen
type: Concept
notation: D75A3A
created: 2026-01-30
issued: 2026-01-30
modified: 2026-02-04
publisher: Leibniz-Zentrum für Archäologie (LEIZA)
alternative label: Biegen
broader: formgebende Technik
broader transitive: formgebende Technik
broader transitive: [Untersuchungsergebnisse]
broader transitive: Zustandserfassung
broader transitive: Objektuntersuchung
broader transitive: Technologische Auswertung
broader transitive: Herstellungstechnik
definition: umformendes Fertigungsverfahren, bei dem ein metallisches Werkstückes durch die Einwirkung äußerer Kräfte in eine gezielt gekrümte Form gebracht wird, ohne Materialverlust. Die äußere Zone des Werkstoffes wird dabei gestreckt, während die innere Zone gestaucht wird. Mit Hilfe dieses formgebenden Verfahrens werden Rohre, Ösen, Profile und gewölbte Bleche sowie komplexere Werkstücken mit gebogener Formen hergestellt.
definition:
  literal form: umformendes Fertigungsverfahren, bei dem ein metallisches Werkstückes durch die Einwirkung äußerer Kräfte in eine gezielt gekrümte Form gebracht wird, ohne Materialverlust. Die äußere Zone des Werkstoffes wird dabei gestreckt, während die innere Zone gestaucht wird. Mit Hilfe dieses formgebenden Verfahrens werden Rohre, Ösen, Profile und gewölbte Bleche sowie komplexere Werkstücken mit gebogener Formen hergestellt.
in scheme: Konservierungs- und Restaurierungsfachthesaurus für archäologische Kulturgüter
alt label: Biegen
  type: Label
  rank: preferred
pref label: gebogen
  type: Label
  rank: preferred

handaufgebaut
type: Concept
notation: D92DAG
created: 2026-01-30
issued: 2026-01-30
modified: 2026-02-04
publisher: Leibniz-Zentrum für Archäologie (LEIZA)
broader: formgebende Technik
broader transitive: formgebende Technik
broader transitive: [Untersuchungsergebnisse]
broader transitive: Zustandserfassung
broader transitive: Objektuntersuchung
broader transitive: Technologische Auswertung
broader transitive: Herstellungstechnik
in scheme: Konservierungs- und Restaurierungsfachthesaurus für archäologische Kulturgüter
pref label: handaufgebaut
  type: Label
  rank: preferred
alternative label: Handaufbau
alt label: Handaufbau
  type: Label
  rank: preferred
narrower: Wulsttechnik
narrower: Plattentechnik

geblasen
type: Concept
notation: F1751B
created: 2026-01-30
issued: 2026-01-30
modified: 2026-02-04
publisher: Leibniz-Zentrum für Archäologie (LEIZA)
broader: formgebende Technik
broader transitive: formgebende Technik
broader transitive: [Untersuchungsergebnisse]
broader transitive: Zustandserfassung
broader transitive: Objektuntersuchung
broader transitive: Technologische Auswertung
broader transitive: Herstellungstechnik
in scheme: Konservierungs- und Restaurierungsfachthesaurus für archäologische Kulturgüter
pref label: geblasen
  type: Label
  rank: preferred

gehobelt
type: Concept
notation: F22BD7
created: 2026-01-30
issued: 2026-01-30
modified: 2026-02-04
publisher: Leibniz-Zentrum für Archäologie (LEIZA)
broader: formgebende Technik
broader transitive: formgebende Technik
broader transitive: [Untersuchungsergebnisse]
broader transitive: Zustandserfassung
broader transitive: Objektuntersuchung
broader transitive: Technologische Auswertung
broader transitive: Herstellungstechnik
in scheme: Konservierungs- und Restaurierungsfachthesaurus für archäologische Kulturgüter
pref label: gehobelt
  type: Label
  rank: preferred

gedrückt
type: Concept
notation: F6543A
created: 2026-01-30
issued: 2026-01-30
modified: 2026-02-04
publisher: Leibniz-Zentrum für Archäologie (LEIZA)
alternative label: Drücken
broader: formgebende Technik
broader transitive: formgebende Technik
broader transitive: [Untersuchungsergebnisse]
broader transitive: Zustandserfassung
broader transitive: Objektuntersuchung
broader transitive: Technologische Auswertung
broader transitive: Herstellungstechnik
in scheme: Konservierungs- und Restaurierungsfachthesaurus für archäologische Kulturgüter
alt label: Drücken
  type: Label
  rank: preferred
pref label: gedrückt
  type: Label
  rank: preferred

geraspelt
type: Concept
notation: F94C34
created: 2026-01-30
issued: 2026-01-30
modified: 2026-02-04
publisher: Leibniz-Zentrum für Archäologie (LEIZA)
broader: formgebende Technik
broader transitive: formgebende Technik
broader transitive: [Untersuchungsergebnisse]
broader transitive: Zustandserfassung
broader transitive: Objektuntersuchung
broader transitive: Technologische Auswertung
broader transitive: Herstellungstechnik
in scheme: Konservierungs- und Restaurierungsfachthesaurus für archäologische Kulturgüter
pref label: geraspelt
  type: Label
  rank: preferred

gedrechselt
type: Concept
notation: FFC35B
created: 2026-01-30
issued: 2026-01-30
modified: 2026-02-04
publisher: Leibniz-Zentrum für Archäologie (LEIZA)
broader: formgebende Technik
broader transitive: formgebende Technik
broader transitive: [Untersuchungsergebnisse]
broader transitive: Zustandserfassung
broader transitive: Objektuntersuchung
broader transitive: Technologische Auswertung
broader transitive: Herstellungstechnik
in scheme: Konservierungs- und Restaurierungsfachthesaurus für archäologische Kulturgüter
pref label: gedrechselt
  type: Label
  rank: preferred

scheibengedreht
type: Concept
notation: FGF4G9
created: 2026-01-30
issued: 2026-01-30
modified: 2026-02-04
publisher: Leibniz-Zentrum für Archäologie (LEIZA)
broader: formgebende Technik
broader transitive: formgebende Technik
broader transitive: [Untersuchungsergebnisse]
broader transitive: Zustandserfassung
broader transitive: Objektuntersuchung
broader transitive: Technologische Auswertung
broader transitive: Herstellungstechnik
in scheme: Konservierungs- und Restaurierungsfachthesaurus für archäologische Kulturgüter
pref label: scheibengedreht
  type: Label
  rank: preferred
alternative label: Scheibendrehen
alt label: Scheibendrehen
  type: Label
  rank: preferred

geglättet
type: Concept
notation: G29AD2
created: 2026-01-30
issued: 2026-01-30
modified: 2026-02-04
publisher: Leibniz-Zentrum für Archäologie (LEIZA)
broader: formgebende Technik
broader transitive: formgebende Technik
broader transitive: [Untersuchungsergebnisse]
broader transitive: Zustandserfassung
broader transitive: Objektuntersuchung
broader transitive: Technologische Auswertung
broader transitive: Herstellungstechnik
in scheme: Konservierungs- und Restaurierungsfachthesaurus für archäologische Kulturgüter
pref label: geglättet
  type: Label
  rank: preferred
alternative label: Glättung (formgebende Technik)
alt label: Glättung (formgebende Technik)
  type: Label
  rank: preferred

gezogen
type: Concept
notation: G45985
created: 2026-01-30
issued: 2026-01-30
modified: 2026-02-04
publisher: Leibniz-Zentrum für Archäologie (LEIZA)
alternative label: Ziehen
broader: formgebende Technik
broader transitive: formgebende Technik
broader transitive: [Untersuchungsergebnisse]
broader transitive: Zustandserfassung
broader transitive: Objektuntersuchung
broader transitive: Technologische Auswertung
broader transitive: Herstellungstechnik
definition: Umformverfahren, bei dem ein Werkstoff, meist Metall, durch die formgebende Öffnung eines Zieheisens gezogen wird. Dabei wird der Querschnitt des Materials verringert und seine Länge erhöht, ohne das Material zu trennen. Dieses Verfahren wird häufig zur Herstellung von Drähten, Rohren oder Profilen verwendet.
definition:
  literal form: Umformverfahren, bei dem ein Werkstoff, meist Metall, durch die formgebende Öffnung eines Zieheisens gezogen wird. Dabei wird der Querschnitt des Materials verringert und seine Länge erhöht, ohne das Material zu trennen. Dieses Verfahren wird häufig zur Herstellung von Drähten, Rohren oder Profilen verwendet.
in scheme: Konservierungs- und Restaurierungsfachthesaurus für archäologische Kulturgüter
alt label: Ziehen
  type: Label
  rank: preferred
pref label: gezogen
  type: Label
  rank: preferred

gefräst
type: Concept
notation: G56825
created: 2026-01-30
issued: 2026-01-30
modified: 2026-02-04
publisher: Leibniz-Zentrum für Archäologie (LEIZA)
alternative label: Fräsen
alternative label: Fräsung
broader: formgebende Technik
broader transitive: formgebende Technik
broader transitive: [Untersuchungsergebnisse]
broader transitive: Zustandserfassung
broader transitive: Objektuntersuchung
broader transitive: Technologische Auswertung
broader transitive: Herstellungstechnik
definition: spangebendes Fertigungsverfahren, bei dem Material von einem Werkstück durch die rotierende Bewegung eines mehrschneidigen Werkzeugs (Fräser) bei gleichzeitig verlaufender Vorschubbewegung abgetragen wird. Dabei kann der Fräser und/oder das Werkstück in verschiedenen Achsen bewegt werden, um komplexe Geometrien und Oberflächen herzustellen. Dieses Verfahren wird häufig zur Formgebung von Metallen, Kunststoffen und anderen Werkstoffen eingesetzt, wobei je nach Material und angestrebter Form unterschiedlich geformte Fräser eingesetzt werden.
definition:
  literal form: spangebendes Fertigungsverfahren, bei dem Material von einem Werkstück durch die rotierende Bewegung eines mehrschneidigen Werkzeugs (Fräser) bei gleichzeitig verlaufender Vorschubbewegung abgetragen wird. Dabei kann der Fräser und/oder das Werkstück in verschiedenen Achsen bewegt werden, um komplexe Geometrien und Oberflächen herzustellen. Dieses Verfahren wird häufig zur Formgebung von Metallen, Kunststoffen und anderen Werkstoffen eingesetzt, wobei je nach Material und angestrebter Form unterschiedlich geformte Fräser eingesetzt werden.
in scheme: Konservierungs- und Restaurierungsfachthesaurus für archäologische Kulturgüter
alt label: Fräsen
  type: Label
  rank: preferred
alt label: Fräsung
  type: Label
  rank: normal
pref label: gefräst
  type: Label
  rank: preferred

geschliffen [Formgebung]
type: Concept
notation: G7497F
created: 2026-01-30
issued: 2026-01-30
modified: 2026-02-04
publisher: Leibniz-Zentrum für Archäologie (LEIZA)
alternative label: Schleifen
alternative label: Schliff
broader: formgebende Technik
broader transitive: formgebende Technik
broader transitive: [Untersuchungsergebnisse]
broader transitive: Zustandserfassung
broader transitive: Objektuntersuchung
broader transitive: Technologische Auswertung
broader transitive: Herstellungstechnik
definition: spanabhebendes Formungsverfahren, bei dem Material mit Hilfe von Schleifwerkzeugen (Schleifmittelträger, auf dem eine Vielzahl von harten Schleifkörnern in gebundener oder loser Form aufgebracht sind) von der Oberfläche eines Werkstücks entfernt wird. Dabei wirken die scharfen, geometrisch unbestimmten Kanten und Schneiden der Schleifkörner auf das Material ein und lösen dabei feine Späne ab. Dabei können mechanische Schleifmedien oder elektronisch rotierende Schleifwerkzeuge mit unterschiedlich groben/großen Schleifkörnern verwendet werden, je nach angestrebter Formgebung.
definition:
  literal form: spanabhebendes Formungsverfahren, bei dem Material mit Hilfe von Schleifwerkzeugen (Schleifmittelträger, auf dem eine Vielzahl von harten Schleifkörnern in gebundener oder loser Form aufgebracht sind) von der Oberfläche eines Werkstücks entfernt wird. Dabei wirken die scharfen, geometrisch unbestimmten Kanten und Schneiden der Schleifkörner auf das Material ein und lösen dabei feine Späne ab. Dabei können mechanische Schleifmedien oder elektronisch rotierende Schleifwerkzeuge mit unterschiedlich groben/großen Schleifkörnern verwendet werden, je nach angestrebter Formgebung.
in scheme: Konservierungs- und Restaurierungsfachthesaurus für archäologische Kulturgüter
alt label: Schliff
  type: Label
  rank: preferred
alt label: Schleifen
  type: Label
  rank: normal
pref label: geschliffen [Formgebung]
  type: Label
  rank: preferred

Schalenguss
type: Concept
notation: B9741A
created: 2026-01-30
issued: 2026-01-30
modified: 2026-02-04
publisher: Leibniz-Zentrum für Archäologie (LEIZA)
broader: gegossen
broader transitive: formgebende Technik
broader transitive: [Untersuchungsergebnisse]
broader transitive: Zustandserfassung
broader transitive: Objektuntersuchung
broader transitive: Technologische Auswertung
broader transitive: Herstellungstechnik
broader transitive: gegossen
in scheme: Konservierungs- und Restaurierungsfachthesaurus für archäologische Kulturgüter
pref label: Schalenguss
  type: Label
  rank: preferred

Guss in verlorener Form
type: Concept
notation: BGC8F3
created: 2026-01-30
issued: 2026-01-30
modified: 2026-02-04
publisher: Leibniz-Zentrum für Archäologie (LEIZA)
broader: gegossen
broader transitive: formgebende Technik
broader transitive: [Untersuchungsergebnisse]
broader transitive: Zustandserfassung
broader transitive: Objektuntersuchung
broader transitive: Technologische Auswertung
broader transitive: Herstellungstechnik
broader transitive: gegossen
definition: Oberbegriff für Gusstechniken, bei denen die Gussform zerstört werden muss, um das Werkstück entnehmen zu können, bzw. die Form nur einem einzigen Ausguss standhält.
in scheme: Konservierungs- und Restaurierungsfachthesaurus für archäologische Kulturgüter
pref label: Guss in verlorener Form
  type: Label
  rank: preferred
narrower: Sandguss
narrower: Wachsausschmelzverfahren
narrower: Ossa-Sepia Guss

Kokillen-Guss
type: Concept
notation: CAB27G
created: 2026-01-30
issued: 2026-01-30
modified: 2026-02-04
publisher: Leibniz-Zentrum für Archäologie (LEIZA)
alternative label: verdeckter Herdguss
broader: gegossen
broader transitive: formgebende Technik
broader transitive: [Untersuchungsergebnisse]
broader transitive: Zustandserfassung
broader transitive: Objektuntersuchung
broader transitive: Technologische Auswertung
broader transitive: Herstellungstechnik
broader transitive: gegossen
definition: Gießverfahren, bei dem geschmolzenes Metall in eine wiederverwendbare, meist aus Stahl oder Gusseisen gefertigte Dauerform (Kokille) gegossen wird. Dieses Verfahren eignet sich besonders für die Herstellung von Halbzeugen wie Blech- oder Drahtrohlinge.
definition:
  literal form: Gießverfahren, bei dem geschmolzenes Metall in eine wiederverwendbare, meist aus Stahl oder Gusseisen gefertigte Dauerform (Kokille) gegossen wird. Dieses Verfahren eignet sich besonders für die Herstellung von Halbzeugen wie Blech- oder Drahtrohlinge.
in scheme: Konservierungs- und Restaurierungsfachthesaurus für archäologische Kulturgüter
alt label: verdeckter Herdguss
  type: Label
  rank: preferred
pref label: Kokillen-Guss
  type: Label
  rank: preferred

Sandguss
type: Concept
notation: BBA1C7
created: 2026-01-30
issued: 2026-01-30
modified: 2026-02-04
publisher: Leibniz-Zentrum für Archäologie (LEIZA)
broader: Guss in verlorener Form
broader transitive: formgebende Technik
broader transitive: [Untersuchungsergebnisse]
broader transitive: Zustandserfassung
broader transitive: Objektuntersuchung
broader transitive: Technologische Auswertung
broader transitive: Herstellungstechnik
broader transitive: gegossen
broader transitive: Guss in verlorener Form
definition: Gusstechnik, bei der die Negativform mit Hilfe eines speziellen Sandes, dem sog. "Formsand", hergestellt wird. Als Hilfmittel dient ein zweiteiliger Formrahmen, dessen beiden Hälften nacheinander so mit Formsand befüllt werden, dass ein Modell des Werkstückes zwischen den beiden Formrahmenhälften im Sand eingebettet ist. Damit sich der Sand entlang der Fuge zwischen den beiden Formrahmenhälften trennt und sich auch das Modell ohne Probleme entnehmen lässt, bedarf es eines Trennmittels, dem sog. "Formpuder", der aus dem Sporenstaub des Keulenbärlapps (Lycopodium) besteht. Durch einen Einguss wird heißes, flüssiges Metall in die so erstellte Negativform gefüllt, das in der Form erstarrt und auf diese Weise dessen Form im Positiven abbildet.
definition:
  literal form: Gusstechnik, bei der die Negativform mit Hilfe eines speziellen Sandes, dem sog. "Formsand", hergestellt wird. Als Hilfmittel dient ein zweiteiliger Formrahmen, dessen beiden Hälften nacheinander so mit Formsand befüllt werden, dass ein Modell des Werkstückes zwischen den beiden Formrahmenhälften im Sand eingebettet ist. Damit sich der Sand entlang der Fuge zwischen den beiden Formrahmenhälften trennt und sich auch das Modell ohne Probleme entnehmen lässt, bedarf es eines Trennmittels, dem sog. "Formpuder", der aus dem Sporenstaub des Keulenbärlapps (Lycopodium) besteht. Durch einen Einguss wird heißes, flüssiges Metall in die so erstellte Negativform gefüllt, das in der Form erstarrt und auf diese Weise dessen Form im Positiven abbildet.
in scheme: Konservierungs- und Restaurierungsfachthesaurus für archäologische Kulturgüter
pref label: Sandguss
  type: Label
  rank: preferred

Wachsausschmelzverfahren
type: Concept
notation: CA4B11
created: 2026-01-30
issued: 2026-01-30
modified: 2026-02-04
publisher: Leibniz-Zentrum für Archäologie (LEIZA)
broader: Guss in verlorener Form
broader transitive: formgebende Technik
broader transitive: [Untersuchungsergebnisse]
broader transitive: Zustandserfassung
broader transitive: Objektuntersuchung
broader transitive: Technologische Auswertung
broader transitive: Herstellungstechnik
broader transitive: gegossen
broader transitive: Guss in verlorener Form
definition: Gusstechnik, bei der ein aus Wachs geformtes Modell des Werkstücks mit Ton/Lehm (im modernen Verfahren auch mit anderen feuerfesten Materialien) ummantelt wird und das Wachs anschließend aus der Form herausgeschmolzen wird. Der entstandene Hohlraum dient dann als Gussform und wird mit flüssigem Metall ausgefüllt. Um das erkaltete Werkstück aus der Form entnehmen zu können, muss die Form zerstört werden. Das Wachsausschmelzverfahren ist eine der ältesten Gusstechniken des Goldschmiedehandwerkes und wurde bereits in der "Schedula diversarum artium" des Theophilus Presbyter (Buch III, Kapitel LXI) beschrieben.
definition:
  literal form: Gusstechnik, bei der ein aus Wachs geformtes Modell des Werkstücks mit Ton/Lehm (im modernen Verfahren auch mit anderen feuerfesten Materialien) ummantelt wird und das Wachs anschließend aus der Form herausgeschmolzen wird. Der entstandene Hohlraum dient dann als Gussform und wird mit flüssigem Metall ausgefüllt. Um das erkaltete Werkstück aus der Form entnehmen zu können, muss die Form zerstört werden. Das Wachsausschmelzverfahren ist eine der ältesten Gusstechniken des Goldschmiedehandwerkes und wurde bereits in der "Schedula diversarum artium" des Theophilus Presbyter (Buch III, Kapitel LXI) beschrieben.
in scheme: Konservierungs- und Restaurierungsfachthesaurus für archäologische Kulturgüter
pref label: Wachsausschmelzverfahren
  type: Label
  rank: preferred

Ossa-Sepia Guss
type: Concept
notation: D51358
created: 2026-01-30
issued: 2026-01-30
modified: 2026-02-04
publisher: Leibniz-Zentrum für Archäologie (LEIZA)
broader: Guss in verlorener Form
broader transitive: formgebende Technik
broader transitive: [Untersuchungsergebnisse]
broader transitive: Zustandserfassung
broader transitive: Objektuntersuchung
broader transitive: Technologische Auswertung
broader transitive: Herstellungstechnik
broader transitive: gegossen
broader transitive: Guss in verlorener Form
definition: Gusstechnik, bei der der Rückenschulp (Rückenschale) des gemeinen Tintenfischs (Sepia officinalis) als Formmaterial verwendet wird. Auf der einen Seite hat die Sepia eine dünne harte Kruste, auf der anderen Seite ist sie weich. Auf der weichen Seite kann durch Eindrücken eines Modells eine Negativform erstellt werden, die anschließend mit flüssigem Metall ausgegossen wird. Ebenfalls kann eine zweiteilige Form erstellt werden, indem die Sepiaschale quer durchgeschnitten und die weiche Seiteplaniert wird. Das Modell wird daraufhin so in beide Formhälften gedrückt, dass es in jeder Hälfte etwa bis zur Mitte eingebettet ist. Nach der Entnahme des Modells muss nun ein Einguss in die Sepiaschale geschnitten werden und beide Schalenhälften fest mit einer Klammer oder Draht zusammengepresst werden, bevor das heiße Metall eingefüllt werden kann. Die Form ist nicht wiederverwendbar, da das heiße Metall das weiche Sepiamaterial verbrennt.
definition:
  literal form: Gusstechnik, bei der der Rückenschulp (Rückenschale) des gemeinen Tintenfischs (Sepia officinalis) als Formmaterial verwendet wird. Auf der einen Seite hat die Sepia eine dünne harte Kruste, auf der anderen Seite ist sie weich. Auf der weichen Seite kann durch Eindrücken eines Modells eine Negativform erstellt werden, die anschließend mit flüssigem Metall ausgegossen wird. Ebenfalls kann eine zweiteilige Form erstellt werden, indem die Sepiaschale quer durchgeschnitten und die weiche Seiteplaniert wird. Das Modell wird daraufhin so in beide Formhälften gedrückt, dass es in jeder Hälfte etwa bis zur Mitte eingebettet ist. Nach der Entnahme des Modells muss nun ein Einguss in die Sepiaschale geschnitten werden und beide Schalenhälften fest mit einer Klammer oder Draht zusammengepresst werden, bevor das heiße Metall eingefüllt werden kann. Die Form ist nicht wiederverwendbar, da das heiße Metall das weiche Sepiamaterial verbrennt.
in scheme: Konservierungs- und Restaurierungsfachthesaurus für archäologische Kulturgüter
pref label: Ossa-Sepia Guss
  type: Label
  rank: preferred

aufgetieft
type: Concept
notation: A26FD8
created: 2026-01-30
issued: 2026-01-30
modified: 2026-02-04
publisher: Leibniz-Zentrum für Archäologie (LEIZA)
alternative label: Auftiefen
alternative label: Tiefen
broader: getrieben
broader transitive: getrieben
broader transitive: formgebende Technik
broader transitive: [Untersuchungsergebnisse]
broader transitive: Zustandserfassung
broader transitive: Objektuntersuchung
broader transitive: Technologische Auswertung
broader transitive: Herstellungstechnik
definition: Treibtechnik, bei der ein Blech in eine mehr oder weniger passende Gegenform (z.B. Stahlanke, Kitt, Holz, etc.) eingehämmert und auf diese Weise kalt umgeformt wird.
in scheme: Konservierungs- und Restaurierungsfachthesaurus für archäologische Kulturgüter
alt label: Auftiefen
  type: Label
  rank: preferred
alt label: Tiefen
  type: Label
  rank: normal
pref label: aufgetieft
  type: Label
  rank: preferred

aufgezogen
type: Concept
notation: D74CG7
created: 2026-01-30
issued: 2026-01-30
modified: 2026-02-04
publisher: Leibniz-Zentrum für Archäologie (LEIZA)
alternative label: Aufziehen
broader: getrieben
broader transitive: getrieben
broader transitive: formgebende Technik
broader transitive: [Untersuchungsergebnisse]
broader transitive: Zustandserfassung
broader transitive: Objektuntersuchung
broader transitive: Technologische Auswertung
broader transitive: Herstellungstechnik
definition: Treibtechnik, bei der ein Blech durch gezielte und genau dosierte Hammerschläge so gestaucht wird, dass sich sein Rand zwangsweise nach oben und innen wölbt. Auf diese Weise wird durch sich ständig wiederholendes Stauchen und Strecken ein Hohlkörper gebildet, dessen Ausgestaltung "frei Hand" geformt wird. Die Bearbeitung erfolgt dabei auf weicher (Holz) oder harter (Stahl) Unterlage, ohne Gegenform, die die endgültige Form des Hohlkörpers vorgibt.
definition:
  literal form: Treibtechnik, bei der ein Blech durch gezielte und genau dosierte Hammerschläge so gestaucht wird, dass sich sein Rand zwangsweise nach oben und innen wölbt. Auf diese Weise wird durch sich ständig wiederholendes Stauchen und Strecken ein Hohlkörper gebildet, dessen Ausgestaltung "frei Hand" geformt wird. Die Bearbeitung erfolgt dabei auf weicher (Holz) oder harter (Stahl) Unterlage, ohne Gegenform, die die endgültige Form des Hohlkörpers vorgibt.
in scheme: Konservierungs- und Restaurierungsfachthesaurus für archäologische Kulturgüter
alt label: Aufziehen
  type: Label
  rank: preferred
pref label: aufgezogen
  type: Label
  rank: preferred

Wulsttechnik
type: Concept
notation: AA5F82
created: 2026-01-30
issued: 2026-01-30
modified: 2026-02-04
publisher: Leibniz-Zentrum für Archäologie (LEIZA)
broader: handaufgebaut
broader transitive: handaufgebaut
broader transitive: formgebende Technik
broader transitive: [Untersuchungsergebnisse]
broader transitive: Zustandserfassung
broader transitive: Objektuntersuchung
broader transitive: Technologische Auswertung
broader transitive: Herstellungstechnik
in scheme: Konservierungs- und Restaurierungsfachthesaurus für archäologische Kulturgüter
pref label: Wulsttechnik
  type: Label
  rank: preferred

Block-twisting
type: Concept
notation: BG73GA
created: 2026-01-30
issued: 2026-01-30
modified: 2026-02-04
publisher: Leibniz-Zentrum für Archäologie (LEIZA)
broader: gerollt
broader transitive: formgebende Technik
broader transitive: [Untersuchungsergebnisse]
broader transitive: Zustandserfassung
broader transitive: Objektuntersuchung
broader transitive: Technologische Auswertung
broader transitive: Herstellungstechnik
broader transitive: gerollt
in scheme: Konservierungs- und Restaurierungsfachthesaurus für archäologische Kulturgüter
pref label: Block-twisting
  type: Label
  rank: preferred

Strip-twisting
type: Concept
notation: D6CAG4
created: 2026-01-30
issued: 2026-01-30
modified: 2026-02-04
publisher: Leibniz-Zentrum für Archäologie (LEIZA)
broader: gerollt
broader transitive: formgebende Technik
broader transitive: [Untersuchungsergebnisse]
broader transitive: Zustandserfassung
broader transitive: Objektuntersuchung
broader transitive: Technologische Auswertung
broader transitive: Herstellungstechnik
broader transitive: gerollt
in scheme: Konservierungs- und Restaurierungsfachthesaurus für archäologische Kulturgüter
pref label: Strip-twisting
  type: Label
  rank: preferred

Plattentechnik
type: Concept
notation: G6FB44
created: 2026-01-30
issued: 2026-01-30
modified: 2026-02-04
publisher: Leibniz-Zentrum für Archäologie (LEIZA)
broader: handaufgebaut
broader transitive: handaufgebaut
broader transitive: formgebende Technik
broader transitive: [Untersuchungsergebnisse]
broader transitive: Zustandserfassung
broader transitive: Objektuntersuchung
broader transitive: Technologische Auswertung
broader transitive: Herstellungstechnik
in scheme: Konservierungs- und Restaurierungsfachthesaurus für archäologische Kulturgüter
pref label: Plattentechnik
  type: Label
  rank: preferred

reduzierender Brand
type: Concept
notation: C3D36A
created: 2026-01-30
issued: 2026-01-30
modified: 2026-02-04
publisher: Leibniz-Zentrum für Archäologie (LEIZA)
broader: gebrannt
broader transitive: formgebende Technik
broader transitive: [Untersuchungsergebnisse]
broader transitive: Zustandserfassung
broader transitive: Objektuntersuchung
broader transitive: Technologische Auswertung
broader transitive: gebrannt
broader transitive: Herstellungstechnik
in scheme: Konservierungs- und Restaurierungsfachthesaurus für archäologische Kulturgüter
pref label: reduzierender Brand
  type: Label
  rank: preferred

oxidierender Brand
type: Concept
notation: DD6G2G
created: 2026-01-30
issued: 2026-01-30
modified: 2026-02-04
publisher: Leibniz-Zentrum für Archäologie (LEIZA)
broader: gebrannt
broader transitive: formgebende Technik
broader transitive: [Untersuchungsergebnisse]
broader transitive: Zustandserfassung
broader transitive: Objektuntersuchung
broader transitive: Technologische Auswertung
broader transitive: gebrannt
broader transitive: Herstellungstechnik
in scheme: Konservierungs- und Restaurierungsfachthesaurus für archäologische Kulturgüter
pref label: oxidierender Brand
  type: Label
  rank: preferred

nielliert
type: Concept
notation: A2FA1B
created: 2026-01-30
issued: 2026-01-30
modified: 2026-02-04
publisher: Leibniz-Zentrum für Archäologie (LEIZA)
alternative label: Einschmelzverfahren
alternative label: Niellierung
broader: Verzierungstechnik
broader transitive: Verzierungstechnik
broader transitive: [Untersuchungsergebnisse]
broader transitive: Zustandserfassung
broader transitive: Objektuntersuchung
broader transitive: Technologische Auswertung
definition: Verzierungstechnik, bei der Vertiefungen auf Metalloberflächen, meist aus Silber oder Gold mit hohem Feingehalt, mit einer schwarzen, metallhaltigen Schwefelmasse (Niello) ausgefüllt werden. Die Masse wird in die eingravierten oder geätzten Muster eingebracht und anschließend durch Erhitzen fixiert. Nach dem Abkühlen wird die Oberfläche poliert, sodass die glänzenden Metallflächen und die dunklen Niello-Einlagen ein kontrastreiches, dekoratives Erscheinungsbild ergeben.
definition:
  literal form: Verzierungstechnik, bei der Vertiefungen auf Metalloberflächen, meist aus Silber oder Gold mit hohem Feingehalt, mit einer schwarzen, metallhaltigen Schwefelmasse (Niello) ausgefüllt werden. Die Masse wird in die eingravierten oder geätzten Muster eingebracht und anschließend durch Erhitzen fixiert. Nach dem Abkühlen wird die Oberfläche poliert, sodass die glänzenden Metallflächen und die dunklen Niello-Einlagen ein kontrastreiches, dekoratives Erscheinungsbild ergeben.
in scheme: Konservierungs- und Restaurierungsfachthesaurus für archäologische Kulturgüter
alt label: Niellierung
  type: Label
  rank: preferred
alt label: Einschmelzverfahren
  type: Label
  rank: normal
pref label: nielliert
  type: Label
  rank: preferred

eingedrückt
type: Concept
notation: A41BGB
created: 2026-01-30
issued: 2026-01-30
modified: 2026-02-04
publisher: Leibniz-Zentrum für Archäologie (LEIZA)
alternative label: Eindrückung
broader: Verzierungstechnik
broader transitive: Verzierungstechnik
broader transitive: [Untersuchungsergebnisse]
broader transitive: Zustandserfassung
broader transitive: Objektuntersuchung
broader transitive: Technologische Auswertung
in scheme: Konservierungs- und Restaurierungsfachthesaurus für archäologische Kulturgüter
narrower: Schnurabdruckdekor
narrower: Linienbanddekor
alt label: Eindrückung
  type: Label
  rank: preferred
pref label: eingedrückt
  type: Label
  rank: preferred

ziseliert
type: Concept
notation: A5C668
created: 2026-01-30
issued: 2026-01-30
modified: 2026-02-04
publisher: Leibniz-Zentrum für Archäologie (LEIZA)
alternative label: Ziselierung
broader: Verzierungstechnik
broader transitive: Verzierungstechnik
broader transitive: [Untersuchungsergebnisse]
broader transitive: Zustandserfassung
broader transitive: Objektuntersuchung
broader transitive: Technologische Auswertung
definition: Verzierungstechnik, bei der mit Profilpunzen und einem speziell geformtem Hammer - dem sog. "Ziselierhammer" - feine Muster, Figuren oder ganze Reliefs in eine Metalloberfläche getrieben werden. Das Material wird dabei zur Seite gedrückt und mit gezielten Hammerschlägen plastisch verformt.
definition:
  literal form: Verzierungstechnik, bei der mit Profilpunzen und einem speziell geformtem Hammer - dem sog. "Ziselierhammer" - feine Muster, Figuren oder ganze Reliefs in eine Metalloberfläche getrieben werden. Das Material wird dabei zur Seite gedrückt und mit gezielten Hammerschlägen plastisch verformt.
in scheme: Konservierungs- und Restaurierungsfachthesaurus für archäologische Kulturgüter
alt label: Ziselierung
  type: Label
  rank: preferred
pref label: ziseliert
  type: Label
  rank: preferred

inkrustiert
type: Concept
notation: A6FA7G
created: 2026-01-30
issued: 2026-01-30
modified: 2026-02-04
publisher: Leibniz-Zentrum für Archäologie (LEIZA)
broader: Verzierungstechnik
broader transitive: Verzierungstechnik
broader transitive: [Untersuchungsergebnisse]
broader transitive: Zustandserfassung
broader transitive: Objektuntersuchung
broader transitive: Technologische Auswertung
in scheme: Konservierungs- und Restaurierungsfachthesaurus für archäologische Kulturgüter
pref label: inkrustiert
  type: Label
  rank: preferred
definition: Die Verzierung/Oberflächegestaltung von mineralischen Werkstoffen (wie Keramik oder Stein) durch das Einlegen verschiedenfarbiger, kontrastreicher Materialien

aufgeraut
type: Concept
notation: A7D71D
created: 2026-01-30
issued: 2026-01-30
modified: 2026-02-04
publisher: Leibniz-Zentrum für Archäologie (LEIZA)
broader: Verzierungstechnik
broader transitive: Verzierungstechnik
broader transitive: [Untersuchungsergebnisse]
broader transitive: Zustandserfassung
broader transitive: Objektuntersuchung
broader transitive: Technologische Auswertung
in scheme: Konservierungs- und Restaurierungsfachthesaurus für archäologische Kulturgüter
pref label: aufgeraut
  type: Label
  rank: preferred

patiniert
type: Concept
notation: AF49C1
created: 2026-01-30
issued: 2026-01-30
modified: 2026-02-04
publisher: Leibniz-Zentrum für Archäologie (LEIZA)
broader: Verzierungstechnik
broader transitive: [Untersuchungsergebnisse]
broader transitive: Zustandserfassung
broader transitive: Objektuntersuchung
broader transitive: Technologische Auswertung
broader transitive: Verzierungstechnik
in scheme: Konservierungs- und Restaurierungsfachthesaurus für archäologische Kulturgüter
pref label: patiniert
  type: Label
  rank: preferred
alternative label: Paninierung
definition: Verzierungstechnik, bei der die Oberfläche von Kupfer bzw. Kupferlegierungen durch chemische, thermische oder natürliche Prozesse gezielt verändert wird, um eine farbige oder gealterte Optik zu erzielen. Dies geschieht häufig durch den Einsatz von Säuren, Oxidationsmitteln oder durch gezielte Alterung unter Umwelteinflüssen. Die so entstehende Patina dient nicht nur dekorativen Zwecken, sondern kann auch als Schutzschicht gegen Korrosion wirken.
definition:
  literal form: Verzierungstechnik, bei der die Oberfläche von Kupfer bzw. Kupferlegierungen durch chemische, thermische oder natürliche Prozesse gezielt verändert wird, um eine farbige oder gealterte Optik zu erzielen. Dies geschieht häufig durch den Einsatz von Säuren, Oxidationsmitteln oder durch gezielte Alterung unter Umwelteinflüssen. Die so entstehende Patina dient nicht nur dekorativen Zwecken, sondern kann auch als Schutzschicht gegen Korrosion wirken.
alt label: Paninierung
  type: Label
  rank: preferred

emailliert
type: Concept
notation: B14C4A
created: 2026-01-30
issued: 2026-01-30
modified: 2026-02-04
publisher: Leibniz-Zentrum für Archäologie (LEIZA)
alternative label: Email
alternative label: Emaillierung
broader: Verzierungstechnik
broader transitive: Verzierungstechnik
broader transitive: [Untersuchungsergebnisse]
broader transitive: Zustandserfassung
broader transitive: Objektuntersuchung
broader transitive: Technologische Auswertung
definition: Verzierungsmethode, bei der Glas bzw. eine glasartige Matrix auf eine Metalloberfläche oder in vorbereitete Zellen auf- bzw. eingeschmolzen wird.
in scheme: Konservierungs- und Restaurierungsfachthesaurus für archäologische Kulturgüter
narrower: Zellenemail
narrower: Emailmalerei
narrower: Grubenemail
narrower: Fensteremail
narrower: Stegemail
narrower: Körperemail
alt label: Email
  type: Label
  rank: preferred
alt label: Emaillierung
  type: Label
  rank: normal
pref label: emailliert
  type: Label
  rank: preferred

Zellenemail
type: Concept
notation: CG8188
created: 2026-01-30
issued: 2026-01-30
modified: 2026-02-04
publisher: Leibniz-Zentrum für Archäologie (LEIZA)
broader: emailliert
broader transitive: emailliert
broader transitive: Verzierungstechnik
broader transitive: [Untersuchungsergebnisse]
broader transitive: Zustandserfassung
broader transitive: Objektuntersuchung
broader transitive: Technologische Auswertung
definition: Emailtechnik, bei der auf eine Grundplatte mit einem flachgewalzten, hochkant stehenden Draht Muster und Formen gebildet und mit Tragantlösung aufgeklebt oder mit Emaillot festgelötet werden. Die dadurch gebildeten Zellen werden anschließend als einzelne Farbflächen mit Email gefüllt. Im Unterschied zum Stegemail wird die über die Emailfläche herausstehende Drahtkante (Stege) bis auf die Ebene des Emails heruntergearbeitet, sodass eine ebene, geschlossene Fläche entsteht.
definition:
  literal form: Emailtechnik, bei der auf eine Grundplatte mit einem flachgewalzten, hochkant stehenden Draht Muster und Formen gebildet und mit Tragantlösung aufgeklebt oder mit Emaillot festgelötet werden. Die dadurch gebildeten Zellen werden anschließend als einzelne Farbflächen mit Email gefüllt. Im Unterschied zum Stegemail wird die über die Emailfläche herausstehende Drahtkante (Stege) bis auf die Ebene des Emails heruntergearbeitet, sodass eine ebene, geschlossene Fläche entsteht.
in scheme: Konservierungs- und Restaurierungsfachthesaurus für archäologische Kulturgüter
pref label: Zellenemail
  type: Label
  rank: preferred

Emailmalerei
type: Concept
notation: D27B9A
created: 2026-01-30
issued: 2026-01-30
modified: 2026-02-04
publisher: Leibniz-Zentrum für Archäologie (LEIZA)
broader: emailliert
broader transitive: emailliert
broader transitive: Verzierungstechnik
broader transitive: [Untersuchungsergebnisse]
broader transitive: Zustandserfassung
broader transitive: Objektuntersuchung
broader transitive: Technologische Auswertung
definition: Emailtechnik, bei der auf einer mit opak-weißem Email überzogenen Grundfläche mit Metalloxidfarben ein Motiv aufgemalt wird. Durch den Brand im Ofen verbinden sich die Metalloxide mit der Glasmasse des Grundemails. Häufig wird abschließend noch eine dünne Schicht eines durchsichtigen Emails als Glasurüberzug aufgebracht.
definition:
  literal form: Emailtechnik, bei der auf einer mit opak-weißem Email überzogenen Grundfläche mit Metalloxidfarben ein Motiv aufgemalt wird. Durch den Brand im Ofen verbinden sich die Metalloxide mit der Glasmasse des Grundemails. Häufig wird abschließend noch eine dünne Schicht eines durchsichtigen Emails als Glasurüberzug aufgebracht.
in scheme: Konservierungs- und Restaurierungsfachthesaurus für archäologische Kulturgüter
pref label: Emailmalerei
  type: Label
  rank: preferred

Grubenemail
type: Concept
notation: DA226G
created: 2026-01-30
issued: 2026-01-30
modified: 2026-02-04
publisher: Leibniz-Zentrum für Archäologie (LEIZA)
broader: emailliert
broader transitive: emailliert
broader transitive: Verzierungstechnik
broader transitive: [Untersuchungsergebnisse]
broader transitive: Zustandserfassung
broader transitive: Objektuntersuchung
broader transitive: Technologische Auswertung
definition: Emailtechnik, bei der in eine Grundplatte Vertiefungen (Gruben) eingebracht und anschließend mit Email gefüllt werden. Die Vertiefungen können dabei durch Gravieren, Meißeln, Ätzen, Feile oder andere materialabtragende Techniken erzeugt werden.
definition:
  literal form: Emailtechnik, bei der in eine Grundplatte Vertiefungen (Gruben) eingebracht und anschließend mit Email gefüllt werden. Die Vertiefungen können dabei durch Gravieren, Meißeln, Ätzen, Feile oder andere materialabtragende Techniken erzeugt werden.
in scheme: Konservierungs- und Restaurierungsfachthesaurus für archäologische Kulturgüter
pref label: Grubenemail
  type: Label
  rank: preferred

Fensteremail
type: Concept
notation: FB5C1F
created: 2026-01-30
issued: 2026-01-30
modified: 2026-02-04
publisher: Leibniz-Zentrum für Archäologie (LEIZA)
broader: emailliert
broader transitive: emailliert
broader transitive: Verzierungstechnik
broader transitive: [Untersuchungsergebnisse]
broader transitive: Zustandserfassung
broader transitive: Objektuntersuchung
broader transitive: Technologische Auswertung
definition: Emailtechnik, bei der Emailschichten in Aussparungen durchbrochener Grundplatten oder in die Zwischenräume aus Stegen montierter Ornamente eingefüllt werden. Als Hinterlegung dienen Glimmer- oder dünne Metallfolien während des Schmelzvorganges, die im Anschluss von der Rückseite entfernt oder abgeschliffen werden. Die auf diese Weise entstehenden Werkstücke erinnern an farbige Fenster, die bei hindurchfallendem Licht eine prächtige leuchtende Optik zeigen.
definition:
  literal form: Emailtechnik, bei der Emailschichten in Aussparungen durchbrochener Grundplatten oder in die Zwischenräume aus Stegen montierter Ornamente eingefüllt werden. Als Hinterlegung dienen Glimmer- oder dünne Metallfolien während des Schmelzvorganges, die im Anschluss von der Rückseite entfernt oder abgeschliffen werden. Die auf diese Weise entstehenden Werkstücke erinnern an farbige Fenster, die bei hindurchfallendem Licht eine prächtige leuchtende Optik zeigen.
in scheme: Konservierungs- und Restaurierungsfachthesaurus für archäologische Kulturgüter
pref label: Fensteremail
  type: Label
  rank: preferred

Stegemail
type: Concept
notation: G1A3FB
created: 2026-01-30
issued: 2026-01-30
modified: 2026-02-04
publisher: Leibniz-Zentrum für Archäologie (LEIZA)
alternative label: Filigranemail
broader: emailliert
broader transitive: emailliert
broader transitive: Verzierungstechnik
broader transitive: [Untersuchungsergebnisse]
broader transitive: Zustandserfassung
broader transitive: Objektuntersuchung
broader transitive: Technologische Auswertung
definition: Emailtechnik ähnlich dem Zellenemail. Auf eine Grundplatte werden flachgewalzte Drahtstücke hochkant stehend zu einem Muster gelegt und mit Tragantlösung aufgeklebt bzw. bei komplexeren Formen aufgelötet. Die durch diese Stege entstehenden Zellen werden mit Email gefüllt. Im Gegensatz zum Zellenemail bleiben die überstehenden Stege beim Stegemail erhalten und werden nicht auf die Ebene des Emails abgeschliffen.
definition:
  literal form: Emailtechnik ähnlich dem Zellenemail. Auf eine Grundplatte werden flachgewalzte Drahtstücke hochkant stehend zu einem Muster gelegt und mit Tragantlösung aufgeklebt bzw. bei komplexeren Formen aufgelötet. Die durch diese Stege entstehenden Zellen werden mit Email gefüllt. Im Gegensatz zum Zellenemail bleiben die überstehenden Stege beim Stegemail erhalten und werden nicht auf die Ebene des Emails abgeschliffen.
in scheme: Konservierungs- und Restaurierungsfachthesaurus für archäologische Kulturgüter
alt label: Filigranemail
  type: Label
  rank: preferred
pref label: Stegemail
  type: Label
  rank: preferred

Körperemail
type: Concept
notation: G53328
created: 2026-01-30
issued: 2026-01-30
modified: 2026-02-04
publisher: Leibniz-Zentrum für Archäologie (LEIZA)
broader: emailliert
broader transitive: emailliert
broader transitive: Verzierungstechnik
broader transitive: [Untersuchungsergebnisse]
broader transitive: Zustandserfassung
broader transitive: Objektuntersuchung
broader transitive: Technologische Auswertung
definition: Emailtechnik, bei der ein dreidimensionaler Metallkörper vollständig mit Email überzogen wird.
in scheme: Konservierungs- und Restaurierungsfachthesaurus für archäologische Kulturgüter
pref label: Körperemail
  type: Label
  rank: preferred

brüniert
type: Concept
notation: B2B9C8
created: 2026-01-30
issued: 2026-01-30
modified: 2026-02-04
publisher: Leibniz-Zentrum für Archäologie (LEIZA)
broader: Verzierungstechnik
broader transitive: Verzierungstechnik
broader transitive: [Untersuchungsergebnisse]
broader transitive: Zustandserfassung
broader transitive: Objektuntersuchung
broader transitive: Technologische Auswertung
in scheme: Konservierungs- und Restaurierungsfachthesaurus für archäologische Kulturgüter
pref label: brüniert
  type: Label
  rank: preferred
definition: Verzierungstechnik, bei der die Oberfläche von Stahlobjekten gezielt mit thermischen oder chemischen Verfahren behandelt wird, um eine dünne bräunlich, bläulich oder schwarze Färbung (Oxidschicht) zu erzielen.
definition:
  literal form: Verzierungstechnik, bei der die Oberfläche von Stahlobjekten gezielt mit thermischen oder chemischen Verfahren behandelt wird, um eine dünne bräunlich, bläulich oder schwarze Färbung (Oxidschicht) zu erzielen.

eingeritzt
type: Concept
notation: B5A14G
created: 2026-01-30
issued: 2026-01-30
modified: 2026-02-04
publisher: Leibniz-Zentrum für Archäologie (LEIZA)
alternative label: Ritzung (Verzierungstechnik)
broader: Verzierungstechnik
broader transitive: Verzierungstechnik
broader transitive: [Untersuchungsergebnisse]
broader transitive: Zustandserfassung
broader transitive: Objektuntersuchung
broader transitive: Technologische Auswertung
in scheme: Konservierungs- und Restaurierungsfachthesaurus für archäologische Kulturgüter
alt label: Ritzung (Verzierungstechnik)
  type: Label
  rank: preferred
pref label: eingeritzt
  type: Label
  rank: preferred

geätzt
type: Concept
notation: B9835A
created: 2026-01-30
issued: 2026-01-30
modified: 2026-02-04
publisher: Leibniz-Zentrum für Archäologie (LEIZA)
alternative label: Ätzung
broader: Verzierungstechnik
broader transitive: Verzierungstechnik
broader transitive: [Untersuchungsergebnisse]
broader transitive: Zustandserfassung
broader transitive: Objektuntersuchung
broader transitive: Technologische Auswertung
definition: Verzierungstechnik, bei der Muster oder bildliche Motive durch chemisches oder elektrochemisches Abtragen von Material in die Oberfläche eines Werkstücks eingebracht werden. Dazu wird die zu erhaltende Fläche mit einem säure- oder laugenresistenten und reversiblen Schutzlack abgedeckt, bevor die freigelegten Bereiche mithilfe von Ätzmitteln (z.B. Salpetersäure, Salzsäure, Königswasser oder Eisenchlorid) gezielt bearbeitet werden.
definition:
  literal form: Verzierungstechnik, bei der Muster oder bildliche Motive durch chemisches oder elektrochemisches Abtragen von Material in die Oberfläche eines Werkstücks eingebracht werden. Dazu wird die zu erhaltende Fläche mit einem säure- oder laugenresistenten und reversiblen Schutzlack abgedeckt, bevor die freigelegten Bereiche mithilfe von Ätzmitteln (z.B. Salpetersäure, Salzsäure, Königswasser oder Eisenchlorid) gezielt bearbeitet werden.
in scheme: Konservierungs- und Restaurierungsfachthesaurus für archäologische Kulturgüter
alt label: Ätzung
  type: Label
  rank: preferred
pref label: geätzt
  type: Label
  rank: preferred

Intarsieneinlage
type: Concept
notation: BA8198
created: 2026-01-30
issued: 2026-01-30
modified: 2026-02-04
publisher: Leibniz-Zentrum für Archäologie (LEIZA)
broader: Verzierungstechnik
broader transitive: Verzierungstechnik
broader transitive: [Untersuchungsergebnisse]
broader transitive: Zustandserfassung
broader transitive: Objektuntersuchung
broader transitive: Technologische Auswertung
definition: Verzierungstechnik, bei der Metalleinlagen in Holz oder Metall dekorativ eingebracht werden.
in scheme: Konservierungs- und Restaurierungsfachthesaurus für archäologische Kulturgüter
pref label: Intarsieneinlage
  type: Label
  rank: preferred
narrower: tauschiert

filigranverziert
type: Concept
notation: BF3639
created: 2026-01-30
issued: 2026-01-30
modified: 2026-02-04
publisher: Leibniz-Zentrum für Archäologie (LEIZA)
alternative label: Filigran
alternative label: Filigranverzierung
broader: Verzierungstechnik
broader transitive: [Untersuchungsergebnisse]
broader transitive: Zustandserfassung
broader transitive: Objektuntersuchung
broader transitive: Technologische Auswertung
broader transitive: Verzierungstechnik
definition: zarte Verzierungstechnik, bei der feine Drähte aus Metall, meist Gold oder Silber, zu filigranen Mustern oder ornamentalen Formen verarbeitet werden. Flachgewalzte Kordel- Gewinde und/oder Runddrähte werden zu komplexen Gebilden wie Ranken, Blumen oder geometrischen Motive, häufig mit symmetrischen und sich mehrfach wiederholenden Elementen, gebogen und entweder zu einem eigenständigen Netzwerk miteinander verlötet oder direkt auf ein zu verzierendes Werkstück aufgelötet. Die Technik zeichnet sich durch eine ausgesprochen präzise, elegante Ausführung und Detailreichtum aus.
definition:
  literal form: zarte Verzierungstechnik, bei der feine Drähte aus Metall, meist Gold oder Silber, zu filigranen Mustern oder ornamentalen Formen verarbeitet werden. Flachgewalzte Kordel- Gewinde und/oder Runddrähte werden zu komplexen Gebilden wie Ranken, Blumen oder geometrischen Motive, häufig mit symmetrischen und sich mehrfach wiederholenden Elementen, gebogen und entweder zu einem eigenständigen Netzwerk miteinander verlötet oder direkt auf ein zu verzierendes Werkstück aufgelötet. Die Technik zeichnet sich durch eine ausgesprochen präzise, elegante Ausführung und Detailreichtum aus.
in scheme: Konservierungs- und Restaurierungsfachthesaurus für archäologische Kulturgüter
alt label: Filigranverzierung
  type: Label
  rank: preferred
alt label: Filigran
  type: Label
  rank: normal
pref label: filigranverziert
  type: Label
  rank: preferred

gestempelt
type: Concept
notation: BF6D19
created: 2026-01-30
issued: 2026-01-30
modified: 2026-02-04
publisher: Leibniz-Zentrum für Archäologie (LEIZA)
alternative label: Stempelung
broader: Verzierungstechnik
broader transitive: Verzierungstechnik
broader transitive: [Untersuchungsergebnisse]
broader transitive: Zustandserfassung
broader transitive: Objektuntersuchung
broader transitive: Technologische Auswertung
in scheme: Konservierungs- und Restaurierungsfachthesaurus für archäologische Kulturgüter
alt label: Stempelung
  type: Label
  rank: preferred
pref label: gestempelt
  type: Label
  rank: preferred

Kerbschnittdekor
type: Concept
notation: C61955
created: 2026-01-30
issued: 2026-01-30
modified: 2026-02-04
publisher: Leibniz-Zentrum für Archäologie (LEIZA)
broader: Verzierungstechnik
broader transitive: Verzierungstechnik
broader transitive: [Untersuchungsergebnisse]
broader transitive: Zustandserfassung
broader transitive: Objektuntersuchung
broader transitive: Technologische Auswertung
in scheme: Konservierungs- und Restaurierungsfachthesaurus für archäologische Kulturgüter
pref label: Kerbschnittdekor
  type: Label
  rank: preferred

verzinnt
type: Concept
notation: C8G54A
created: 2026-01-30
issued: 2026-01-30
modified: 2026-02-04
publisher: Leibniz-Zentrum für Archäologie (LEIZA)
broader: Verzierungstechnik
broader transitive: [Untersuchungsergebnisse]
broader transitive: Zustandserfassung
broader transitive: Objektuntersuchung
broader transitive: Technologische Auswertung
broader transitive: Verzierungstechnik
in scheme: Konservierungs- und Restaurierungsfachthesaurus für archäologische Kulturgüter
pref label: verzinnt
  type: Label
  rank: preferred
alternative label: Verzinnung
definition: Verzierungstechnik, bei der eine dünne Schicht Zinn auf eine Oberfläche aufgetragen wird. Bei historischen Objekten wurde dies z.B. zur Imitation von Silber oder zur Auskleidung von Kupfergefäßen angewandt.
definition:
  literal form: Verzierungstechnik, bei der eine dünne Schicht Zinn auf eine Oberfläche aufgetragen wird. Bei historischen Objekten wurde dies z.B. zur Imitation von Silber oder zur Auskleidung von Kupfergefäßen angewandt.
alt label: Verzinnung
  type: Label
  rank: preferred

granuliert
type: Concept
notation: C9C527
created: 2026-01-30
issued: 2026-01-30
modified: 2026-02-04
publisher: Leibniz-Zentrum für Archäologie (LEIZA)
alternative label: Granulation
broader: Verzierungstechnik
broader transitive: Verzierungstechnik
broader transitive: [Untersuchungsergebnisse]
broader transitive: Zustandserfassung
broader transitive: Objektuntersuchung
broader transitive: Technologische Auswertung
definition: Verzierungstechnik, bei der feine Metallkügelchen (Granalien), meist aus Gold oder Silber, auf der Oberfläche eines Werkstückes in regelmäßigen Mustern und ornamentalen Motiven aufgebracht werden. Diese Kügelchen werden entweder durch Löten bzw. Schweißen auf der Metalloberfläche fixiert und erzeugen eine strukturierte, reliefartige Oberfläche. Granulation wird häufig in der Schmuckherstellung sowie in der antiken Kunst verwendet, um besonders filigrane und kunstvolle Effekte zu erzielen.
definition:
  literal form: Verzierungstechnik, bei der feine Metallkügelchen (Granalien), meist aus Gold oder Silber, auf der Oberfläche eines Werkstückes in regelmäßigen Mustern und ornamentalen Motiven aufgebracht werden. Diese Kügelchen werden entweder durch Löten bzw. Schweißen auf der Metalloberfläche fixiert und erzeugen eine strukturierte, reliefartige Oberfläche. Granulation wird häufig in der Schmuckherstellung sowie in der antiken Kunst verwendet, um besonders filigrane und kunstvolle Effekte zu erzielen.
in scheme: Konservierungs- und Restaurierungsfachthesaurus für archäologische Kulturgüter
alt label: Granulation
  type: Label
  rank: preferred
pref label: granuliert
  type: Label
  rank: preferred

damasziert
type: Concept
notation: CB58C2
created: 2026-01-30
issued: 2026-01-30
modified: 2026-02-04
publisher: Leibniz-Zentrum für Archäologie (LEIZA)
broader: Verzierungstechnik
broader transitive: Verzierungstechnik
broader transitive: [Untersuchungsergebnisse]
broader transitive: Zustandserfassung
broader transitive: Objektuntersuchung
broader transitive: Technologische Auswertung
in scheme: Konservierungs- und Restaurierungsfachthesaurus für archäologische Kulturgüter
pref label: damasziert
  type: Label
  rank: preferred
alternative label: Damaszierung
alt label: Damaszierung
  type: Label
  rank: preferred

plattiert
type: Concept
notation: CC63FA
created: 2026-01-30
issued: 2026-01-30
modified: 2026-02-04
publisher: Leibniz-Zentrum für Archäologie (LEIZA)
alternative label: Plattierung
broader: Verzierungstechnik
broader transitive: [Untersuchungsergebnisse]
broader transitive: Zustandserfassung
broader transitive: Objektuntersuchung
broader transitive: Verzierungstechnik
broader transitive: Technologische Auswertung
definition: Verzierungsmethode, bei der dünne Metallfolien bzw. -bleche auf das zu verzierende Objekt gelegt und mittels Kleben, Umbördeln, Nieten oder Verstiften befestigt wird.
in scheme: Konservierungs- und Restaurierungsfachthesaurus für archäologische Kulturgüter
alt label: Plattierung
  type: Label
  rank: preferred
pref label: plattiert
  type: Label
  rank: preferred

tordiert
type: Concept
notation: D1636C
created: 2026-01-30
issued: 2026-01-30
modified: 2026-02-04
publisher: Leibniz-Zentrum für Archäologie (LEIZA)
broader: Verzierungstechnik
broader transitive: Verzierungstechnik
broader transitive: [Untersuchungsergebnisse]
broader transitive: Zustandserfassung
broader transitive: Objektuntersuchung
broader transitive: Technologische Auswertung
in scheme: Konservierungs- und Restaurierungsfachthesaurus für archäologische Kulturgüter
pref label: tordiert
  type: Label
  rank: preferred
alternative label: Tordierung
alt label: Tordierung
  type: Label
  rank: preferred

gefasst
type: Concept
notation: D1F5D3
created: 2026-01-30
issued: 2026-01-30
modified: 2026-02-04
publisher: Leibniz-Zentrum für Archäologie (LEIZA)
alternative label: Farbfassung
alternative label: Fassung
broader: Verzierungstechnik
broader transitive: [Untersuchungsergebnisse]
broader transitive: Zustandserfassung
broader transitive: Objektuntersuchung
broader transitive: Verzierungstechnik
broader transitive: Technologische Auswertung
definition: Verzierungstechnik, bei der die Objektoberfläche mit einer farbigen Schicht aus Farbpigmenten und/oder Blattgold/Blattsilber überzogen ist. Unter der farbigen Schicht wurde die Oberfläche meist mit einer Grundiermasse aus Kreide oder Gips und Leim geglättet bzw. plastische Details darauf modelliert. Der Begriff wird häufig im Kontext von Holzskulpturen mit bunter Bemalung verwendet.
definition:
  literal form: Verzierungstechnik, bei der die Objektoberfläche mit einer farbigen Schicht aus Farbpigmenten und/oder Blattgold/Blattsilber überzogen ist. Unter der farbigen Schicht wurde die Oberfläche meist mit einer Grundiermasse aus Kreide oder Gips und Leim geglättet bzw. plastische Details darauf modelliert. Der Begriff wird häufig im Kontext von Holzskulpturen mit bunter Bemalung verwendet.
in scheme: Konservierungs- und Restaurierungsfachthesaurus für archäologische Kulturgüter
alt label: Fassung
  type: Label
  rank: preferred
alt label: Farbfassung
  type: Label
  rank: normal
pref label: gefasst
  type: Label
  rank: preferred

versilbert
type: Concept
notation: D248A4
created: 2026-01-30
issued: 2026-01-30
modified: 2026-02-04
publisher: Leibniz-Zentrum für Archäologie (LEIZA)
broader: Verzierungstechnik
broader transitive: [Untersuchungsergebnisse]
broader transitive: Zustandserfassung
broader transitive: Objektuntersuchung
broader transitive: Technologische Auswertung
broader transitive: Verzierungstechnik
in scheme: Konservierungs- und Restaurierungsfachthesaurus für archäologische Kulturgüter
pref label: versilbert
  type: Label
  rank: preferred
alternative label: Versilberung
definition: Verzierungstechnik, bei der eine dünne Schicht aus Silber auf eine Oberfläche aufgetragen wird, um diese mit einem dekorativen und schützenden Überzug zu versehen. Der Auftrag des Silbers kann durch verschiedene mechanische, thermische oder (elekro-)chemische Methoden erfolgen.
definition:
  literal form: Verzierungstechnik, bei der eine dünne Schicht aus Silber auf eine Oberfläche aufgetragen wird, um diese mit einem dekorativen und schützenden Überzug zu versehen. Der Auftrag des Silbers kann durch verschiedene mechanische, thermische oder (elekro-)chemische Methoden erfolgen.
alt label: Versilberung
  type: Label
  rank: preferred
narrower: Blattversilberung
narrower: Diffusionsversilberung
narrower: Feuerversilberung
narrower: Weißsieden

gebläut
type: Concept
notation: D4B599
created: 2026-01-30
issued: 2026-01-30
modified: 2026-02-04
publisher: Leibniz-Zentrum für Archäologie (LEIZA)
broader: Verzierungstechnik
broader transitive: Verzierungstechnik
broader transitive: [Untersuchungsergebnisse]
broader transitive: Zustandserfassung
broader transitive: Objektuntersuchung
broader transitive: Technologische Auswertung
in scheme: Konservierungs- und Restaurierungsfachthesaurus für archäologische Kulturgüter
pref label: gebläut
  type: Label
  rank: preferred
alternative label: Bläuung
alt label: Bläuung
  type: Label
  rank: preferred

aufgefädelt
type: Concept
notation: DA2GD2
created: 2026-01-30
issued: 2026-01-30
modified: 2026-02-04
publisher: Leibniz-Zentrum für Archäologie (LEIZA)
alternative label: Auffädelung
broader: Verzierungstechnik
broader transitive: [Untersuchungsergebnisse]
broader transitive: Zustandserfassung
broader transitive: Objektuntersuchung
broader transitive: Verzierungstechnik
broader transitive: Technologische Auswertung
in scheme: Konservierungs- und Restaurierungsfachthesaurus für archäologische Kulturgüter
alt label: Auffädelung
  type: Label
  rank: preferred
pref label: aufgefädelt
  type: Label
  rank: preferred

gepicht
type: Concept
notation: DCF2A5
created: 2026-01-30
issued: 2026-01-30
modified: 2026-02-04
publisher: Leibniz-Zentrum für Archäologie (LEIZA)
broader: Verzierungstechnik
broader transitive: Verzierungstechnik
broader transitive: [Untersuchungsergebnisse]
broader transitive: Zustandserfassung
broader transitive: Objektuntersuchung
broader transitive: Technologische Auswertung
in scheme: Konservierungs- und Restaurierungsfachthesaurus für archäologische Kulturgüter
pref label: gepicht
  type: Label
  rank: preferred

graviert
type: Concept
notation: DF7759
created: 2026-01-30
issued: 2026-01-30
modified: 2026-02-04
publisher: Leibniz-Zentrum für Archäologie (LEIZA)
alternative label: Gravierung
alternative label: Gravur
broader: Verzierungstechnik
broader transitive: Verzierungstechnik
broader transitive: [Untersuchungsergebnisse]
broader transitive: Zustandserfassung
broader transitive: Objektuntersuchung
broader transitive: Technologische Auswertung
definition: Verzierungstechnik, bei der Muster, Schriften oder Motive durch das Herausschneiden von Material aus der Oberfläche eines Werkstücks angefertigt werden. Diese Vertiefungen werden mithilfe von Sticheln erzeugt, wobei die Stichelspitze dabei einem spanabhebenden Keil entspricht. Dieser wird in einem schrägen Winkel auf das Metall aufgesetzt und mit Handkraft in das Metall eingedrückt sowie gleichzeitig vorwäts geschoben. Zur Erzeugung unterschiedlicher Furchen kommen Stichel unterschiedlicher Form und Breite zum Einsatz.
definition:
  literal form: Verzierungstechnik, bei der Muster, Schriften oder Motive durch das Herausschneiden von Material aus der Oberfläche eines Werkstücks angefertigt werden. Diese Vertiefungen werden mithilfe von Sticheln erzeugt, wobei die Stichelspitze dabei einem spanabhebenden Keil entspricht. Dieser wird in einem schrägen Winkel auf das Metall aufgesetzt und mit Handkraft in das Metall eingedrückt sowie gleichzeitig vorwäts geschoben. Zur Erzeugung unterschiedlicher Furchen kommen Stichel unterschiedlicher Form und Breite zum Einsatz.
in scheme: Konservierungs- und Restaurierungsfachthesaurus für archäologische Kulturgüter
alt label: Gravur
  type: Label
  rank: preferred
alt label: Gravierung
  type: Label
  rank: normal
pref label: graviert
  type: Label
  rank: preferred

glasiert
type: Concept
notation: F2AG55
created: 2026-01-30
issued: 2026-01-30
modified: 2026-02-04
publisher: Leibniz-Zentrum für Archäologie (LEIZA)
alternative label: Glasur
broader: Verzierungstechnik
broader transitive: [Untersuchungsergebnisse]
broader transitive: Zustandserfassung
broader transitive: Objektuntersuchung
broader transitive: Technologische Auswertung
broader transitive: Verzierungstechnik
definition: Verzierungstechnik an Keramikobjekten, bei der eine dünne Lage aus Glas auf die Keramikoberfläche aufgeschmolzen wird. Diese Glasur soll die Keramik in der Regel gegen Wasseraufnahme abdichten, eine härtere, beständigere Oberfläche und/oder schlicht ein dekorativeres Erscheinungsbild erzeugen. Je nach gewünschter Optik können Glasuren aus verschiedenen gemahlenen Gesteinen oder Gläsern (Fritten), Metalloxyden und -salzen sowie weiteren Hilfsstoffen erzeugt werden.
definition:
  literal form: Verzierungstechnik an Keramikobjekten, bei der eine dünne Lage aus Glas auf die Keramikoberfläche aufgeschmolzen wird. Diese Glasur soll die Keramik in der Regel gegen Wasseraufnahme abdichten, eine härtere, beständigere Oberfläche und/oder schlicht ein dekorativeres Erscheinungsbild erzeugen. Je nach gewünschter Optik können Glasuren aus verschiedenen gemahlenen Gesteinen oder Gläsern (Fritten), Metalloxyden und -salzen sowie weiteren Hilfsstoffen erzeugt werden.
in scheme: Konservierungs- und Restaurierungsfachthesaurus für archäologische Kulturgüter
alt label: Glasur
  type: Label
  rank: preferred
pref label: glasiert
  type: Label
  rank: preferred
narrower: Unterglasurdekor
narrower: Aufglasurdekor

bemalt
type: Concept
notation: F396G6
created: 2026-01-30
issued: 2026-01-30
modified: 2026-02-04
publisher: Leibniz-Zentrum für Archäologie (LEIZA)
alternative label: Bemalung
broader: Verzierungstechnik
broader transitive: [Untersuchungsergebnisse]
broader transitive: Zustandserfassung
broader transitive: Objektuntersuchung
broader transitive: Technologische Auswertung
broader transitive: Verzierungstechnik
definition: Verzierungstechnik, bei durch gezielten Farbauftrag dekorative Muster, Formen oder Motive auf die Objektoberfläche erzeugt werden.
in scheme: Konservierungs- und Restaurierungsfachthesaurus für archäologische Kulturgüter
alt label: Bemalung
  type: Label
  rank: preferred
pref label: bemalt
  type: Label
  rank: preferred
narrower: Schlickermalerei
narrower: kaltbemalt
narrower: hintermalt
narrower: lackiert

graphiert
type: Concept
notation: F4BD7F
created: 2026-01-30
issued: 2026-01-30
modified: 2026-02-04
publisher: Leibniz-Zentrum für Archäologie (LEIZA)
broader: Verzierungstechnik
broader transitive: Verzierungstechnik
broader transitive: [Untersuchungsergebnisse]
broader transitive: Zustandserfassung
broader transitive: Objektuntersuchung
broader transitive: Technologische Auswertung
in scheme: Konservierungs- und Restaurierungsfachthesaurus für archäologische Kulturgüter
pref label: graphiert
  type: Label
  rank: preferred

profiliert
type: Concept
notation: F7F934
created: 2026-01-30
issued: 2026-01-30
modified: 2026-02-04
publisher: Leibniz-Zentrum für Archäologie (LEIZA)
broader: Verzierungstechnik
broader transitive: Verzierungstechnik
broader transitive: [Untersuchungsergebnisse]
broader transitive: Zustandserfassung
broader transitive: Objektuntersuchung
broader transitive: Technologische Auswertung
in scheme: Konservierungs- und Restaurierungsfachthesaurus für archäologische Kulturgüter
pref label: profiliert
  type: Label
  rank: preferred

poliert
type: Concept
notation: FBF2A3
created: 2026-01-30
issued: 2026-01-30
modified: 2026-02-04
publisher: Leibniz-Zentrum für Archäologie (LEIZA)
broader: Verzierungstechnik
broader transitive: Verzierungstechnik
broader transitive: [Untersuchungsergebnisse]
broader transitive: Zustandserfassung
broader transitive: Objektuntersuchung
broader transitive: Technologische Auswertung
in scheme: Konservierungs- und Restaurierungsfachthesaurus für archäologische Kulturgüter
pref label: poliert
  type: Label
  rank: preferred
alternative label: Politur
alt label: Politur
  type: Label
  rank: preferred

gesandet
type: Concept
notation: FC926G
created: 2026-01-30
issued: 2026-01-30
modified: 2026-02-04
publisher: Leibniz-Zentrum für Archäologie (LEIZA)
broader: Verzierungstechnik
broader transitive: Verzierungstechnik
broader transitive: [Untersuchungsergebnisse]
broader transitive: Zustandserfassung
broader transitive: Objektuntersuchung
broader transitive: Technologische Auswertung
in scheme: Konservierungs- und Restaurierungsfachthesaurus für archäologische Kulturgüter
pref label: gesandet
  type: Label
  rank: preferred

punziert
type: Concept
notation: FD6617
created: 2026-01-30
issued: 2026-01-30
modified: 2026-02-04
publisher: Leibniz-Zentrum für Archäologie (LEIZA)
alternative label: Punzierung
broader: Verzierungstechnik
broader transitive: Verzierungstechnik
broader transitive: [Untersuchungsergebnisse]
broader transitive: Zustandserfassung
broader transitive: Objektuntersuchung
broader transitive: Technologische Auswertung
in scheme: Konservierungs- und Restaurierungsfachthesaurus für archäologische Kulturgüter
alt label: Punzierung
  type: Label
  rank: preferred
pref label: punziert
  type: Label
  rank: preferred

durchbrochen (Verzierungstechnik)
type: Concept
notation: FFFCB7
created: 2026-01-30
issued: 2026-01-30
modified: 2026-02-04
publisher: Leibniz-Zentrum für Archäologie (LEIZA)
alternative label: Durchbruch (Verzierungstechnik)
broader: Verzierungstechnik
broader transitive: Verzierungstechnik
broader transitive: [Untersuchungsergebnisse]
broader transitive: Zustandserfassung
broader transitive: Objektuntersuchung
broader transitive: Technologische Auswertung
in scheme: Konservierungs- und Restaurierungsfachthesaurus für archäologische Kulturgüter
alt label: Durchbruch (Verzierungstechnik)
  type: Label
  rank: preferred
pref label: durchbrochen (Verzierungstechnik)
  type: Label
  rank: preferred

überzogen
type: Concept
notation: G2FA26
created: 2026-01-30
issued: 2026-01-30
modified: 2026-02-04
publisher: Leibniz-Zentrum für Archäologie (LEIZA)
broader: Verzierungstechnik
broader transitive: Verzierungstechnik
broader transitive: [Untersuchungsergebnisse]
broader transitive: Zustandserfassung
broader transitive: Objektuntersuchung
broader transitive: Technologische Auswertung
in scheme: Konservierungs- und Restaurierungsfachthesaurus für archäologische Kulturgüter
pref label: überzogen
  type: Label
  rank: preferred
alternative label: Überzug
alt label: Überzug
  type: Label
  rank: preferred

appliziert
type: Concept
notation: G2FC47
created: 2026-01-30
issued: 2026-01-30
modified: 2026-02-04
publisher: Leibniz-Zentrum für Archäologie (LEIZA)
alternative label: Applikation
broader: Verzierungstechnik
broader transitive: Verzierungstechnik
broader transitive: [Untersuchungsergebnisse]
broader transitive: Zustandserfassung
broader transitive: Objektuntersuchung
broader transitive: Technologische Auswertung
in scheme: Konservierungs- und Restaurierungsfachthesaurus für archäologische Kulturgüter
alt label: Applikation
  type: Label
  rank: preferred
pref label: appliziert
  type: Label
  rank: preferred

engobiert
type: Concept
notation: G56866
created: 2026-01-30
issued: 2026-01-30
modified: 2026-02-04
publisher: Leibniz-Zentrum für Archäologie (LEIZA)
alternative label: Engobe
broader: Verzierungstechnik
broader transitive: [Untersuchungsergebnisse]
broader transitive: Zustandserfassung
broader transitive: Objektuntersuchung
broader transitive: Technologische Auswertung
broader transitive: Verzierungstechnik
definition: Verzierungstechnik an Keramikobjekten, bei der der Keramikscherben mit einer Engobe - d.h. einer dünnen Beschichtung einer andersfarbigen oder qualitätvolleren Keramik überzogen wurde. Dies kann z.B. zum Zwecke haben einen "minderwertigeren" Ton zu überdecken oder eine homogene Grundlage für eine anschließende Bemalung zu schaffen. Hierzu wird entweder das gesamte Gefäß in einen dünnen Tonschlicker getaucht oder dieser gezielt auf das Objekt aufgetragen. Durch einen anschließenden Brand versintert die Tonschlickerschicht und es entsteht eine dichte Engobe auf der Scherbenoberfläche.
definition:
  literal form: Verzierungstechnik an Keramikobjekten, bei der der Keramikscherben mit einer Engobe - d.h. einer dünnen Beschichtung einer andersfarbigen oder qualitätvolleren Keramik überzogen wurde. Dies kann z.B. zum Zwecke haben einen "minderwertigeren" Ton zu überdecken oder eine homogene Grundlage für eine anschließende Bemalung zu schaffen. Hierzu wird entweder das gesamte Gefäß in einen dünnen Tonschlicker getaucht oder dieser gezielt auf das Objekt aufgetragen. Durch einen anschließenden Brand versintert die Tonschlickerschicht und es entsteht eine dichte Engobe auf der Scherbenoberfläche.
in scheme: Konservierungs- und Restaurierungsfachthesaurus für archäologische Kulturgüter
alt label: Engobe
  type: Label
  rank: preferred
pref label: engobiert
  type: Label
  rank: preferred

broschiert
type: Concept
notation: G5D8C5
created: 2026-01-30
issued: 2026-01-30
modified: 2026-02-04
publisher: Leibniz-Zentrum für Archäologie (LEIZA)
broader: Verzierungstechnik
broader transitive: [Untersuchungsergebnisse]
broader transitive: Zustandserfassung
broader transitive: Objektuntersuchung
broader transitive: Technologische Auswertung
broader transitive: Verzierungstechnik
in scheme: Konservierungs- und Restaurierungsfachthesaurus für archäologische Kulturgüter
pref label: broschiert
  type: Label
  rank: preferred

geschliffen (Verzierungstechnik)
type: Concept
notation: G6841G
created: 2026-01-30
issued: 2026-01-30
modified: 2026-02-04
publisher: Leibniz-Zentrum für Archäologie (LEIZA)
broader: Verzierungstechnik
broader transitive: Verzierungstechnik
broader transitive: [Untersuchungsergebnisse]
broader transitive: Zustandserfassung
broader transitive: Objektuntersuchung
broader transitive: Technologische Auswertung
in scheme: Konservierungs- und Restaurierungsfachthesaurus für archäologische Kulturgüter
pref label: geschliffen (Verzierungstechnik)
  type: Label
  rank: preferred
definition: spanabhebende Verzierungstechnik, bei der die Oberfläche eines Werkstückes gezielt mit Hilfe von Schleifwerkzeugen (Schleifmittelträger, auf dem eine Vielzahl von harten Schleifkörnern in gebundener oder loser Form aufgebracht sind) bearbeitet wird. Die scharfen, geometrisch unbestimmten Kanten und Schneiden der Schleifkörner tragen feine Späne von der Oberfläche des Materials ab und hinterlassen, je nach verwendetem Schleifwerkzeug, eine spezifische Oberflächenbeschaffenheit. Mit Hilfe rotierender Schleifkörper können dabei auch gezielte Formen und Muster in die Oberfläche eingeschliffen werden.
definition:
  literal form: spanabhebende Verzierungstechnik, bei der die Oberfläche eines Werkstückes gezielt mit Hilfe von Schleifwerkzeugen (Schleifmittelträger, auf dem eine Vielzahl von harten Schleifkörnern in gebundener oder loser Form aufgebracht sind) bearbeitet wird. Die scharfen, geometrisch unbestimmten Kanten und Schneiden der Schleifkörner tragen feine Späne von der Oberfläche des Materials ab und hinterlassen, je nach verwendetem Schleifwerkzeug, eine spezifische Oberflächenbeschaffenheit. Mit Hilfe rotierender Schleifkörper können dabei auch gezielte Formen und Muster in die Oberfläche eingeschliffen werden.
alternative label: beschliffen
alternative label: eingeschliffen
alt label: beschliffen
  type: Label
  rank: preferred
alt label: eingeschliffen
  type: Label
  rank: normal

gefärbt
type: Concept
notation: G73958
created: 2026-01-30
issued: 2026-01-30
modified: 2026-02-04
publisher: Leibniz-Zentrum für Archäologie (LEIZA)
broader: Verzierungstechnik
broader transitive: [Untersuchungsergebnisse]
broader transitive: Zustandserfassung
broader transitive: Objektuntersuchung
broader transitive: Technologische Auswertung
broader transitive: Verzierungstechnik
in scheme: Konservierungs- und Restaurierungsfachthesaurus für archäologische Kulturgüter
pref label: gefärbt
  type: Label
  rank: preferred
alternative label: Färbung
alt label: Färbung
  type: Label
  rank: preferred

bestickt
type: Concept
notation: G7F25F
created: 2026-01-30
issued: 2026-01-30
modified: 2026-02-04
publisher: Leibniz-Zentrum für Archäologie (LEIZA)
broader: Verzierungstechnik
broader transitive: [Untersuchungsergebnisse]
broader transitive: Zustandserfassung
broader transitive: Objektuntersuchung
broader transitive: Technologische Auswertung
broader transitive: Verzierungstechnik
definition: textile Verzierungstechnik, bei der Fäden mit Hilfe einer Nadel in ein Trägermaterial (Stoff, Leder, etc.) eingearbeitet werden, um dekorative Muster oder Schriftzüge zu erzeugen. Die Einarbeitung der Fäden erfolgt dabei mit unterschiedlichen Sticharten, um einfach Linie bis flächige Füllungen von Formen zu erzielen.
definition:
  literal form: textile Verzierungstechnik, bei der Fäden mit Hilfe einer Nadel in ein Trägermaterial (Stoff, Leder, etc.) eingearbeitet werden, um dekorative Muster oder Schriftzüge zu erzeugen. Die Einarbeitung der Fäden erfolgt dabei mit unterschiedlichen Sticharten, um einfach Linie bis flächige Füllungen von Formen zu erzielen.
in scheme: Konservierungs- und Restaurierungsfachthesaurus für archäologische Kulturgüter
pref label: bestickt
  type: Label
  rank: preferred
alternative label: Sticken
alternative label: Stickerei
alt label: Stickerei
  type: Label
  rank: preferred
alt label: Sticken
  type: Label
  rank: normal

vergoldet
type: Concept
notation: GC2F6A
created: 2026-01-30
issued: 2026-01-30
modified: 2026-02-04
publisher: Leibniz-Zentrum für Archäologie (LEIZA)
alternative label: Vergoldung
broader: Verzierungstechnik
broader transitive: [Untersuchungsergebnisse]
broader transitive: Zustandserfassung
broader transitive: Objektuntersuchung
broader transitive: Verzierungstechnik
broader transitive: Technologische Auswertung
definition: Verzierungstechnik, bei der eine dünne Schicht aus Gold auf eine Oberfläche aufgetragen wird, um diese mit einem dekorativen und schützenden Überzug zu versehen. Der Auftrag des Goldes kann durch verschiedene mechanische, thermische oder (elekro-)chemische Methoden erfolgen.
definition:
  literal form: Verzierungstechnik, bei der eine dünne Schicht aus Gold auf eine Oberfläche aufgetragen wird, um diese mit einem dekorativen und schützenden Überzug zu versehen. Der Auftrag des Goldes kann durch verschiedene mechanische, thermische oder (elekro-)chemische Methoden erfolgen.
in scheme: Konservierungs- und Restaurierungsfachthesaurus für archäologische Kulturgüter
alt label: Vergoldung
  type: Label
  rank: preferred
pref label: vergoldet
  type: Label
  rank: preferred
narrower: Blattvergoldung
narrower: Abreichungsvergoldung
narrower: Anreibevergoldung
narrower: Feuervergoldung
narrower: Diffusionsvergoldung

geschnitzt (Verzierungstechnik)
type: Concept
notation: GD11CD
created: 2026-01-30
issued: 2026-01-30
modified: 2026-02-04
publisher: Leibniz-Zentrum für Archäologie (LEIZA)
alternative label: Schnitzung
broader: Verzierungstechnik
broader transitive: Verzierungstechnik
broader transitive: [Untersuchungsergebnisse]
broader transitive: Zustandserfassung
broader transitive: Objektuntersuchung
broader transitive: Technologische Auswertung
in scheme: Konservierungs- und Restaurierungsfachthesaurus für archäologische Kulturgüter
alt label: Schnitzung
  type: Label
  rank: preferred
pref label: geschnitzt (Verzierungstechnik)
  type: Label
  rank: preferred

tauschiert
type: Concept
notation: BGC695
created: 2026-01-30
issued: 2026-01-30
modified: 2026-02-04
publisher: Leibniz-Zentrum für Archäologie (LEIZA)
alternative label: Tauschierung
broader: Intarsieneinlage
broader transitive: Verzierungstechnik
broader transitive: [Untersuchungsergebnisse]
broader transitive: Zustandserfassung
broader transitive: Objektuntersuchung
broader transitive: Technologische Auswertung
broader transitive: Intarsieneinlage
definition: Metall-Intarsia, bei der weiche Metalle unterschiedlicher Farben bzw. Legierungen in vorgearbeitete Vertiefungen einer härteren Metalloberfläche eingelegt werden. Die dünnen Drähte, Bleche oder anderen Formen werden mechanisch durch Hämmern, Pressen oder Anreiben fixiert. Auf diese Weise entstehen, durch den Farbunterschied zwischen Einlage- und Grundmetall, dekorative Muster.
definition:
  literal form: Metall-Intarsia, bei der weiche Metalle unterschiedlicher Farben bzw. Legierungen in vorgearbeitete Vertiefungen einer härteren Metalloberfläche eingelegt werden. Die dünnen Drähte, Bleche oder anderen Formen werden mechanisch durch Hämmern, Pressen oder Anreiben fixiert. Auf diese Weise entstehen, durch den Farbunterschied zwischen Einlage- und Grundmetall, dekorative Muster.
in scheme: Konservierungs- und Restaurierungsfachthesaurus für archäologische Kulturgüter
alt label: Tauschierung
  type: Label
  rank: preferred
pref label: tauschiert
  type: Label
  rank: preferred

Schlickermalerei
type: Concept
notation: A19F86
created: 2026-01-30
issued: 2026-01-30
modified: 2026-02-04
publisher: Leibniz-Zentrum für Archäologie (LEIZA)
alternative label: Engobenmalerei
alternative label: Tonschlickermalerei
broader: bemalt
broader transitive: bemalt
broader transitive: [Untersuchungsergebnisse]
broader transitive: Zustandserfassung
broader transitive: Objektuntersuchung
broader transitive: Technologische Auswertung
broader transitive: Verzierungstechnik
definition: Verzierungstechnik an Keramikobjekten, bei der mit einem dünnen Schlickerton Muster, Figuren oder ganze Darstellungen auf das in der Regel ungebrannte, halbtrockene Objekt gemalt werden. Anschließend wird der Schlickerton eingebrannt und es entsteht eine versinterte Keramikschicht auf der Objektoberfläche.
definition:
  literal form: Verzierungstechnik an Keramikobjekten, bei der mit einem dünnen Schlickerton Muster, Figuren oder ganze Darstellungen auf das in der Regel ungebrannte, halbtrockene Objekt gemalt werden. Anschließend wird der Schlickerton eingebrannt und es entsteht eine versinterte Keramikschicht auf der Objektoberfläche.
in scheme: Konservierungs- und Restaurierungsfachthesaurus für archäologische Kulturgüter
alt label: Engobenmalerei
  type: Label
  rank: preferred
alt label: Tonschlickermalerei
  type: Label
  rank: normal
pref label: Schlickermalerei
  type: Label
  rank: preferred

kaltbemalt
type: Concept
notation: A21993
created: 2026-01-30
issued: 2026-01-30
modified: 2026-02-04
publisher: Leibniz-Zentrum für Archäologie (LEIZA)
alternative label: Kaltbemalung
alternative label: kalte Bemalung
broader: bemalt
broader transitive: bemalt
broader transitive: [Untersuchungsergebnisse]
broader transitive: Zustandserfassung
broader transitive: Objektuntersuchung
broader transitive: Technologische Auswertung
broader transitive: Verzierungstechnik
definition: Verzierungstechnik, bei der Keramik- oder Glasobjekte mit farbigen Dekormalereien versehen werde, ohne dass ein weiterer Brand erfolgt. Die Farben bleiben auf der Oberfläche und sind daher weniger dauerhaft, da keine Verschmelzung mit einer Glasur bzw. der Glasoberfläche erfolgt.
definition:
  literal form: Verzierungstechnik, bei der Keramik- oder Glasobjekte mit farbigen Dekormalereien versehen werde, ohne dass ein weiterer Brand erfolgt. Die Farben bleiben auf der Oberfläche und sind daher weniger dauerhaft, da keine Verschmelzung mit einer Glasur bzw. der Glasoberfläche erfolgt.
in scheme: Konservierungs- und Restaurierungsfachthesaurus für archäologische Kulturgüter
alt label: Kaltbemalung
  type: Label
  rank: preferred
alt label: kalte Bemalung
  type: Label
  rank: normal
pref label: kaltbemalt
  type: Label
  rank: preferred

hintermalt
type: Concept
notation: B225DC
created: 2026-01-30
issued: 2026-01-30
modified: 2026-02-04
publisher: Leibniz-Zentrum für Archäologie (LEIZA)
alternative label: Hintermalung
broader: bemalt
broader transitive: bemalt
broader transitive: [Untersuchungsergebnisse]
broader transitive: Zustandserfassung
broader transitive: Objektuntersuchung
broader transitive: Technologische Auswertung
broader transitive: Verzierungstechnik
in scheme: Konservierungs- und Restaurierungsfachthesaurus für archäologische Kulturgüter
alt label: Hintermalung
  type: Label
  rank: preferred
pref label: hintermalt
  type: Label
  rank: preferred

Unterglasurdekor
type: Concept
notation: CG1531
created: 2026-01-30
issued: 2026-01-30
modified: 2026-02-04
publisher: Leibniz-Zentrum für Archäologie (LEIZA)
broader: glasiert
broader transitive: [Untersuchungsergebnisse]
broader transitive: Zustandserfassung
broader transitive: Objektuntersuchung
broader transitive: Technologische Auswertung
broader transitive: Verzierungstechnik
broader transitive: glasiert
definition: Glasurtechnik, bei der gezielte Muster, Formen oder Motive direkt auf das unglasierten Keramikobjekt oder in/auf eine Grundglasur aufgetragen werden. Anschließend wird eine flächige Glasur darüber aufgebracht, wodurch der Dekor durch die Glasurschicht geschützt ist. Im Ergebnis wirkt der Dekor optisch vertieft innerhalb der Glasur.
definition:
  literal form: Glasurtechnik, bei der gezielte Muster, Formen oder Motive direkt auf das unglasierten Keramikobjekt oder in/auf eine Grundglasur aufgetragen werden. Anschließend wird eine flächige Glasur darüber aufgebracht, wodurch der Dekor durch die Glasurschicht geschützt ist. Im Ergebnis wirkt der Dekor optisch vertieft innerhalb der Glasur.
in scheme: Konservierungs- und Restaurierungsfachthesaurus für archäologische Kulturgüter
pref label: Unterglasurdekor
  type: Label
  rank: preferred

Aufglasurdekor
type: Concept
notation: D691FG
created: 2026-01-30
issued: 2026-01-30
modified: 2026-02-04
publisher: Leibniz-Zentrum für Archäologie (LEIZA)
broader: glasiert
broader transitive: [Untersuchungsergebnisse]
broader transitive: Zustandserfassung
broader transitive: Objektuntersuchung
broader transitive: Technologische Auswertung
broader transitive: Verzierungstechnik
broader transitive: glasiert
definition: Glasurtechnik, bei Muster, Formen oder Motive als Dekor auf die bereits glasierte und gebrannte Oberfläche der Keramik aufgetragen werden. Im Anschluss wird das Objekt erneut bei niedriger Temperatur gebrannt, sodass die aufgebrachten Farben mit der Glasurschicht verschmelzen.
definition:
  literal form: Glasurtechnik, bei Muster, Formen oder Motive als Dekor auf die bereits glasierte und gebrannte Oberfläche der Keramik aufgetragen werden. Im Anschluss wird das Objekt erneut bei niedriger Temperatur gebrannt, sodass die aufgebrachten Farben mit der Glasurschicht verschmelzen.
in scheme: Konservierungs- und Restaurierungsfachthesaurus für archäologische Kulturgüter
pref label: Aufglasurdekor
  type: Label
  rank: preferred

lackiert
type: Concept
notation: GB8544
created: 2026-01-30
issued: 2026-01-30
modified: 2026-02-04
publisher: Leibniz-Zentrum für Archäologie (LEIZA)
alternative label: Lackierung
broader: bemalt
broader transitive: bemalt
broader transitive: [Untersuchungsergebnisse]
broader transitive: Zustandserfassung
broader transitive: Objektuntersuchung
broader transitive: Technologische Auswertung
broader transitive: Verzierungstechnik
in scheme: Konservierungs- und Restaurierungsfachthesaurus für archäologische Kulturgüter
alt label: Lackierung
  type: Label
  rank: preferred
pref label: lackiert
  type: Label
  rank: preferred

Ölvergoldung
type: Concept
notation: DF986A
created: 2026-01-30
issued: 2026-01-30
modified: 2026-02-04
publisher: Leibniz-Zentrum für Archäologie (LEIZA)
broader: Blattvergoldung
broader transitive: [Untersuchungsergebnisse]
broader transitive: Zustandserfassung
broader transitive: Objektuntersuchung
broader transitive: Verzierungstechnik
broader transitive: Technologische Auswertung
broader transitive: Blattvergoldung
broader transitive: vergoldet
definition: Blattvergoldungstechnik, bei der Blattgold auf eine mit einem speziellen harzhaltigen Klebstoff (Ölmixtion) vorbereitete Oberfläche aufgetragen wird.
in scheme: Konservierungs- und Restaurierungsfachthesaurus für archäologische Kulturgüter
pref label: Ölvergoldung
  type: Label
  rank: preferred

Blattvergoldung
type: Concept
notation: GG6A8B
created: 2026-01-30
issued: 2026-01-30
modified: 2026-02-04
publisher: Leibniz-Zentrum für Archäologie (LEIZA)
alternative label: Folienvergoldung
broader: vergoldet
broader transitive: [Untersuchungsergebnisse]
broader transitive: Zustandserfassung
broader transitive: Objektuntersuchung
broader transitive: Verzierungstechnik
broader transitive: Technologische Auswertung
broader transitive: vergoldet
definition: mechanische Verzierungstechnik, bei der dünne Blattgoldfolien auf die zu verzierende Oberfläche aufgebracht werden.
in scheme: Konservierungs- und Restaurierungsfachthesaurus für archäologische Kulturgüter
alt label: Folienvergoldung
  type: Label
  rank: preferred
pref label: Blattvergoldung
  type: Label
  rank: preferred
narrower: Ölvergoldung
narrower: Polimentvergoldung

Abreichungsvergoldung
type: Concept
notation: F3684F
created: 2026-01-30
issued: 2026-01-30
modified: 2026-02-04
publisher: Leibniz-Zentrum für Archäologie (LEIZA)
alternative label: Gelbsieden
broader: vergoldet
broader transitive: [Untersuchungsergebnisse]
broader transitive: Zustandserfassung
broader transitive: Objektuntersuchung
broader transitive: Verzierungstechnik
broader transitive: Technologische Auswertung
broader transitive: vergoldet
definition: historische Vergoldungstechnik, bei der eine Gold-Legierung chemisch behandelt wird, um die Oberfläche anzureichern. Durch eine Säurebehandlung, meist mit Salpetersäure oder einer Mischung aus Salz- und Schwefelsäure, wird das weniger edle Silber und/oder Kupfer aus den oberflächennahen Schichten der Legierung gelöst. Dadurch entsteht eine feine Schicht aus reinem Gold auf der Oberfläche, die eine intensive goldene Farbgebung aufweist.
definition:
  literal form: historische Vergoldungstechnik, bei der eine Gold-Legierung chemisch behandelt wird, um die Oberfläche anzureichern. Durch eine Säurebehandlung, meist mit Salpetersäure oder einer Mischung aus Salz- und Schwefelsäure, wird das weniger edle Silber und/oder Kupfer aus den oberflächennahen Schichten der Legierung gelöst. Dadurch entsteht eine feine Schicht aus reinem Gold auf der Oberfläche, die eine intensive goldene Farbgebung aufweist.
in scheme: Konservierungs- und Restaurierungsfachthesaurus für archäologische Kulturgüter
alt label: Gelbsieden
  type: Label
  rank: preferred
pref label: Abreichungsvergoldung
  type: Label
  rank: preferred

Anreibevergoldung
type: Concept
notation: G16D2G
created: 2026-01-30
issued: 2026-01-30
modified: 2026-02-04
publisher: Leibniz-Zentrum für Archäologie (LEIZA)
broader: vergoldet
broader transitive: [Untersuchungsergebnisse]
broader transitive: Zustandserfassung
broader transitive: Objektuntersuchung
broader transitive: Verzierungstechnik
broader transitive: Technologische Auswertung
broader transitive: vergoldet
in scheme: Konservierungs- und Restaurierungsfachthesaurus für archäologische Kulturgüter
pref label: Anreibevergoldung
  type: Label
  rank: preferred

Polimentvergoldung
type: Concept
notation: GBACB4
created: 2026-01-30
issued: 2026-01-30
modified: 2026-02-04
publisher: Leibniz-Zentrum für Archäologie (LEIZA)
broader: Blattvergoldung
broader transitive: [Untersuchungsergebnisse]
broader transitive: Zustandserfassung
broader transitive: Objektuntersuchung
broader transitive: Technologische Auswertung
broader transitive: Verzierungstechnik
broader transitive: Blattvergoldung
broader transitive: vergoldet
in scheme: Konservierungs- und Restaurierungsfachthesaurus für archäologische Kulturgüter
pref label: Polimentvergoldung
  type: Label
  rank: preferred
definition: Blattvergoldungstechnik, bei der das Blattgold auf eine mit Poliment, einem mit organischem Leim gebundenen Kreidegrund, vorbereitete Oberfläche aufgetragen wird. Nach dem Trocknen wird das Gold mit einem Achat- oder Polierstein auf Hochglanz poliert, wodurch eine besonders glänzende und edle Oberfläche entsteht. Die Polimentvergoldung ist empfindlich gegenüber Feuchtigkeit, wesshalb diese Technik ausschließlich in Innenbereichen zum Einsatz kommt.
definition:
  literal form: Blattvergoldungstechnik, bei der das Blattgold auf eine mit Poliment, einem mit organischem Leim gebundenen Kreidegrund, vorbereitete Oberfläche aufgetragen wird. Nach dem Trocknen wird das Gold mit einem Achat- oder Polierstein auf Hochglanz poliert, wodurch eine besonders glänzende und edle Oberfläche entsteht. Die Polimentvergoldung ist empfindlich gegenüber Feuchtigkeit, wesshalb diese Technik ausschließlich in Innenbereichen zum Einsatz kommt.

Feuervergoldung
type: Concept
notation: GC8DCD
created: 2026-01-30
issued: 2026-01-30
modified: 2026-02-04
publisher: Leibniz-Zentrum für Archäologie (LEIZA)
broader: vergoldet
broader transitive: [Untersuchungsergebnisse]
broader transitive: Zustandserfassung
broader transitive: Objektuntersuchung
broader transitive: Verzierungstechnik
broader transitive: Technologische Auswertung
broader transitive: vergoldet
definition: historische Vergoldungstechnik, bei der eine Mischung aus Gold und Quecksilber (Amalgam) auf eine metallische Oberfläche aufgetragen wird. Durch Erhitzen verdampft das Quecksilber, sodass eine gleichmäßige Goldschicht zurückbleibt, die mit der Oberfläche fest verbunden ist. Diese Technik wurde vor allem in der Antike und bis ins 19. Jahrhundert verwendet, um dauerhafte und widerstandsfähige Vergoldungen zu erzeugen, birgt jedoch erhebliche gesundheitliche Risiken durch die giftigen Quecksilberdämpfe. Heute wird das Verfahren aufgrund seiner Gefährlichkeit kaum mehr angewandt, spielt aber in der Restaurierung historischer Objekte eine Rolle.
definition:
  literal form: historische Vergoldungstechnik, bei der eine Mischung aus Gold und Quecksilber (Amalgam) auf eine metallische Oberfläche aufgetragen wird. Durch Erhitzen verdampft das Quecksilber, sodass eine gleichmäßige Goldschicht zurückbleibt, die mit der Oberfläche fest verbunden ist. Diese Technik wurde vor allem in der Antike und bis ins 19. Jahrhundert verwendet, um dauerhafte und widerstandsfähige Vergoldungen zu erzeugen, birgt jedoch erhebliche gesundheitliche Risiken durch die giftigen Quecksilberdämpfe. Heute wird das Verfahren aufgrund seiner Gefährlichkeit kaum mehr angewandt, spielt aber in der Restaurierung historischer Objekte eine Rolle.
in scheme: Konservierungs- und Restaurierungsfachthesaurus für archäologische Kulturgüter
pref label: Feuervergoldung
  type: Label
  rank: preferred

Diffusionsvergoldung
type: Concept
notation: GFCC9F
created: 2026-01-30
issued: 2026-01-30
modified: 2026-02-04
publisher: Leibniz-Zentrum für Archäologie (LEIZA)
broader: vergoldet
broader transitive: [Untersuchungsergebnisse]
broader transitive: Zustandserfassung
broader transitive: Objektuntersuchung
broader transitive: Verzierungstechnik
broader transitive: Technologische Auswertung
broader transitive: vergoldet
in scheme: Konservierungs- und Restaurierungsfachthesaurus für archäologische Kulturgüter
pref label: Diffusionsvergoldung
  type: Label
  rank: preferred

Polimentversilberung
type: Concept
notation: AB9FB9
created: 2026-01-30
issued: 2026-01-30
modified: 2026-02-04
publisher: Leibniz-Zentrum für Archäologie (LEIZA)
broader: Blattversilberung
broader transitive: Blattversilberung
broader transitive: [Untersuchungsergebnisse]
broader transitive: Zustandserfassung
broader transitive: Objektuntersuchung
broader transitive: versilbert
broader transitive: Technologische Auswertung
broader transitive: Verzierungstechnik
in scheme: Konservierungs- und Restaurierungsfachthesaurus für archäologische Kulturgüter
pref label: Polimentversilberung
  type: Label
  rank: preferred

Blattversilberung
type: Concept
notation: B47572
created: 2026-01-30
issued: 2026-01-30
modified: 2026-02-04
publisher: Leibniz-Zentrum für Archäologie (LEIZA)
broader: versilbert
broader transitive: [Untersuchungsergebnisse]
broader transitive: Zustandserfassung
broader transitive: Objektuntersuchung
broader transitive: versilbert
broader transitive: Technologische Auswertung
broader transitive: Verzierungstechnik
in scheme: Konservierungs- und Restaurierungsfachthesaurus für archäologische Kulturgüter
pref label: Blattversilberung
  type: Label
  rank: preferred
alternative label: Folienversilberung
definition: mechanische Verzierungstechnik, bei der dünne Blattsilberfolien auf die zu verzierende Oberfläche aufgebracht werden.
alt label: Folienversilberung
  type: Label
  rank: preferred
narrower: Polimentversilberung
narrower: Ölversilberung

Diffusionsversilberung
type: Concept
notation: ACG517
created: 2026-01-30
issued: 2026-01-30
modified: 2026-02-04
publisher: Leibniz-Zentrum für Archäologie (LEIZA)
broader: versilbert
broader transitive: [Untersuchungsergebnisse]
broader transitive: Zustandserfassung
broader transitive: Objektuntersuchung
broader transitive: versilbert
broader transitive: Technologische Auswertung
broader transitive: Verzierungstechnik
in scheme: Konservierungs- und Restaurierungsfachthesaurus für archäologische Kulturgüter
pref label: Diffusionsversilberung
  type: Label
  rank: preferred

Ölversilberung
type: Concept
notation: C24FFA
created: 2026-01-30
issued: 2026-01-30
modified: 2026-02-04
publisher: Leibniz-Zentrum für Archäologie (LEIZA)
broader: Blattversilberung
broader transitive: Blattversilberung
broader transitive: [Untersuchungsergebnisse]
broader transitive: Zustandserfassung
broader transitive: Objektuntersuchung
broader transitive: versilbert
broader transitive: Technologische Auswertung
broader transitive: Verzierungstechnik
in scheme: Konservierungs- und Restaurierungsfachthesaurus für archäologische Kulturgüter
pref label: Ölversilberung
  type: Label
  rank: preferred

Feuerversilberung
type: Concept
notation: BBF51F
created: 2026-01-30
issued: 2026-01-30
modified: 2026-02-04
publisher: Leibniz-Zentrum für Archäologie (LEIZA)
broader: versilbert
broader transitive: [Untersuchungsergebnisse]
broader transitive: Zustandserfassung
broader transitive: Objektuntersuchung
broader transitive: versilbert
broader transitive: Technologische Auswertung
broader transitive: Verzierungstechnik
in scheme: Konservierungs- und Restaurierungsfachthesaurus für archäologische Kulturgüter
pref label: Feuerversilberung
  type: Label
  rank: preferred

Weißsieden
type: Concept
notation: FDB79A
created: 2026-01-30
issued: 2026-01-30
modified: 2026-02-04
publisher: Leibniz-Zentrum für Archäologie (LEIZA)
broader: versilbert
broader transitive: [Untersuchungsergebnisse]
broader transitive: Zustandserfassung
broader transitive: Objektuntersuchung
broader transitive: versilbert
broader transitive: Technologische Auswertung
broader transitive: Verzierungstechnik
in scheme: Konservierungs- und Restaurierungsfachthesaurus für archäologische Kulturgüter
pref label: Weißsieden
  type: Label
  rank: preferred
alternative label: Abreichungsversilberung
alt label: Abreichungsversilberung
  type: Label
  rank: preferred

Schnurabdruckdekor
type: Concept
notation: C27GA2
created: 2026-01-30
issued: 2026-01-30
modified: 2026-02-04
publisher: Leibniz-Zentrum für Archäologie (LEIZA)
broader: eingedrückt
broader transitive: eingedrückt
broader transitive: Verzierungstechnik
broader transitive: [Untersuchungsergebnisse]
broader transitive: Zustandserfassung
broader transitive: Objektuntersuchung
broader transitive: Technologische Auswertung
in scheme: Konservierungs- und Restaurierungsfachthesaurus für archäologische Kulturgüter
pref label: Schnurabdruckdekor
  type: Label
  rank: preferred

Linienbanddekor
type: Concept
notation: F56B83
created: 2026-01-30
issued: 2026-01-30
modified: 2026-02-04
publisher: Leibniz-Zentrum für Archäologie (LEIZA)
broader: eingedrückt
broader transitive: eingedrückt
broader transitive: Verzierungstechnik
broader transitive: [Untersuchungsergebnisse]
broader transitive: Zustandserfassung
broader transitive: Objektuntersuchung
broader transitive: Technologische Auswertung
in scheme: Konservierungs- und Restaurierungsfachthesaurus für archäologische Kulturgüter
pref label: Linienbanddekor
  type: Label
  rank: preferred

Rinne
type: Concept
notation: BA8FG7
created: 2026-01-30
issued: 2026-01-30
modified: 2026-02-04
publisher: Leibniz-Zentrum für Archäologie (LEIZA)
broader: Vertiefung
broader transitive: Vertiefung
broader transitive: [Untersuchungsergebnisse]
broader transitive: [Technologische Spuren]
broader transitive: Zustandserfassung
broader transitive: Objektuntersuchung
broader transitive: Technologische Auswertung
definition: breitere, oft u-formige Vertiefung auf der Objektoberfläche.
in scheme: Konservierungs- und Restaurierungsfachthesaurus für archäologische Kulturgüter
pref label: Rinne
  type: Label
  rank: preferred

Vertiefung
type: Concept
notation: C78A4B
created: 2026-01-30
issued: 2026-01-30
modified: 2026-02-04
publisher: Leibniz-Zentrum für Archäologie (LEIZA)
broader: [Technologische Spuren]
broader transitive: [Untersuchungsergebnisse]
broader transitive: [Technologische Spuren]
broader transitive: Zustandserfassung
broader transitive: Objektuntersuchung
broader transitive: Technologische Auswertung
definition: Auf dem Objekt ist eine (oder mehrere) nicht durch das gesamte Material durchgehende Einsenkung zu erkennen, die auf die verwendete Technik zur Herstellung des Objektes zurück zu führen ist.
in scheme: Konservierungs- und Restaurierungsfachthesaurus für archäologische Kulturgüter
pref label: Vertiefung
  type: Label
  rank: preferred
narrower: Rinne
narrower: Eindellung
narrower: Grübchen
narrower: Rille
narrower: Punktierung
narrower: Ritzung
narrower: Kerbung

Glättung (technologische Spur)
type: Concept
notation: BF7FDB
created: 2026-01-30
issued: 2026-01-30
modified: 2026-02-04
publisher: Leibniz-Zentrum für Archäologie (LEIZA)
broader: [Technologische Spuren]
broader transitive: [Untersuchungsergebnisse]
broader transitive: [Technologische Spuren]
broader transitive: Zustandserfassung
broader transitive: Objektuntersuchung
broader transitive: Technologische Auswertung
in scheme: Konservierungs- und Restaurierungsfachthesaurus für archäologische Kulturgüter
pref label: Glättung (technologische Spur)
  type: Label
  rank: preferred
narrower: Politurzone
narrower: Glanzstelle

Materialanhaftung (technologische Spur)
type: Concept
notation: CD1GA3
created: 2026-01-30
issued: 2026-01-30
modified: 2026-02-04
publisher: Leibniz-Zentrum für Archäologie (LEIZA)
broader: [Technologische Spuren]
broader transitive: [Untersuchungsergebnisse]
broader transitive: [Technologische Spuren]
broader transitive: Zustandserfassung
broader transitive: Objektuntersuchung
broader transitive: Technologische Auswertung
in scheme: Konservierungs- und Restaurierungsfachthesaurus für archäologische Kulturgüter
narrower: organischer Rückstand
narrower: metallischer Rückstand
narrower: Sinter
narrower: Brennrückstände (technologische Spur)
pref label: Materialanhaftung (technologische Spur)
  type: Label
  rank: preferred

Durchbruch (technologische Spur)
type: Concept
notation: FF775D
created: 2026-01-30
issued: 2026-01-30
modified: 2026-02-04
publisher: Leibniz-Zentrum für Archäologie (LEIZA)
broader: [Technologische Spuren]
broader transitive: [Untersuchungsergebnisse]
broader transitive: [Technologische Spuren]
broader transitive: Zustandserfassung
broader transitive: Objektuntersuchung
broader transitive: Technologische Auswertung
in scheme: Konservierungs- und Restaurierungsfachthesaurus für archäologische Kulturgüter
pref label: Durchbruch (technologische Spur)
  type: Label
  rank: preferred
narrower: Aussparung
narrower: Schnittkante
narrower: Lochung
narrower: Nietloch
narrower: Bohrloch
narrower: Nähloch

texturierte Oberfläche
type: Concept
notation: FG3A77
created: 2026-01-30
issued: 2026-01-30
modified: 2026-02-04
publisher: Leibniz-Zentrum für Archäologie (LEIZA)
broader: [Technologische Spuren]
broader transitive: [Untersuchungsergebnisse]
broader transitive: [Technologische Spuren]
broader transitive: Zustandserfassung
broader transitive: Objektuntersuchung
broader transitive: Technologische Auswertung
in scheme: Konservierungs- und Restaurierungsfachthesaurus für archäologische Kulturgüter
pref label: texturierte Oberfläche
  type: Label
  rank: preferred
definition: Auf dem Objekt sind mehr oder weniger regelmäßige, strukturierte Muster zu erkennen, die auf die verwendete Technik zur Herstellung des Objektes zurück zu führen sind.
narrower: Parallele Linien (technologische Spur)
narrower: Rillenmuster
narrower: Feilspuren
narrower: Hammerschlagstruktur
narrower: Schleifspuren
narrower: Kreuzschraffur (technologische Spur)

Erhebung
type: Concept
notation: G2F2B9
created: 2026-01-30
issued: 2026-01-30
modified: 2026-02-04
publisher: Leibniz-Zentrum für Archäologie (LEIZA)
broader: [Technologische Spuren]
broader transitive: [Untersuchungsergebnisse]
broader transitive: [Technologische Spuren]
broader transitive: Zustandserfassung
broader transitive: Objektuntersuchung
broader transitive: Technologische Auswertung
in scheme: Konservierungs- und Restaurierungsfachthesaurus für archäologische Kulturgüter
pref label: Erhebung
  type: Label
  rank: preferred
alternative label: Überstand
alt label: Überstand
  type: Label
  rank: preferred
definition: Auf dem Objekt ist an einer (oder mehreren) Stelle(n) Materialüberschuss zu erkennen, der auf die verwendete Technik zur Herstellung des Objektes zurück zu führen ist.
narrower: Grat
narrower: Materialüberstand
narrower: Gussnaht
narrower: Aufwurf

Eindellung
type: Concept
notation: CD952B
created: 2026-01-30
issued: 2026-01-30
modified: 2026-02-04
publisher: Leibniz-Zentrum für Archäologie (LEIZA)
broader: Vertiefung
broader transitive: Vertiefung
broader transitive: [Untersuchungsergebnisse]
broader transitive: [Technologische Spuren]
broader transitive: Zustandserfassung
broader transitive: Objektuntersuchung
broader transitive: Technologische Auswertung
definition: flächige mehr oder weniger gleichmäßige Einsekung des Materials ohne Bruch.
in scheme: Konservierungs- und Restaurierungsfachthesaurus für archäologische Kulturgüter
pref label: Eindellung
  type: Label
  rank: preferred
alternative label: Delle
alt label: Delle
  type: Label
  rank: preferred

Grübchen
type: Concept
notation: D8F8A8
created: 2026-01-30
issued: 2026-01-30
modified: 2026-02-04
publisher: Leibniz-Zentrum für Archäologie (LEIZA)
broader: Vertiefung
broader transitive: [Untersuchungsergebnisse]
broader transitive: [Technologische Spuren]
broader transitive: Zustandserfassung
broader transitive: Objektuntersuchung
broader transitive: Technologische Auswertung
broader transitive: Vertiefung
in scheme: Konservierungs- und Restaurierungsfachthesaurus für archäologische Kulturgüter
pref label: Grübchen
  type: Label
  rank: preferred
definition: sehr kleine, rund bis ovale punktuelle Vertiefungen

Rille
type: Concept
notation: F22388
created: 2026-01-30
issued: 2026-01-30
modified: 2026-02-04
publisher: Leibniz-Zentrum für Archäologie (LEIZA)
broader: Vertiefung
broader transitive: Vertiefung
broader transitive: [Untersuchungsergebnisse]
broader transitive: [Technologische Spuren]
broader transitive: Zustandserfassung
broader transitive: Objektuntersuchung
broader transitive: Technologische Auswertung
definition: langgestreckte, schmale Vertiefung(en) auf der Oberfläche des Objektes.
in scheme: Konservierungs- und Restaurierungsfachthesaurus für archäologische Kulturgüter
pref label: Rille
  type: Label
  rank: preferred
alternative label: Riefe
alt label: Riefe
  type: Label
  rank: preferred

Punktierung
type: Concept
notation: F37PBQ
created: 2026-01-30
issued: 2026-01-30
modified: 2026-02-04
publisher: Leibniz-Zentrum für Archäologie (LEIZA)
broader: Vertiefung
broader transitive: [Untersuchungsergebnisse]
broader transitive: [Technologische Spuren]
broader transitive: Zustandserfassung
broader transitive: Objektuntersuchung
broader transitive: Technologische Auswertung
broader transitive: Vertiefung
in scheme: Konservierungs- und Restaurierungsfachthesaurus für archäologische Kulturgüter
pref label: Punktierung
  type: Label
  rank: preferred
definition: punktartige Eindrücke in die Oberfläche des Materials, oft regelmäßig angeordnet (Dekoelement).

Ritzung
type: Concept
notation: FGB641
created: 2026-01-30
issued: 2026-01-30
modified: 2026-02-04
publisher: Leibniz-Zentrum für Archäologie (LEIZA)
broader: Vertiefung
broader transitive: Vertiefung
broader transitive: [Untersuchungsergebnisse]
broader transitive: [Technologische Spuren]
broader transitive: Zustandserfassung
broader transitive: Objektuntersuchung
broader transitive: Technologische Auswertung
definition: mit scharfem Werkzeug intentional in die Objektoberfläche eingebrachte Vertiefung, häufig als grafische Dekorelemente (z.B. Muster, Dekorlinien, Inschriften).
in scheme: Konservierungs- und Restaurierungsfachthesaurus für archäologische Kulturgüter
pref label: Ritzung
  type: Label
  rank: preferred
alternative label: Ritze
alt label: Ritze
  type: Label
  rank: preferred

Kerbung
type: Concept
notation: G87689
created: 2026-01-30
issued: 2026-01-30
modified: 2026-02-04
publisher: Leibniz-Zentrum für Archäologie (LEIZA)
broader: Vertiefung
broader transitive: Vertiefung
broader transitive: [Untersuchungsergebnisse]
broader transitive: [Technologische Spuren]
broader transitive: Zustandserfassung
broader transitive: Objektuntersuchung
broader transitive: Technologische Auswertung
definition: kurze, meist v-förmige Vertiefung(en) auf der Oberfläche des Objektes.
in scheme: Konservierungs- und Restaurierungsfachthesaurus für archäologische Kulturgüter
pref label: Kerbung
  type: Label
  rank: preferred
alternative label: Kerbe
alt label: Kerbe
  type: Label
  rank: preferred

Parallele Linien (technologische Spur)
type: Concept
notation: A4A5F1
created: 2026-01-30
issued: 2026-01-30
modified: 2026-02-04
publisher: Leibniz-Zentrum für Archäologie (LEIZA)
broader: texturierte Oberfläche
broader transitive: texturierte Oberfläche
broader transitive: [Untersuchungsergebnisse]
broader transitive: [Technologische Spuren]
broader transitive: Zustandserfassung
broader transitive: Objektuntersuchung
broader transitive: Technologische Auswertung
in scheme: Konservierungs- und Restaurierungsfachthesaurus für archäologische Kulturgüter
pref label: Parallele Linien (technologische Spur)
  type: Label
  rank: preferred

Rillenmuster
type: Concept
notation: AF712C
created: 2026-01-30
issued: 2026-01-30
modified: 2026-02-04
publisher: Leibniz-Zentrum für Archäologie (LEIZA)
broader: texturierte Oberfläche
broader transitive: texturierte Oberfläche
broader transitive: [Untersuchungsergebnisse]
broader transitive: [Technologische Spuren]
broader transitive: Zustandserfassung
broader transitive: Objektuntersuchung
broader transitive: Technologische Auswertung
in scheme: Konservierungs- und Restaurierungsfachthesaurus für archäologische Kulturgüter
pref label: Rillenmuster
  type: Label
  rank: preferred

Feilspuren
type: Concept
notation: AG9BG5
created: 2026-01-30
issued: 2026-01-30
modified: 2026-02-04
publisher: Leibniz-Zentrum für Archäologie (LEIZA)
broader: texturierte Oberfläche
broader transitive: texturierte Oberfläche
broader transitive: [Untersuchungsergebnisse]
broader transitive: [Technologische Spuren]
broader transitive: Zustandserfassung
broader transitive: Objektuntersuchung
broader transitive: Technologische Auswertung
in scheme: Konservierungs- und Restaurierungsfachthesaurus für archäologische Kulturgüter
pref label: Feilspuren
  type: Label
  rank: preferred

Grat
type: Concept
notation: B5A1F8
created: 2026-01-30
issued: 2026-01-30
modified: 2026-02-04
publisher: Leibniz-Zentrum für Archäologie (LEIZA)
broader: Erhebung
broader transitive: [Untersuchungsergebnisse]
broader transitive: [Technologische Spuren]
broader transitive: Zustandserfassung
broader transitive: Objektuntersuchung
broader transitive: Technologische Auswertung
broader transitive: Erhebung
in scheme: Konservierungs- und Restaurierungsfachthesaurus für archäologische Kulturgüter
pref label: Grat
  type: Label
  rank: preferred

Hammerschlagstruktur
type: Concept
notation: CGCD82
created: 2026-01-30
issued: 2026-01-30
modified: 2026-02-04
publisher: Leibniz-Zentrum für Archäologie (LEIZA)
broader: texturierte Oberfläche
broader transitive: texturierte Oberfläche
broader transitive: [Untersuchungsergebnisse]
broader transitive: [Technologische Spuren]
broader transitive: Zustandserfassung
broader transitive: Objektuntersuchung
broader transitive: Technologische Auswertung
in scheme: Konservierungs- und Restaurierungsfachthesaurus für archäologische Kulturgüter
pref label: Hammerschlagstruktur
  type: Label
  rank: preferred
alternative label: Hammerschlag
alt label: Hammerschlag
  type: Label
  rank: preferred

Materialüberstand
type: Concept
notation: D45G89
created: 2026-01-30
issued: 2026-01-30
modified: 2026-02-04
publisher: Leibniz-Zentrum für Archäologie (LEIZA)
broader: Erhebung
broader transitive: [Untersuchungsergebnisse]
broader transitive: [Technologische Spuren]
broader transitive: Zustandserfassung
broader transitive: Objektuntersuchung
broader transitive: Technologische Auswertung
broader transitive: Erhebung
in scheme: Konservierungs- und Restaurierungsfachthesaurus für archäologische Kulturgüter
pref label: Materialüberstand
  type: Label
  rank: preferred

Schleifspuren
type: Concept
notation: D9131A
created: 2026-01-30
issued: 2026-01-30
modified: 2026-02-04
publisher: Leibniz-Zentrum für Archäologie (LEIZA)
broader: texturierte Oberfläche
broader transitive: texturierte Oberfläche
broader transitive: [Untersuchungsergebnisse]
broader transitive: [Technologische Spuren]
broader transitive: Zustandserfassung
broader transitive: Objektuntersuchung
broader transitive: Technologische Auswertung
in scheme: Konservierungs- und Restaurierungsfachthesaurus für archäologische Kulturgüter
pref label: Schleifspuren
  type: Label
  rank: preferred

Kreuzschraffur (technologische Spur)
type: Concept
notation: G7ADCC
created: 2026-01-30
issued: 2026-01-30
modified: 2026-02-04
publisher: Leibniz-Zentrum für Archäologie (LEIZA)
broader: texturierte Oberfläche
broader transitive: texturierte Oberfläche
broader transitive: [Untersuchungsergebnisse]
broader transitive: [Technologische Spuren]
broader transitive: Zustandserfassung
broader transitive: Objektuntersuchung
broader transitive: Technologische Auswertung
in scheme: Konservierungs- und Restaurierungsfachthesaurus für archäologische Kulturgüter
pref label: Kreuzschraffur (technologische Spur)
  type: Label
  rank: preferred

Gussnaht
type: Concept
notation: G69771
created: 2026-01-30
issued: 2026-01-30
modified: 2026-02-04
publisher: Leibniz-Zentrum für Archäologie (LEIZA)
broader: Erhebung
broader transitive: [Untersuchungsergebnisse]
broader transitive: [Technologische Spuren]
broader transitive: Zustandserfassung
broader transitive: Objektuntersuchung
broader transitive: Technologische Auswertung
broader transitive: Erhebung
in scheme: Konservierungs- und Restaurierungsfachthesaurus für archäologische Kulturgüter
pref label: Gussnaht
  type: Label
  rank: preferred

Aufwurf
type: Concept
notation: G77A45
created: 2026-01-30
issued: 2026-01-30
modified: 2026-02-04
publisher: Leibniz-Zentrum für Archäologie (LEIZA)
broader: Erhebung
broader transitive: [Untersuchungsergebnisse]
broader transitive: [Technologische Spuren]
broader transitive: Zustandserfassung
broader transitive: Objektuntersuchung
broader transitive: Technologische Auswertung
broader transitive: Erhebung
in scheme: Konservierungs- und Restaurierungsfachthesaurus für archäologische Kulturgüter
pref label: Aufwurf
  type: Label
  rank: preferred

Aussparung
type: Concept
notation: AA6D96
created: 2026-01-30
issued: 2026-01-30
modified: 2026-02-04
publisher: Leibniz-Zentrum für Archäologie (LEIZA)
broader: Durchbruch (technologische Spur)
broader transitive: [Untersuchungsergebnisse]
broader transitive: [Technologische Spuren]
broader transitive: Zustandserfassung
broader transitive: Objektuntersuchung
broader transitive: Technologische Auswertung
broader transitive: Durchbruch (technologische Spur)
in scheme: Konservierungs- und Restaurierungsfachthesaurus für archäologische Kulturgüter
pref label: Aussparung
  type: Label
  rank: preferred

Schnittkante
type: Concept
notation: AAD864
created: 2026-01-30
issued: 2026-01-30
modified: 2026-02-04
publisher: Leibniz-Zentrum für Archäologie (LEIZA)
broader: Durchbruch (technologische Spur)
broader transitive: [Untersuchungsergebnisse]
broader transitive: [Technologische Spuren]
broader transitive: Zustandserfassung
broader transitive: Objektuntersuchung
broader transitive: Technologische Auswertung
broader transitive: Durchbruch (technologische Spur)
in scheme: Konservierungs- und Restaurierungsfachthesaurus für archäologische Kulturgüter
pref label: Schnittkante
  type: Label
  rank: preferred

Politurzone
type: Concept
notation: C89AC8
created: 2026-01-30
issued: 2026-01-30
modified: 2026-02-04
publisher: Leibniz-Zentrum für Archäologie (LEIZA)
broader: Glättung (technologische Spur)
broader transitive: [Untersuchungsergebnisse]
broader transitive: [Technologische Spuren]
broader transitive: Zustandserfassung
broader transitive: Objektuntersuchung
broader transitive: Technologische Auswertung
broader transitive: Glättung (technologische Spur)
in scheme: Konservierungs- und Restaurierungsfachthesaurus für archäologische Kulturgüter
pref label: Politurzone
  type: Label
  rank: preferred
alternative label: polierte Fläche
alt label: polierte Fläche
  type: Label
  rank: preferred

Glanzstelle
type: Concept
notation: G51749
created: 2026-01-30
issued: 2026-01-30
modified: 2026-02-04
publisher: Leibniz-Zentrum für Archäologie (LEIZA)
broader: Glättung (technologische Spur)
broader transitive: [Untersuchungsergebnisse]
broader transitive: [Technologische Spuren]
broader transitive: Zustandserfassung
broader transitive: Objektuntersuchung
broader transitive: Technologische Auswertung
broader transitive: Glättung (technologische Spur)
in scheme: Konservierungs- und Restaurierungsfachthesaurus für archäologische Kulturgüter
pref label: Glanzstelle
  type: Label
  rank: preferred
narrower: Reibglanz

Lochung
type: Concept
notation: C911B8
created: 2026-01-30
issued: 2026-01-30
modified: 2026-02-04
publisher: Leibniz-Zentrum für Archäologie (LEIZA)
broader: Durchbruch (technologische Spur)
broader transitive: [Untersuchungsergebnisse]
broader transitive: [Technologische Spuren]
broader transitive: Zustandserfassung
broader transitive: Objektuntersuchung
broader transitive: Technologische Auswertung
broader transitive: Durchbruch (technologische Spur)
in scheme: Konservierungs- und Restaurierungsfachthesaurus für archäologische Kulturgüter
pref label: Lochung
  type: Label
  rank: preferred
alternative label: Durchlochung
alternative label: Loch
alt label: Durchlochung
  type: Label
  rank: preferred
alt label: Loch
  type: Label
  rank: normal

Reibglanz
type: Concept
notation: C941GD
created: 2026-01-30
issued: 2026-01-30
modified: 2026-02-04
publisher: Leibniz-Zentrum für Archäologie (LEIZA)
broader: Glanzstelle
broader transitive: [Untersuchungsergebnisse]
broader transitive: [Technologische Spuren]
broader transitive: Zustandserfassung
broader transitive: Objektuntersuchung
broader transitive: Technologische Auswertung
broader transitive: Glättung (technologische Spur)
broader transitive: Glanzstelle
in scheme: Konservierungs- und Restaurierungsfachthesaurus für archäologische Kulturgüter
pref label: Reibglanz
  type: Label
  rank: preferred

Nietloch
type: Concept
notation: D682B2
created: 2026-01-30
issued: 2026-01-30
modified: 2026-02-04
publisher: Leibniz-Zentrum für Archäologie (LEIZA)
broader: Durchbruch (technologische Spur)
broader transitive: [Untersuchungsergebnisse]
broader transitive: [Technologische Spuren]
broader transitive: Zustandserfassung
broader transitive: Objektuntersuchung
broader transitive: Technologische Auswertung
broader transitive: Durchbruch (technologische Spur)
in scheme: Konservierungs- und Restaurierungsfachthesaurus für archäologische Kulturgüter
pref label: Nietloch
  type: Label
  rank: preferred

Bohrloch
type: Concept
notation: DCFD22
created: 2026-01-30
issued: 2026-01-30
modified: 2026-02-04
publisher: Leibniz-Zentrum für Archäologie (LEIZA)
broader: Durchbruch (technologische Spur)
broader transitive: [Untersuchungsergebnisse]
broader transitive: [Technologische Spuren]
broader transitive: Zustandserfassung
broader transitive: Objektuntersuchung
broader transitive: Technologische Auswertung
broader transitive: Durchbruch (technologische Spur)
in scheme: Konservierungs- und Restaurierungsfachthesaurus für archäologische Kulturgüter
pref label: Bohrloch
  type: Label
  rank: preferred

Nähloch
type: Concept
notation: FF9G5D
created: 2026-01-30
issued: 2026-01-30
modified: 2026-02-04
publisher: Leibniz-Zentrum für Archäologie (LEIZA)
broader: Durchbruch (technologische Spur)
broader transitive: [Untersuchungsergebnisse]
broader transitive: [Technologische Spuren]
broader transitive: Zustandserfassung
broader transitive: Objektuntersuchung
broader transitive: Technologische Auswertung
broader transitive: Durchbruch (technologische Spur)
in scheme: Konservierungs- und Restaurierungsfachthesaurus für archäologische Kulturgüter
pref label: Nähloch
  type: Label
  rank: preferred

organischer Rückstand
type: Concept
notation: A3CFA1
created: 2026-01-30
issued: 2026-01-30
modified: 2026-02-04
publisher: Leibniz-Zentrum für Archäologie (LEIZA)
broader: Materialanhaftung (technologische Spur)
broader transitive: Materialanhaftung (technologische Spur)
broader transitive: [Untersuchungsergebnisse]
broader transitive: [Technologische Spuren]
broader transitive: Zustandserfassung
broader transitive: Objektuntersuchung
broader transitive: Technologische Auswertung
in scheme: Konservierungs- und Restaurierungsfachthesaurus für archäologische Kulturgüter
narrower: Harz
pref label: organischer Rückstand
  type: Label
  rank: preferred

Harz
type: Concept
notation: C7944F
created: 2026-01-30
issued: 2026-01-30
modified: 2026-02-04
publisher: Leibniz-Zentrum für Archäologie (LEIZA)
broader: organischer Rückstand
broader transitive: [Untersuchungsergebnisse]
broader transitive: Zustandserfassung
broader transitive: Objektuntersuchung
broader transitive: organischer Rückstand
broader transitive: [Technologische Spuren]
broader transitive: Materialanhaftung (technologische Spur)
broader transitive: Technologische Auswertung
in scheme: Konservierungs- und Restaurierungsfachthesaurus für archäologische Kulturgüter
pref label: Harz
  type: Label
  rank: preferred

metallischer Rückstand
type: Concept
notation: B637A1
created: 2026-01-30
issued: 2026-01-30
modified: 2026-02-04
publisher: Leibniz-Zentrum für Archäologie (LEIZA)
broader: Materialanhaftung (technologische Spur)
broader transitive: Materialanhaftung (technologische Spur)
broader transitive: [Untersuchungsergebnisse]
broader transitive: [Technologische Spuren]
broader transitive: Zustandserfassung
broader transitive: Objektuntersuchung
broader transitive: Technologische Auswertung
in scheme: Konservierungs- und Restaurierungsfachthesaurus für archäologische Kulturgüter
pref label: metallischer Rückstand
  type: Label
  rank: preferred

Sinter
type: Concept
notation: FFB317
created: 2026-01-30
issued: 2026-01-30
modified: 2026-02-04
publisher: Leibniz-Zentrum für Archäologie (LEIZA)
broader: Materialanhaftung (technologische Spur)
broader transitive: [Untersuchungsergebnisse]
broader transitive: Zustandserfassung
broader transitive: Objektuntersuchung
broader transitive: [Technologische Spuren]
broader transitive: Materialanhaftung (technologische Spur)
broader transitive: Technologische Auswertung
in scheme: Konservierungs- und Restaurierungsfachthesaurus für archäologische Kulturgüter
pref label: Sinter
  type: Label
  rank: preferred

Brennrückstände (technologische Spur)
type: Concept
notation: G89562
created: 2026-01-30
issued: 2026-01-30
modified: 2026-02-04
publisher: Leibniz-Zentrum für Archäologie (LEIZA)
broader: Materialanhaftung (technologische Spur)
broader transitive: Materialanhaftung (technologische Spur)
broader transitive: [Untersuchungsergebnisse]
broader transitive: [Technologische Spuren]
broader transitive: Zustandserfassung
broader transitive: Objektuntersuchung
broader transitive: Technologische Auswertung
in scheme: Konservierungs- und Restaurierungsfachthesaurus für archäologische Kulturgüter
narrower: Ruß
pref label: Brennrückstände (technologische Spur)
  type: Label
  rank: preferred

Ruß
type: Concept
notation: CFDD8G
created: 2026-01-30
issued: 2026-01-30
modified: 2026-02-04
publisher: Leibniz-Zentrum für Archäologie (LEIZA)
broader: Brennrückstände (technologische Spur)
broader transitive: Materialanhaftung (technologische Spur)
broader transitive: [Untersuchungsergebnisse]
broader transitive: [Technologische Spuren]
broader transitive: Zustandserfassung
broader transitive: Objektuntersuchung
broader transitive: Technologische Auswertung
broader transitive: Brennrückstände (technologische Spur)
in scheme: Konservierungs- und Restaurierungsfachthesaurus für archäologische Kulturgüter
pref label: Ruß
  type: Label
  rank: preferred

materialbedingter Schaden
type: Concept
notation: A379F4
created: 2026-01-30
issued: 2026-01-30
modified: 2026-02-04
publisher: Leibniz-Zentrum für Archäologie (LEIZA)
broader: Schadenssursache
broader transitive: Schadenssursache
broader transitive: [Untersuchungsergebnisse]
broader transitive: Zustandserfassung
broader transitive: Objektuntersuchung
definition: Das Objekt weist Schäden auf, die auf die innere Struktur des Materials zurückzuführen sind.
in scheme: Konservierungs- und Restaurierungsfachthesaurus für archäologische Kulturgüter
pref label: materialbedingter Schaden
  type: Label
  rank: preferred

Verschmutzung
type: Concept
notation: A889A3
created: 2026-01-30
issued: 2026-01-30
modified: 2026-02-04
publisher: Leibniz-Zentrum für Archäologie (LEIZA)
alternative label: Ablagerung
alternative label: Schmutz
broader: Schadenssursache
broader transitive: Schadenssursache
broader transitive: [Untersuchungsergebnisse]
broader transitive: Zustandserfassung
broader transitive: Objektuntersuchung
definition: Schadensphänomen, das durch Ablagerung unerwünschter Substanz die Lesbarkeit des Objektes vermindert
in scheme: Konservierungs- und Restaurierungsfachthesaurus für archäologische Kulturgüter
narrower: Verkrustung
narrower: Erdanhaftungen
narrower: Staubablagerung
narrower: Versinterung
alt label: Schmutz
  type: Label
  rank: preferred
alt label: Ablagerung
  type: Label
  rank: normal
pref label: Verschmutzung
  type: Label
  rank: preferred

lichtinduzierter Schaden
type: Concept
notation: AA819F
created: 2026-01-30
issued: 2026-01-30
modified: 2026-02-04
publisher: Leibniz-Zentrum für Archäologie (LEIZA)
broader: Schadenssursache
broader transitive: Schadenssursache
broader transitive: [Untersuchungsergebnisse]
broader transitive: Zustandserfassung
broader transitive: Objektuntersuchung
definition: licht- bzw. beleuchtungsinduzierte Beschädigung des Objektes
in scheme: Konservierungs- und Restaurierungsfachthesaurus für archäologische Kulturgüter
pref label: lichtinduzierter Schaden
  type: Label
  rank: preferred
alternative label: Lichtschaden
alt label: Lichtschaden
  type: Label
  rank: preferred

Verwitterung
type: Concept
notation: AD3A34
created: 2026-01-30
issued: 2026-01-30
modified: 2026-02-04
publisher: Leibniz-Zentrum für Archäologie (LEIZA)
broader: Schadenssursache
broader transitive: Schadenssursache
broader transitive: [Untersuchungsergebnisse]
broader transitive: Zustandserfassung
broader transitive: Objektuntersuchung
definition: Schädigung durch negative Einwirkung der Bedingungen im Freien
in scheme: Konservierungs- und Restaurierungsfachthesaurus für archäologische Kulturgüter
pref label: Verwitterung
  type: Label
  rank: preferred

Vandalismus
type: Concept
notation: B2ADB6
created: 2026-01-30
issued: 2026-01-30
modified: 2026-02-04
publisher: Leibniz-Zentrum für Archäologie (LEIZA)
alternative label: anthropogene Schädigung
broader: Schadenssursache
broader transitive: Schadenssursache
broader transitive: [Untersuchungsergebnisse]
broader transitive: Zustandserfassung
broader transitive: Objektuntersuchung
definition: Durch Menschen mutwillig herbeigeführte Schädigung eines Objektes
in scheme: Konservierungs- und Restaurierungsfachthesaurus für archäologische Kulturgüter
alt label: anthropogene Schädigung
  type: Label
  rank: preferred
pref label: Vandalismus
  type: Label
  rank: preferred

Klimaschaden
type: Concept
notation: C64BC8
created: 2026-01-30
issued: 2026-01-30
modified: 2026-02-04
publisher: Leibniz-Zentrum für Archäologie (LEIZA)
alternative label: Klima
broader: Schadenssursache
broader transitive: Schadenssursache
broader transitive: [Untersuchungsergebnisse]
broader transitive: Zustandserfassung
broader transitive: Objektuntersuchung
definition: Schadensphänomen, das durch klimatische Faktoren verursacht oder verschlimmert wird (Feuchtigkeit und Temperatur, bzw. deren Schwankungen)
in scheme: Konservierungs- und Restaurierungsfachthesaurus für archäologische Kulturgüter
alt label: Klima
  type: Label
  rank: preferred
pref label: Klimaschaden
  type: Label
  rank: preferred

Korrosionsinduzierter Schaden
type: Concept
notation: D16G86
created: 2026-01-30
issued: 2026-01-30
modified: 2026-02-04
publisher: Leibniz-Zentrum für Archäologie (LEIZA)
broader: Schadenssursache
broader transitive: Schadenssursache
broader transitive: [Untersuchungsergebnisse]
broader transitive: Zustandserfassung
broader transitive: Objektuntersuchung
definition: Durch chemische Reaktion des Materials mit seiner Umgebung verursachter Schaden
in scheme: Konservierungs- und Restaurierungsfachthesaurus für archäologische Kulturgüter
pref label: Korrosionsinduzierter Schaden
  type: Label
  rank: preferred

Feuerschaden
type: Concept
notation: D171FF
created: 2026-01-30
issued: 2026-01-30
modified: 2026-02-04
publisher: Leibniz-Zentrum für Archäologie (LEIZA)
alternative label: Brandschaden
broader: Schadenssursache
broader transitive: Schadenssursache
broader transitive: [Untersuchungsergebnisse]
broader transitive: Zustandserfassung
broader transitive: Objektuntersuchung
definition: Durch einen Brand bzw. den Kontakt zu Feuer/Hitze herbeigeführte Schäden an einem Objekt
in scheme: Konservierungs- und Restaurierungsfachthesaurus für archäologische Kulturgüter
alt label: Brandschaden
  type: Label
  rank: preferred
pref label: Feuerschaden
  type: Label
  rank: preferred

Transportschaden
type: Concept
notation: DD3A3D
created: 2026-01-30
issued: 2026-01-30
modified: 2026-02-04
publisher: Leibniz-Zentrum für Archäologie (LEIZA)
broader: Schadenssursache
broader transitive: Schadenssursache
broader transitive: [Untersuchungsergebnisse]
broader transitive: Zustandserfassung
broader transitive: Objektuntersuchung
definition: Schaden, der durch einen Transport des Objektes verursacht wurde.
in scheme: Konservierungs- und Restaurierungsfachthesaurus für archäologische Kulturgüter
pref label: Transportschaden
  type: Label
  rank: preferred

Bodenlagerungsschaden
type: Concept
notation: F968G3
created: 2026-01-30
issued: 2026-01-30
modified: 2026-02-04
publisher: Leibniz-Zentrum für Archäologie (LEIZA)
broader: Schadenssursache
broader transitive: Schadenssursache
broader transitive: [Untersuchungsergebnisse]
broader transitive: Zustandserfassung
broader transitive: Objektuntersuchung
definition: Beschädigung, die durch Einwirkungen auf ein Objekt während der Bodenlagerung verursacht wurde. (Erddruck, Besiedelung, etc.)
in scheme: Konservierungs- und Restaurierungsfachthesaurus für archäologische Kulturgüter
pref label: Bodenlagerungsschaden
  type: Label
  rank: preferred

Schaden durch mechanische Beanspruchung
type: Concept
notation: FAFCF5
created: 2026-01-30
issued: 2026-01-30
modified: 2026-02-04
publisher: Leibniz-Zentrum für Archäologie (LEIZA)
alternative label: Abnutzung
alternative label: Verschleiß
broader: Schadenssursache
broader transitive: Schadenssursache
broader transitive: [Untersuchungsergebnisse]
broader transitive: Zustandserfassung
broader transitive: Objektuntersuchung
definition: Durch mechanische Einwirkung hervorgerufene kumulative Schädigung des Objektes. Häufig vor allem auf die Objektoberfläche bezogen.
in scheme: Konservierungs- und Restaurierungsfachthesaurus für archäologische Kulturgüter
alt label: Abnutzung
  type: Label
  rank: preferred
alt label: Verschleiß
  type: Label
  rank: normal
pref label: Schaden durch mechanische Beanspruchung
  type: Label
  rank: preferred

Lagerungsschaden
type: Concept
notation: FB7C46
created: 2026-01-30
issued: 2026-01-30
modified: 2026-02-04
publisher: Leibniz-Zentrum für Archäologie (LEIZA)
broader: Schadenssursache
broader transitive: Schadenssursache
broader transitive: [Untersuchungsergebnisse]
broader transitive: Zustandserfassung
broader transitive: Objektuntersuchung
definition: Beschädigung des Objektes, die auf unpassende Lagerungsbedingungen zurück zu führen ist.
in scheme: Konservierungs- und Restaurierungsfachthesaurus für archäologische Kulturgüter
pref label: Lagerungsschaden
  type: Label
  rank: preferred

Salzbelastung
type: Concept
notation: FDD71B
created: 2026-01-30
issued: 2026-01-30
modified: 2026-02-04
publisher: Leibniz-Zentrum für Archäologie (LEIZA)
broader: Schadenssursache
broader transitive: [Untersuchungsergebnisse]
broader transitive: Zustandserfassung
broader transitive: Objektuntersuchung
broader transitive: Schadenssursache
definition: Schadensphänomen, das durch das Vorhandensein löslicher Salze in einem Objekt/Material verursacht wird
in scheme: Konservierungs- und Restaurierungsfachthesaurus für archäologische Kulturgüter
pref label: Salzbelastung
  type: Label
  rank: preferred
alternative label: Salzsprengung
alt label: Salzsprengung
  type: Label
  rank: preferred

Biologischer Befall
type: Concept
notation: G1GA5F
created: 2026-01-30
issued: 2026-01-30
modified: 2026-02-04
publisher: Leibniz-Zentrum für Archäologie (LEIZA)
alternative label: Biologische Zerstörung
broader: Schadenssursache
broader transitive: Schadenssursache
broader transitive: [Untersuchungsergebnisse]
broader transitive: Zustandserfassung
broader transitive: Objektuntersuchung
definition: Durch Einwirkung von biologischen Organismen (Pflanzen, Tieren, Mikroorganismen) auf oder in einem Objekt verursachte Beschädigung
in scheme: Konservierungs- und Restaurierungsfachthesaurus für archäologische Kulturgüter
alt label: Biologische Zerstörung
  type: Label
  rank: preferred
pref label: Biologischer Befall
  type: Label
  rank: preferred

Bergungsschaden
type: Concept
notation: GBDG4D
created: 2026-01-30
issued: 2026-01-30
modified: 2026-02-04
publisher: Leibniz-Zentrum für Archäologie (LEIZA)
broader: Schadenssursache
broader transitive: Schadenssursache
broader transitive: [Untersuchungsergebnisse]
broader transitive: Zustandserfassung
broader transitive: Objektuntersuchung
definition: Beschädigung, die durch den Umgang mit dem Objekt bei der Ausgrabung entstanden ist.
in scheme: Konservierungs- und Restaurierungsfachthesaurus für archäologische Kulturgüter
pref label: Bergungsschaden
  type: Label
  rank: preferred

Schadstoffe
type: Concept
notation: GCCD95
created: 2026-01-30
issued: 2026-01-30
modified: 2026-02-04
publisher: Leibniz-Zentrum für Archäologie (LEIZA)
broader: Schadenssursache
broader transitive: Schadenssursache
broader transitive: [Untersuchungsergebnisse]
broader transitive: Zustandserfassung
broader transitive: Objektuntersuchung
definition: Beschädigung des Objektes, durch Emmision von schädlichen Stoffen im direkten Umfeld des Objektes (Verpackungsmaterial, Vitrinen, etc.) oder durch emmitierende Stoffe, die zur Bearbeitung des Objektes selbst Verwendung fanden.
definition:
  literal form: Beschädigung des Objektes, durch Emmision von schädlichen Stoffen im direkten Umfeld des Objektes (Verpackungsmaterial, Vitrinen, etc.) oder durch emmitierende Stoffe, die zur Bearbeitung des Objektes selbst Verwendung fanden.
in scheme: Konservierungs- und Restaurierungsfachthesaurus für archäologische Kulturgüter
pref label: Schadstoffe
  type: Label
  rank: preferred

Wasserschaden
type: Concept
notation: GGD66G
created: 2026-01-30
issued: 2026-01-30
modified: 2026-02-04
publisher: Leibniz-Zentrum für Archäologie (LEIZA)
alternative label: Wassereinbruch
alternative label: Überschwemmung
broader: Schadenssursache
broader transitive: Schadenssursache
broader transitive: [Untersuchungsergebnisse]
broader transitive: Zustandserfassung
broader transitive: Objektuntersuchung
definition: Durch den Kontakt zu Wasser herbeigeführte Schäden an einem Objekt
in scheme: Konservierungs- und Restaurierungsfachthesaurus für archäologische Kulturgüter
alt label: Überschwemmung
  type: Label
  rank: preferred
alt label: Wassereinbruch
  type: Label
  rank: normal
pref label: Wasserschaden
  type: Label
  rank: preferred

Verkrustung
type: Concept
notation: A14228
created: 2026-01-30
issued: 2026-01-30
modified: 2026-02-04
publisher: Leibniz-Zentrum für Archäologie (LEIZA)
broader: Verschmutzung
broader transitive: Verschmutzung
broader transitive: [Untersuchungsergebnisse]
broader transitive: Zustandserfassung
broader transitive: Objektuntersuchung
broader transitive: Schadenssursache
definition: Fest an der Oberfläche des Objektes anhaftende und verhärtete Ansammlung von Fremdsubstanz
in scheme: Konservierungs- und Restaurierungsfachthesaurus für archäologische Kulturgüter
pref label: Verkrustung
  type: Label
  rank: preferred

Erdanhaftungen
type: Concept
notation: D28G9A
created: 2026-01-30
issued: 2026-01-30
modified: 2026-02-04
publisher: Leibniz-Zentrum für Archäologie (LEIZA)
alternative label: Erdreste
broader: Verschmutzung
broader transitive: Verschmutzung
broader transitive: Schadenssursache
broader transitive: [Untersuchungsergebnisse]
broader transitive: Zustandserfassung
broader transitive: Objektuntersuchung
definition: mehr oder weniger fest anhaftende Bodenbestandteile. Hauptsächlich an frisch geborgenen Objekten festzustellen.
in scheme: Konservierungs- und Restaurierungsfachthesaurus für archäologische Kulturgüter
alt label: Erdreste
  type: Label
  rank: preferred
pref label: Erdanhaftungen
  type: Label
  rank: preferred

Staubablagerung
type: Concept
notation: D74F16
created: 2026-01-30
issued: 2026-01-30
modified: 2026-02-04
publisher: Leibniz-Zentrum für Archäologie (LEIZA)
broader: Verschmutzung
broader transitive: Verschmutzung
broader transitive: [Untersuchungsergebnisse]
broader transitive: Zustandserfassung
broader transitive: Objektuntersuchung
broader transitive: Schadenssursache
definition: Lose, auf der Oberfläche des Objektes angesammelte Ablagerung von luftgetragenen Partikeln
in scheme: Konservierungs- und Restaurierungsfachthesaurus für archäologische Kulturgüter
pref label: Staubablagerung
  type: Label
  rank: preferred

Versinterung
type: Concept
notation: F8915F
created: 2026-01-30
issued: 2026-01-30
modified: 2026-02-04
publisher: Leibniz-Zentrum für Archäologie (LEIZA)
broader: Verschmutzung
broader transitive: Verschmutzung
broader transitive: [Untersuchungsergebnisse]
broader transitive: Zustandserfassung
broader transitive: Objektuntersuchung
broader transitive: Schadenssursache
definition: Mehr oder weniger Fest an der Oberfläche anhaftende Sinterschichten.
in scheme: Konservierungs- und Restaurierungsfachthesaurus für archäologische Kulturgüter
pref label: Versinterung
  type: Label
  rank: preferred

Feuchtigkeitsgehalt
type: Concept
notation: AG4397
preferred label: moisture content @en
created: 2026-01-30
issued: 2026-01-30
modified: 2026-02-04
publisher: Leibniz-Zentrum für Archäologie (LEIZA)
broader: Zustandsbeschreibung
broader transitive: [Untersuchungsergebnisse]
broader transitive: Zustandserfassung
broader transitive: Objektuntersuchung
broader transitive: Zustandsbeschreibung
in scheme: Konservierungs- und Restaurierungsfachthesaurus für archäologische Kulturgüter
pref label: Feuchtigkeitsgehalt
  type: Label
  rank: preferred
pref label: moisture content
  type: Label
  rank: normal
alternative label: Wassergehalt
alternative label: humidity content @en
definition: Enthaltener Feuchtigkeitsanteil im Porenraum eines Materials/Objektes
narrower: Nass (Objektzustand)
narrower: Feucht (Objektzustand)
narrower: Trocken (Objektzustand)
alt label: Wassergehalt
  type: Label
  rank: preferred
alt label: humidity content
  type: Label
  rank: normal

Festigkeit
type: Concept
notation: AGBB3C
created: 2026-01-30
issued: 2026-01-30
modified: 2026-02-04
publisher: Leibniz-Zentrum für Archäologie (LEIZA)
broader: Zustandsbeschreibung
broader transitive: [Untersuchungsergebnisse]
broader transitive: Zustandserfassung
broader transitive: Objektuntersuchung
broader transitive: Zustandsbeschreibung
definition: Fähigkeit des Objektwerkstoffs mechanischen Widerstand gegen eine plastische Verformung oder Trennung zu leisten
in scheme: Konservierungs- und Restaurierungsfachthesaurus für archäologische Kulturgüter
pref label: Festigkeit
  type: Label
  rank: preferred
narrower: spröde
narrower: elastisch
narrower: weich
narrower: zugfest
narrower: fragil
narrower: hart
narrower: schlagfest
narrower: druckfest
narrower: biegefest

Veränderung
type: Concept
notation: C6GB1C
preferred label: alteration @en
created: 2026-01-30
issued: 2026-01-30
modified: 2026-02-04
publisher: Leibniz-Zentrum für Archäologie (LEIZA)
broader: Zustandsbeschreibung
broader transitive: [Untersuchungsergebnisse]
broader transitive: Zustandserfassung
broader transitive: Objektuntersuchung
broader transitive: Zustandsbeschreibung
definition: Änderung des Zustandes eines Objektes, unabhängig ob diese vorteilhaft oder nicht, beabsichtigt oder nicht ist/war.
in scheme: Konservierungs- und Restaurierungsfachthesaurus für archäologische Kulturgüter
narrower: Veränderung durch frühere Erhaltungsmaßnahmen
narrower: gealtert
narrower: historische Veränderung
narrower: beschädigt
pref label: Veränderung
  type: Label
  rank: preferred
pref label: alteration
  type: Label
  rank: normal

Vollständigkeit
type: Concept
notation: CAB799
preferred label: integrity @en
created: 2026-01-30
issued: 2026-01-30
modified: 2026-02-04
publisher: Leibniz-Zentrum für Archäologie (LEIZA)
broader: Zustandsbeschreibung
broader transitive: [Untersuchungsergebnisse]
broader transitive: Zustandserfassung
broader transitive: Objektuntersuchung
broader transitive: Zustandsbeschreibung
definition: Ausmaß im Hinblick auf das Vorhandensein aller ursprünglichen Bestandteile oder Elemente eines Objektes.
in scheme: Konservierungs- und Restaurierungsfachthesaurus für archäologische Kulturgüter
pref label: Vollständigkeit
  type: Label
  rank: preferred
pref label: integrity
  type: Label
  rank: normal
alternative label: Integrität
alternative label: completeness @en
narrower: vollständig
narrower: unvollständig
alt label: Integrität
  type: Label
  rank: preferred
alt label: completeness
  type: Label
  rank: normal

vollständig
type: Concept
notation: F573A5
created: 2026-01-30
issued: 2026-01-30
modified: 2026-02-04
publisher: Leibniz-Zentrum für Archäologie (LEIZA)
broader: Vollständigkeit
broader transitive: [Untersuchungsergebnisse]
broader transitive: Zustandserfassung
broader transitive: Objektuntersuchung
broader transitive: Vollständigkeit
broader transitive: Zustandsbeschreibung
definition: Zustand, bei dem alle ursprünglichen Teile des Objektes vorhanden sind.
in scheme: Konservierungs- und Restaurierungsfachthesaurus für archäologische Kulturgüter
pref label: vollständig
  type: Label
  rank: preferred

unvollständig
type: Concept
notation: GAD71G
created: 2026-01-30
issued: 2026-01-30
modified: 2026-02-04
publisher: Leibniz-Zentrum für Archäologie (LEIZA)
broader: Vollständigkeit
broader transitive: [Untersuchungsergebnisse]
broader transitive: Zustandserfassung
broader transitive: Objektuntersuchung
broader transitive: Vollständigkeit
broader transitive: Zustandsbeschreibung
definition: Zustand, bei dem ursprüngliche Teile des Objektes fehlen.
in scheme: Konservierungs- und Restaurierungsfachthesaurus für archäologische Kulturgüter
pref label: unvollständig
  type: Label
  rank: preferred

stabil
type: Concept
notation: D79DA6
preferred label: stable @en
created: 2026-01-30
issued: 2026-01-30
modified: 2026-02-04
publisher: Leibniz-Zentrum für Archäologie (LEIZA)
broader: Stabilität
broader transitive: [Untersuchungsergebnisse]
broader transitive: Zustandserfassung
broader transitive: Objektuntersuchung
broader transitive: Zustandsbeschreibung
broader transitive: Stabilität
definition: Zustand des Objekt, bei dem es fähig ist seine Form und Struktur zu behalten und gegenüber äußeren Einwirkung, wie mechanischen Kärften oder chemischen Prozessen stand zu halten. Ein stabiles Objekt ist weniger anfällig für Beschädigungen, bleibt über einen längeren Zeitraum hinweg in gutem Erhaltungszustand und kann demnach ohne weitere Stabilisierungsmaßnahmen gehändelt werden.
definition:
  literal form: Zustand des Objekt, bei dem es fähig ist seine Form und Struktur zu behalten und gegenüber äußeren Einwirkung, wie mechanischen Kärften oder chemischen Prozessen stand zu halten. Ein stabiles Objekt ist weniger anfällig für Beschädigungen, bleibt über einen längeren Zeitraum hinweg in gutem Erhaltungszustand und kann demnach ohne weitere Stabilisierungsmaßnahmen gehändelt werden.
in scheme: Konservierungs- und Restaurierungsfachthesaurus für archäologische Kulturgüter
pref label: stabil
  type: Label
  rank: preferred
pref label: stable
  type: Label
  rank: normal

Stabilität
type: Concept
notation: FB6AGB
preferred label: stability @en
created: 2026-01-30
issued: 2026-01-30
modified: 2026-02-04
publisher: Leibniz-Zentrum für Archäologie (LEIZA)
broader: Zustandsbeschreibung
broader transitive: [Untersuchungsergebnisse]
broader transitive: Zustandserfassung
broader transitive: Objektuntersuchung
broader transitive: Zustandsbeschreibung
definition: Fahigkeit eines Objektes auch bei physischer Einwirkung seine Form oder Struktur bei zu behalten
in scheme: Konservierungs- und Restaurierungsfachthesaurus für archäologische Kulturgüter
pref label: Stabilität
  type: Label
  rank: preferred
pref label: stability
  type: Label
  rank: normal
narrower: stabil
narrower: instabil

instabil
type: Concept
notation: FBA99A
preferred label: instable @en
created: 2026-01-30
issued: 2026-01-30
modified: 2026-02-04
publisher: Leibniz-Zentrum für Archäologie (LEIZA)
broader: Stabilität
broader transitive: [Untersuchungsergebnisse]
broader transitive: Zustandserfassung
broader transitive: Objektuntersuchung
broader transitive: Zustandsbeschreibung
broader transitive: Stabilität
definition: mangelnde Fähigkeit des Objektes in einem stabilem Zustand zu bleiben. Das Objekt droht durch physische Faktoren, wie äußere Kräfte oder unzureichende Unterstützung seine Form oder Struktur zu verändern/verlieren. Es bedarf demnach entsprechende Stabilisierungsmaßnahmen, um in seiner ursprünglichen Form zu bleiben. Die Instabilität seines Objektes liegt häufig in der Fragilität bzw. mangelnden Festigkeit seines Werkstoffes begründet.
definition:
  literal form: mangelnde Fähigkeit des Objektes in einem stabilem Zustand zu bleiben. Das Objekt droht durch physische Faktoren, wie äußere Kräfte oder unzureichende Unterstützung seine Form oder Struktur zu verändern/verlieren. Es bedarf demnach entsprechende Stabilisierungsmaßnahmen, um in seiner ursprünglichen Form zu bleiben. Die Instabilität seines Objektes liegt häufig in der Fragilität bzw. mangelnden Festigkeit seines Werkstoffes begründet.
in scheme: Konservierungs- und Restaurierungsfachthesaurus für archäologische Kulturgüter
pref label: instabil
  type: Label
  rank: preferred
pref label: instable
  type: Label
  rank: normal

Maße
type: Concept
notation: G9D1C8
created: 2026-01-30
issued: 2026-01-30
modified: 2026-02-04
publisher: Leibniz-Zentrum für Archäologie (LEIZA)
broader: Zustandsbeschreibung
broader transitive: [Untersuchungsergebnisse]
broader transitive: Zustandserfassung
broader transitive: Objektuntersuchung
broader transitive: Zustandsbeschreibung
in scheme: Konservierungs- und Restaurierungsfachthesaurus für archäologische Kulturgüter
pref label: Maße
  type: Label
  rank: preferred
definition: Die Abmessungen des Objektes

spröde
type: Concept
notation: AF5C86
created: 2026-01-30
issued: 2026-01-30
modified: 2026-02-04
publisher: Leibniz-Zentrum für Archäologie (LEIZA)
alternative label: mürbe
broader: Festigkeit
broader transitive: Festigkeit
broader transitive: [Untersuchungsergebnisse]
broader transitive: Zustandserfassung
broader transitive: Objektuntersuchung
broader transitive: Zustandsbeschreibung
definition: Das Objektmaterial zeigt eine geringe Festigkeit und Widerstandsfähigkeit gegen Verformung. Es neigt bei anhaltender Belastung zu plötzlichem Bruch ohne vorherige elastische Verformung.
in scheme: Konservierungs- und Restaurierungsfachthesaurus für archäologische Kulturgüter
alt label: mürbe
  type: Label
  rank: preferred
pref label: spröde
  type: Label
  rank: preferred

elastisch
type: Concept
notation: BCG421
created: 2026-01-30
issued: 2026-01-30
modified: 2026-02-04
publisher: Leibniz-Zentrum für Archäologie (LEIZA)
broader: Festigkeit
broader transitive: [Untersuchungsergebnisse]
broader transitive: Zustandserfassung
broader transitive: Objektuntersuchung
broader transitive: Zustandsbeschreibung
broader transitive: Festigkeit
definition: Das Objektmaterial zeigt eine geringe Festigkeit, aber gute Widerstandsfähigkeit gegenüber dauerhafter Verformung. Es ist fähig, nach der Verformung in seine ursprüngliche Form zurückzukehren.
in scheme: Konservierungs- und Restaurierungsfachthesaurus für archäologische Kulturgüter
pref label: elastisch
  type: Label
  rank: preferred

weich
type: Concept
notation: BF6339
created: 2026-01-30
issued: 2026-01-30
modified: 2026-02-04
publisher: Leibniz-Zentrum für Archäologie (LEIZA)
broader: Festigkeit
broader transitive: Festigkeit
broader transitive: [Untersuchungsergebnisse]
broader transitive: Zustandserfassung
broader transitive: Objektuntersuchung
broader transitive: Zustandsbeschreibung
definition: Das Objektmaterial zeigt eine geringe Festigkeit, ist leicht verformbar und bietet wenig Widerstand gegen mechanische Belastung wie Druck oder Kratzer.
in scheme: Konservierungs- und Restaurierungsfachthesaurus für archäologische Kulturgüter
pref label: weich
  type: Label
  rank: preferred

zugfest
type: Concept
notation: DB581C
created: 2026-01-30
issued: 2026-01-30
modified: 2026-02-04
publisher: Leibniz-Zentrum für Archäologie (LEIZA)
broader: Festigkeit
broader transitive: Festigkeit
broader transitive: [Untersuchungsergebnisse]
broader transitive: Zustandserfassung
broader transitive: Objektuntersuchung
broader transitive: Zustandsbeschreibung
definition: Das Objektmaterial zeigt eine gute Festigkeit und Widerstandsfähigkeit gegen ziehende Kräfte
in scheme: Konservierungs- und Restaurierungsfachthesaurus für archäologische Kulturgüter
pref label: zugfest
  type: Label
  rank: preferred

fragil
type: Concept
notation: DG7A1D
created: 2026-01-30
issued: 2026-01-30
modified: 2026-02-04
publisher: Leibniz-Zentrum für Archäologie (LEIZA)
broader: Festigkeit
broader transitive: Festigkeit
broader transitive: [Untersuchungsergebnisse]
broader transitive: Zustandserfassung
broader transitive: Objektuntersuchung
broader transitive: Zustandsbeschreibung
definition: Anfälligkeit des Objektwerkstoffs für Kohäsionsverlust. Das Material des Objektes ist leicht zerbrechlich oder empfindlich gegenüber physischer Einflüsse wie Stöße, Druck oder andere mechanischer Belastung. Ein Objekt dessen Werkstoff fragil ist, ist meistens in sich auch instabil, da es durch die Materialschwächung bei weiterer physischer Einwirkung nicht in der Lage ist seine ursprüngliche Form zu behalten.
definition:
  literal form: Anfälligkeit des Objektwerkstoffs für Kohäsionsverlust. Das Material des Objektes ist leicht zerbrechlich oder empfindlich gegenüber physischer Einflüsse wie Stöße, Druck oder andere mechanischer Belastung. Ein Objekt dessen Werkstoff fragil ist, ist meistens in sich auch instabil, da es durch die Materialschwächung bei weiterer physischer Einwirkung nicht in der Lage ist seine ursprüngliche Form zu behalten.
in scheme: Konservierungs- und Restaurierungsfachthesaurus für archäologische Kulturgüter
pref label: fragil
  type: Label
  rank: preferred

hart
type: Concept
notation: FBG2B1
created: 2026-01-30
issued: 2026-01-30
modified: 2026-02-04
publisher: Leibniz-Zentrum für Archäologie (LEIZA)
broader: Festigkeit
broader transitive: Festigkeit
broader transitive: [Untersuchungsergebnisse]
broader transitive: Zustandserfassung
broader transitive: Objektuntersuchung
broader transitive: Zustandsbeschreibung
definition: Das Objektmaterial zeigt eine überaus hohe Festigkeit und ist somit sehr Wiederstandsfähig gegen Verformung, Kratzer oder Eindringen.
in scheme: Konservierungs- und Restaurierungsfachthesaurus für archäologische Kulturgüter
pref label: hart
  type: Label
  rank: preferred

schlagfest
type: Concept
notation: G147AG
created: 2026-01-30
issued: 2026-01-30
modified: 2026-02-04
publisher: Leibniz-Zentrum für Archäologie (LEIZA)
broader: Festigkeit
broader transitive: Festigkeit
broader transitive: [Untersuchungsergebnisse]
broader transitive: Zustandserfassung
broader transitive: Objektuntersuchung
broader transitive: Zustandsbeschreibung
definition: Das Objektmaterial zeigt eine gute Festigkeit und Widerstandsfähigkeit gegen Stöße und plötzliche Belastungen
in scheme: Konservierungs- und Restaurierungsfachthesaurus für archäologische Kulturgüter
pref label: schlagfest
  type: Label
  rank: preferred

druckfest
type: Concept
notation: G2A47C
created: 2026-01-30
issued: 2026-01-30
modified: 2026-02-04
publisher: Leibniz-Zentrum für Archäologie (LEIZA)
broader: Festigkeit
broader transitive: Festigkeit
broader transitive: [Untersuchungsergebnisse]
broader transitive: Zustandserfassung
broader transitive: Objektuntersuchung
broader transitive: Zustandsbeschreibung
definition: Das Objektmaterial zeigt eine gute Festigkeit und Widerstandsfähigkeit gegen Druckbelastung
in scheme: Konservierungs- und Restaurierungsfachthesaurus für archäologische Kulturgüter
pref label: druckfest
  type: Label
  rank: preferred

biegefest
type: Concept
notation: G2F586
created: 2026-01-30
issued: 2026-01-30
modified: 2026-02-04
publisher: Leibniz-Zentrum für Archäologie (LEIZA)
broader: Festigkeit
broader transitive: Festigkeit
broader transitive: [Untersuchungsergebnisse]
broader transitive: Zustandserfassung
broader transitive: Objektuntersuchung
broader transitive: Zustandsbeschreibung
definition: Das Objektmaterial zeigt eine gute Festigkeit und Widerstandsfähigkeit gegen Biegung und lässt sich nicht leicht durchbiegen.
in scheme: Konservierungs- und Restaurierungsfachthesaurus für archäologische Kulturgüter
pref label: biegefest
  type: Label
  rank: preferred

Veränderung durch frühere Erhaltungsmaßnahmen
type: Concept
notation: A5D63G
created: 2026-01-30
issued: 2026-01-30
modified: 2026-02-04
publisher: Leibniz-Zentrum für Archäologie (LEIZA)
alternative label: Altrestaurierung
alternative label: Vorbehandlung
broader: Veränderung
broader transitive: Veränderung
broader transitive: [Untersuchungsergebnisse]
broader transitive: Zustandserfassung
broader transitive: Objektuntersuchung
broader transitive: Zustandsbeschreibung
definition: Veränderung des Objektest, die auf eine (oder mehrere) vorangegangene Konservierungs- und/oder Restaurierungsmaßnahme zurück zu führen und aus heutiger Sicht als kritisch/nicht mehr fachgerecht zu beurteilen ist.
definition:
  literal form: Veränderung des Objektest, die auf eine (oder mehrere) vorangegangene Konservierungs- und/oder Restaurierungsmaßnahme zurück zu führen und aus heutiger Sicht als kritisch/nicht mehr fachgerecht zu beurteilen ist.
in scheme: Konservierungs- und Restaurierungsfachthesaurus für archäologische Kulturgüter
narrower: Substanzabtrag (frühere Maßnahme)
narrower: Oberflächenveränderung (frühere Maßnahmen)
narrower: rezente Materialhinzufügung (frühere Maßnahme)
alt label: Altrestaurierung
  type: Label
  rank: preferred
alt label: Vorbehandlung
  type: Label
  rank: normal
pref label: Veränderung durch frühere Erhaltungsmaßnahmen
  type: Label
  rank: preferred

Substanzabtrag (frühere Maßnahme)
type: Concept
notation: AB2884
created: 2026-01-30
issued: 2026-01-30
modified: 2026-02-04
publisher: Leibniz-Zentrum für Archäologie (LEIZA)
alternative label: Materialverlust (frühere Maßnahme)
broader: Veränderung durch frühere Erhaltungsmaßnahmen
broader transitive: Veränderung durch frühere Erhaltungsmaßnahmen
broader transitive: [Untersuchungsergebnisse]
broader transitive: Zustandserfassung
broader transitive: Veränderung
broader transitive: Objektuntersuchung
broader transitive: Zustandsbeschreibung
definition: Veränderungen in Form von Materialabtragung durch starke Reinigung, Polierung oder Abschleifung, die im Zuge einer früheren Restaurierungsmaßnahme durchgeführt wurde.
in scheme: Konservierungs- und Restaurierungsfachthesaurus für archäologische Kulturgüter
narrower: abgerundete Kanten
narrower: abgetragene Oberfläche
narrower: überformt
narrower: beschliffene Fläche
narrower: ausgedünnt
alt label: Materialverlust (frühere Maßnahme)
  type: Label
  rank: preferred
pref label: Substanzabtrag (frühere Maßnahme)
  type: Label
  rank: preferred

Oberflächenveränderung (frühere Maßnahmen)
type: Concept
notation: AF857A
created: 2026-01-30
issued: 2026-01-30
modified: 2026-02-04
publisher: Leibniz-Zentrum für Archäologie (LEIZA)
broader: Veränderung durch frühere Erhaltungsmaßnahmen
broader transitive: Veränderung durch frühere Erhaltungsmaßnahmen
broader transitive: Veränderung
broader transitive: [Untersuchungsergebnisse]
broader transitive: Zustandserfassung
broader transitive: Objektuntersuchung
broader transitive: Zustandsbeschreibung
definition: Durch frühere Konservierungs- und/oder Restaurierungsmaßnahmen verursachte Veränderung, die die Oberfläche des Objektes in Glanz, Mattheit oder Struktur sichtbar betreffen.
in scheme: Konservierungs- und Restaurierungsfachthesaurus für archäologische Kulturgüter
narrower: überglänzt
narrower: mattiert (frühere Maßnahme)
narrower: zerkratzt (frühere Maßnahme)
narrower: aufgeraut (frühere Maßnahme)
narrower: vergilbter Überzug
pref label: Oberflächenveränderung (frühere Maßnahmen)
  type: Label
  rank: preferred

rezente Materialhinzufügung (frühere Maßnahme)
type: Concept
notation: FA68C2
created: 2026-01-30
issued: 2026-01-30
modified: 2026-02-04
publisher: Leibniz-Zentrum für Archäologie (LEIZA)
alternative label: Materialreste
alternative label: rezente Anhaftungen
broader: Veränderung durch frühere Erhaltungsmaßnahmen
broader transitive: Veränderung durch frühere Erhaltungsmaßnahmen
broader transitive: [Untersuchungsergebnisse]
broader transitive: Zustandserfassung
broader transitive: Veränderung
broader transitive: Objektuntersuchung
broader transitive: Zustandsbeschreibung
definition: Im Zuge früherer Konservierungs- und/oder Restaurierungsmaßnahmen an oder in das Objekt eingebrachte rezente Materialien.
in scheme: Konservierungs- und Restaurierungsfachthesaurus für archäologische Kulturgüter
narrower: Plastilinreste
narrower: Klebstoffreste
narrower: Silikonreste
narrower: Wachsreste
narrower: Rückstände verwendeter Reinigungsmittel
narrower: Reste einer Schutzschicht
narrower: Ergänzung (Zustandsbeschreibung)
alt label: Materialreste
  type: Label
  rank: preferred
alt label: rezente Anhaftungen
  type: Label
  rank: normal
pref label: rezente Materialhinzufügung (frühere Maßnahme)
  type: Label
  rank: preferred

überglänzt
type: Concept
notation: BB3BBF
created: 2026-01-30
issued: 2026-01-30
modified: 2026-02-04
publisher: Leibniz-Zentrum für Archäologie (LEIZA)
alternative label: überpoliert
broader: Oberflächenveränderung (frühere Maßnahmen)
broader transitive: Veränderung durch frühere Erhaltungsmaßnahmen
broader transitive: Veränderung
broader transitive: [Untersuchungsergebnisse]
broader transitive: Zustandserfassung
broader transitive: Objektuntersuchung
broader transitive: Zustandsbeschreibung
broader transitive: Oberflächenveränderung (frühere Maßnahmen)
definition: Glanzbildung, die nicht der ursprünglichen Gestaltung des Objektes entspricht und auf eine übermäßige Reinigung oder Politur im Zuge einer früheren Erhaltungsmaßnahme zurückzuführen ist.
in scheme: Konservierungs- und Restaurierungsfachthesaurus für archäologische Kulturgüter
alt label: überpoliert
  type: Label
  rank: preferred
pref label: überglänzt
  type: Label
  rank: preferred

mattiert (frühere Maßnahme)
type: Concept
notation: BB9272
created: 2026-01-30
issued: 2026-01-30
modified: 2026-02-04
publisher: Leibniz-Zentrum für Archäologie (LEIZA)
broader: Oberflächenveränderung (frühere Maßnahmen)
broader transitive: Veränderung durch frühere Erhaltungsmaßnahmen
broader transitive: Veränderung
broader transitive: [Untersuchungsergebnisse]
broader transitive: Zustandserfassung
broader transitive: Objektuntersuchung
broader transitive: Zustandsbeschreibung
broader transitive: Oberflächenveränderung (frühere Maßnahmen)
in scheme: Konservierungs- und Restaurierungsfachthesaurus für archäologische Kulturgüter
pref label: mattiert (frühere Maßnahme)
  type: Label
  rank: preferred

zerkratzt (frühere Maßnahme)
type: Concept
notation: D9G6BA
created: 2026-01-30
issued: 2026-01-30
modified: 2026-02-04
publisher: Leibniz-Zentrum für Archäologie (LEIZA)
broader: Oberflächenveränderung (frühere Maßnahmen)
broader transitive: Veränderung durch frühere Erhaltungsmaßnahmen
broader transitive: Veränderung
broader transitive: [Untersuchungsergebnisse]
broader transitive: Zustandserfassung
broader transitive: Objektuntersuchung
broader transitive: Zustandsbeschreibung
broader transitive: Oberflächenveränderung (frühere Maßnahmen)
in scheme: Konservierungs- und Restaurierungsfachthesaurus für archäologische Kulturgüter
pref label: zerkratzt (frühere Maßnahme)
  type: Label
  rank: preferred

aufgeraut (frühere Maßnahme)
type: Concept
notation: G8368F
created: 2026-01-30
issued: 2026-01-30
modified: 2026-02-04
publisher: Leibniz-Zentrum für Archäologie (LEIZA)
broader: Oberflächenveränderung (frühere Maßnahmen)
broader transitive: Veränderung durch frühere Erhaltungsmaßnahmen
broader transitive: [Untersuchungsergebnisse]
broader transitive: Zustandserfassung
broader transitive: Veränderung
broader transitive: Objektuntersuchung
broader transitive: Zustandsbeschreibung
broader transitive: Oberflächenveränderung (frühere Maßnahmen)
in scheme: Konservierungs- und Restaurierungsfachthesaurus für archäologische Kulturgüter
pref label: aufgeraut (frühere Maßnahme)
  type: Label
  rank: preferred

vergilbter Überzug
type: Concept
notation: G95116
created: 2026-01-30
issued: 2026-01-30
modified: 2026-02-04
publisher: Leibniz-Zentrum für Archäologie (LEIZA)
broader: Oberflächenveränderung (frühere Maßnahmen)
broader transitive: Veränderung durch frühere Erhaltungsmaßnahmen
broader transitive: [Untersuchungsergebnisse]
broader transitive: Zustandserfassung
broader transitive: Veränderung
broader transitive: Objektuntersuchung
broader transitive: Zustandsbeschreibung
broader transitive: Oberflächenveränderung (frühere Maßnahmen)
in scheme: Konservierungs- und Restaurierungsfachthesaurus für archäologische Kulturgüter
pref label: vergilbter Überzug
  type: Label
  rank: preferred

gealtert
type: Concept
notation: C77G9C
created: 2026-01-30
issued: 2026-01-30
modified: 2026-02-04
publisher: Leibniz-Zentrum für Archäologie (LEIZA)
alternative label: natürliche Alterung
broader: Veränderung
broader transitive: Veränderung
broader transitive: [Untersuchungsergebnisse]
broader transitive: Zustandserfassung
broader transitive: Objektuntersuchung
broader transitive: Zustandsbeschreibung
definition: An dem Objekt sind Spuren der Veränderung zu beobachten, die auf verschiedenste Einflüsse im Laufe der Lebensgeschichte (der Alterung) des Objektes zurück zu führen sind. Eine alterungsbedingte Veränderung ist nicht zwangsläufig als Beschädigung, sondern unter Umständen als aussagekräftiger Teil der Objektbiographie zu werten.
definition:
  literal form: An dem Objekt sind Spuren der Veränderung zu beobachten, die auf verschiedenste Einflüsse im Laufe der Lebensgeschichte (der Alterung) des Objektes zurück zu führen sind. Eine alterungsbedingte Veränderung ist nicht zwangsläufig als Beschädigung, sondern unter Umständen als aussagekräftiger Teil der Objektbiographie zu werten.
in scheme: Konservierungs- und Restaurierungsfachthesaurus für archäologische Kulturgüter
alt label: natürliche Alterung
  type: Label
  rank: preferred
pref label: gealtert
  type: Label
  rank: preferred

historische Veränderung
type: Concept
notation: CC2F9C
created: 2026-01-30
issued: 2026-01-30
modified: 2026-02-04
publisher: Leibniz-Zentrum für Archäologie (LEIZA)
alternative label: antike Veränderung
broader: Veränderung
broader transitive: Veränderung
broader transitive: [Untersuchungsergebnisse]
broader transitive: Zustandserfassung
broader transitive: Objektuntersuchung
broader transitive: Zustandsbeschreibung
definition: Beeinträchtigung eines Objektes, die bereits vor der Bodenlagerung, d.h. in der historischen Geschichte des Objektes, entstanden ist. Eine solche Beeinträchtigung kann infolge der Konzeption, des Herstellungsverfahrens oder der historischen Verwendung auftreten. Sie liefert wichtige Informationen über den kulturellen und historischen Kontext sowie über die technologischen Fähigkeiten der Menschen, die das Objekt hergestellt oder verwendet haben, tragen somit zur wissenschaftlichen Aussagekraft des Objektes bei und bedürfen in der Regel keiner konservatorischen oder restauratorischen Behandlung.
definition:
  literal form: Beeinträchtigung eines Objektes, die bereits vor der Bodenlagerung, d.h. in der historischen Geschichte des Objektes, entstanden ist. Eine solche Beeinträchtigung kann infolge der Konzeption, des Herstellungsverfahrens oder der historischen Verwendung auftreten. Sie liefert wichtige Informationen über den kulturellen und historischen Kontext sowie über die technologischen Fähigkeiten der Menschen, die das Objekt hergestellt oder verwendet haben, tragen somit zur wissenschaftlichen Aussagekraft des Objektes bei und bedürfen in der Regel keiner konservatorischen oder restauratorischen Behandlung.
in scheme: Konservierungs- und Restaurierungsfachthesaurus für archäologische Kulturgüter
alt label: antike Veränderung
  type: Label
  rank: preferred
pref label: historische Veränderung
  type: Label
  rank: preferred

beschädigt
type: Concept
notation: G43DBC
created: 2026-01-30
issued: 2026-01-30
modified: 2026-02-04
publisher: Leibniz-Zentrum für Archäologie (LEIZA)
alternative label: Beschädigung
alternative label: Schaden
broader: Veränderung
broader transitive: Veränderung
broader transitive: [Untersuchungsergebnisse]
broader transitive: Zustandserfassung
broader transitive: Objektuntersuchung
broader transitive: Zustandsbeschreibung
definition: Das Objekt weist eine ungewollte, negative Veränderung im Vergleich zu seinem ursprünglichen Aussehen auf, die die wissenschaftliche Aussagekraft des Objektes mindert.
in scheme: Konservierungs- und Restaurierungsfachthesaurus für archäologische Kulturgüter
alt label: Beschädigung
  type: Label
  rank: preferred
alt label: Schaden
  type: Label
  rank: normal
pref label: beschädigt
  type: Label
  rank: preferred

Plastilinreste
type: Concept
notation: A6DC45
created: 2026-01-30
issued: 2026-01-30
modified: 2026-02-04
publisher: Leibniz-Zentrum für Archäologie (LEIZA)
broader: rezente Materialhinzufügung (frühere Maßnahme)
broader transitive: Veränderung durch frühere Erhaltungsmaßnahmen
broader transitive: rezente Materialhinzufügung (frühere Maßnahme)
broader transitive: [Untersuchungsergebnisse]
broader transitive: Zustandserfassung
broader transitive: Veränderung
broader transitive: Objektuntersuchung
broader transitive: Zustandsbeschreibung
in scheme: Konservierungs- und Restaurierungsfachthesaurus für archäologische Kulturgüter
pref label: Plastilinreste
  type: Label
  rank: preferred

abgerundete Kanten
type: Concept
notation: B36F5A
created: 2026-01-30
issued: 2026-01-30
modified: 2026-02-04
publisher: Leibniz-Zentrum für Archäologie (LEIZA)
broader: Substanzabtrag (frühere Maßnahme)
broader transitive: Veränderung durch frühere Erhaltungsmaßnahmen
broader transitive: Substanzabtrag (frühere Maßnahme)
broader transitive: [Untersuchungsergebnisse]
broader transitive: Zustandserfassung
broader transitive: Veränderung
broader transitive: Objektuntersuchung
broader transitive: Zustandsbeschreibung
in scheme: Konservierungs- und Restaurierungsfachthesaurus für archäologische Kulturgüter
pref label: abgerundete Kanten
  type: Label
  rank: preferred

abgetragene Oberfläche
type: Concept
notation: C6G641
created: 2026-01-30
issued: 2026-01-30
modified: 2026-02-04
publisher: Leibniz-Zentrum für Archäologie (LEIZA)
broader: Substanzabtrag (frühere Maßnahme)
broader transitive: Veränderung durch frühere Erhaltungsmaßnahmen
broader transitive: Substanzabtrag (frühere Maßnahme)
broader transitive: [Untersuchungsergebnisse]
broader transitive: Zustandserfassung
broader transitive: Veränderung
broader transitive: Objektuntersuchung
broader transitive: Zustandsbeschreibung
in scheme: Konservierungs- und Restaurierungsfachthesaurus für archäologische Kulturgüter
pref label: abgetragene Oberfläche
  type: Label
  rank: preferred

überformt
type: Concept
notation: DFAFB5
created: 2026-01-30
issued: 2026-01-30
modified: 2026-02-04
publisher: Leibniz-Zentrum für Archäologie (LEIZA)
alternative label: Überformung
broader: Substanzabtrag (frühere Maßnahme)
broader transitive: Veränderung durch frühere Erhaltungsmaßnahmen
broader transitive: Substanzabtrag (frühere Maßnahme)
broader transitive: [Untersuchungsergebnisse]
broader transitive: Zustandserfassung
broader transitive: Veränderung
broader transitive: Objektuntersuchung
broader transitive: Zustandsbeschreibung
in scheme: Konservierungs- und Restaurierungsfachthesaurus für archäologische Kulturgüter
alt label: Überformung
  type: Label
  rank: preferred
pref label: überformt
  type: Label
  rank: preferred

beschliffene Fläche
type: Concept
notation: F3819B
created: 2026-01-30
issued: 2026-01-30
modified: 2026-02-04
publisher: Leibniz-Zentrum für Archäologie (LEIZA)
alternative label: Schleifspuren (frühere Maßnahme)
broader: Substanzabtrag (frühere Maßnahme)
broader transitive: Veränderung durch frühere Erhaltungsmaßnahmen
broader transitive: Substanzabtrag (frühere Maßnahme)
broader transitive: [Untersuchungsergebnisse]
broader transitive: Zustandserfassung
broader transitive: Veränderung
broader transitive: Objektuntersuchung
broader transitive: Zustandsbeschreibung
in scheme: Konservierungs- und Restaurierungsfachthesaurus für archäologische Kulturgüter
alt label: Schleifspuren (frühere Maßnahme)
  type: Label
  rank: preferred
pref label: beschliffene Fläche
  type: Label
  rank: preferred

ausgedünnt
type: Concept
notation: G8D88A
created: 2026-01-30
issued: 2026-01-30
modified: 2026-02-04
publisher: Leibniz-Zentrum für Archäologie (LEIZA)
broader: Substanzabtrag (frühere Maßnahme)
broader transitive: Veränderung durch frühere Erhaltungsmaßnahmen
broader transitive: Substanzabtrag (frühere Maßnahme)
broader transitive: [Untersuchungsergebnisse]
broader transitive: Zustandserfassung
broader transitive: Veränderung
broader transitive: Objektuntersuchung
broader transitive: Zustandsbeschreibung
in scheme: Konservierungs- und Restaurierungsfachthesaurus für archäologische Kulturgüter
pref label: ausgedünnt
  type: Label
  rank: preferred

Klebstoffreste
type: Concept
notation: AB9B7A
created: 2026-01-30
issued: 2026-01-30
modified: 2026-02-04
publisher: Leibniz-Zentrum für Archäologie (LEIZA)
broader: rezente Materialhinzufügung (frühere Maßnahme)
broader transitive: Veränderung durch frühere Erhaltungsmaßnahmen
broader transitive: rezente Materialhinzufügung (frühere Maßnahme)
broader transitive: [Untersuchungsergebnisse]
broader transitive: Zustandserfassung
broader transitive: Veränderung
broader transitive: Objektuntersuchung
broader transitive: Zustandsbeschreibung
in scheme: Konservierungs- und Restaurierungsfachthesaurus für archäologische Kulturgüter
pref label: Klebstoffreste
  type: Label
  rank: preferred

Silikonreste
type: Concept
notation: AD6D9F
created: 2026-01-30
issued: 2026-01-30
modified: 2026-02-04
publisher: Leibniz-Zentrum für Archäologie (LEIZA)
broader: rezente Materialhinzufügung (frühere Maßnahme)
broader transitive: Veränderung durch frühere Erhaltungsmaßnahmen
broader transitive: rezente Materialhinzufügung (frühere Maßnahme)
broader transitive: [Untersuchungsergebnisse]
broader transitive: Zustandserfassung
broader transitive: Veränderung
broader transitive: Objektuntersuchung
broader transitive: Zustandsbeschreibung
in scheme: Konservierungs- und Restaurierungsfachthesaurus für archäologische Kulturgüter
pref label: Silikonreste
  type: Label
  rank: preferred

Wachsreste
type: Concept
notation: C134GA
created: 2026-01-30
issued: 2026-01-30
modified: 2026-02-04
publisher: Leibniz-Zentrum für Archäologie (LEIZA)
broader: rezente Materialhinzufügung (frühere Maßnahme)
broader transitive: Veränderung durch frühere Erhaltungsmaßnahmen
broader transitive: rezente Materialhinzufügung (frühere Maßnahme)
broader transitive: [Untersuchungsergebnisse]
broader transitive: Zustandserfassung
broader transitive: Veränderung
broader transitive: Objektuntersuchung
broader transitive: Zustandsbeschreibung
in scheme: Konservierungs- und Restaurierungsfachthesaurus für archäologische Kulturgüter
pref label: Wachsreste
  type: Label
  rank: preferred

Rückstände verwendeter Reinigungsmittel
type: Concept
notation: CCB5D9
created: 2026-01-30
issued: 2026-01-30
modified: 2026-02-04
publisher: Leibniz-Zentrum für Archäologie (LEIZA)
broader: rezente Materialhinzufügung (frühere Maßnahme)
broader transitive: Veränderung durch frühere Erhaltungsmaßnahmen
broader transitive: rezente Materialhinzufügung (frühere Maßnahme)
broader transitive: [Untersuchungsergebnisse]
broader transitive: Zustandserfassung
broader transitive: Veränderung
broader transitive: Objektuntersuchung
broader transitive: Zustandsbeschreibung
in scheme: Konservierungs- und Restaurierungsfachthesaurus für archäologische Kulturgüter
pref label: Rückstände verwendeter Reinigungsmittel
  type: Label
  rank: preferred

Reste einer Schutzschicht
type: Concept
notation: G99G66
created: 2026-01-30
issued: 2026-01-30
modified: 2026-02-04
publisher: Leibniz-Zentrum für Archäologie (LEIZA)
broader: rezente Materialhinzufügung (frühere Maßnahme)
broader transitive: Veränderung durch frühere Erhaltungsmaßnahmen
broader transitive: rezente Materialhinzufügung (frühere Maßnahme)
broader transitive: [Untersuchungsergebnisse]
broader transitive: Zustandserfassung
broader transitive: Veränderung
broader transitive: Objektuntersuchung
broader transitive: Zustandsbeschreibung
in scheme: Konservierungs- und Restaurierungsfachthesaurus für archäologische Kulturgüter
pref label: Reste einer Schutzschicht
  type: Label
  rank: preferred

Ergänzung (Zustandsbeschreibung)
type: Concept
notation: GD4BG9
created: 2026-01-30
issued: 2026-01-30
modified: 2026-02-04
publisher: Leibniz-Zentrum für Archäologie (LEIZA)
broader: rezente Materialhinzufügung (frühere Maßnahme)
broader transitive: Veränderung durch frühere Erhaltungsmaßnahmen
broader transitive: [Untersuchungsergebnisse]
broader transitive: Zustandserfassung
broader transitive: Veränderung
broader transitive: Objektuntersuchung
broader transitive: Zustandsbeschreibung
broader transitive: rezente Materialhinzufügung (frühere Maßnahme)
in scheme: Konservierungs- und Restaurierungsfachthesaurus für archäologische Kulturgüter
pref label: Ergänzung (Zustandsbeschreibung)
  type: Label
  rank: preferred

Nass (Objektzustand)
type: Concept
notation: A255FD
preferred label: wet @en
created: 2026-01-30
issued: 2026-01-30
modified: 2026-02-04
publisher: Leibniz-Zentrum für Archäologie (LEIZA)
alternative label: Wassergesättigt
broader: Feuchtigkeitsgehalt
broader transitive: Feuchtigkeitsgehalt
broader transitive: [Untersuchungsergebnisse]
broader transitive: Zustandserfassung
broader transitive: Objektuntersuchung
broader transitive: Zustandsbeschreibung
definition: Das Materialgefüge/der Porenraum des Objektes ist vollständig mit Wasser gesättigt.
in scheme: Konservierungs- und Restaurierungsfachthesaurus für archäologische Kulturgüter
alt label: Wassergesättigt
  type: Label
  rank: preferred
pref label: Nass (Objektzustand)
  type: Label
  rank: preferred
pref label: wet
  type: Label
  rank: normal

Feucht (Objektzustand)
type: Concept
notation: FDB9F5
preferred label: moist @en
created: 2026-01-30
issued: 2026-01-30
modified: 2026-02-04
publisher: Leibniz-Zentrum für Archäologie (LEIZA)
broader: Feuchtigkeitsgehalt
broader transitive: [Untersuchungsergebnisse]
broader transitive: Zustandserfassung
broader transitive: Objektuntersuchung
broader transitive: Zustandsbeschreibung
broader transitive: Feuchtigkeitsgehalt
in scheme: Konservierungs- und Restaurierungsfachthesaurus für archäologische Kulturgüter
pref label: Feucht (Objektzustand)
  type: Label
  rank: preferred
pref label: moist
  type: Label
  rank: normal
definition: Das Materialgefüge/der Porenraum des Objektes oder dessen Oberfläche weisen einen leichten bis mittelstarken Wassergehalt auf.

Trocken (Objektzustand)
type: Concept
notation: G41GC6
preferred label: dry @en
created: 2026-01-30
issued: 2026-01-30
modified: 2026-02-04
publisher: Leibniz-Zentrum für Archäologie (LEIZA)
broader: Feuchtigkeitsgehalt
broader transitive: [Untersuchungsergebnisse]
broader transitive: Zustandserfassung
broader transitive: Objektuntersuchung
broader transitive: Zustandsbeschreibung
broader transitive: Feuchtigkeitsgehalt
in scheme: Konservierungs- und Restaurierungsfachthesaurus für archäologische Kulturgüter
pref label: Trocken (Objektzustand)
  type: Label
  rank: preferred
pref label: dry
  type: Label
  rank: normal
definition: Das Materialgefüge/der Porenraum des Objektes oder dessen Oberfläche weisen keinen Wassergehalt auf.

[materialspezifische Schadensphänomene]
type: Concept
type: NonIndexingConcept
type: GuideTerm
notation: A7B171
created: 2026-01-30
issued: 2026-01-30
modified: 2026-02-04
publisher: Leibniz-Zentrum für Archäologie (LEIZA)
broader: Schadensphänomen
broader transitive: [Untersuchungsergebnisse]
broader transitive: Zustandserfassung
broader transitive: Objektuntersuchung
broader transitive: Schadensphänomen
definition: negative Veränderungen an Objekten, die nur bei speziellen Materialien auftreten.
in scheme: Konservierungs- und Restaurierungsfachthesaurus für archäologische Kulturgüter
pref label: [materialspezifische Schadensphänomene]
  type: Label
  rank: preferred
narrower: [spezifische Schadensphänomene an Metallen]
narrower: [spezifische Schadensphänomene an Holz]
narrower: [spezifische Schadensphänomene an Glas]
narrower: [spezifische Schadensphänomene an Leder]

[spezifische Schadensphänomene an Metallen]
type: Concept
type: NonIndexingConcept
type: GuideTerm
notation: AF5B1A
created: 2026-01-30
issued: 2026-01-30
modified: 2026-02-04
publisher: Leibniz-Zentrum für Archäologie (LEIZA)
broader: [materialspezifische Schadensphänomene]
broader transitive: [Untersuchungsergebnisse]
broader transitive: Zustandserfassung
broader transitive: Objektuntersuchung
broader transitive: [materialspezifische Schadensphänomene]
broader transitive: Schadensphänomen
definition: negative Veränderungen an Objekten, die nur bei Metallen auftreten.
in scheme: Konservierungs- und Restaurierungsfachthesaurus für archäologische Kulturgüter
pref label: [spezifische Schadensphänomene an Metallen]
  type: Label
  rank: preferred
narrower: Pseudomorphose
narrower: Bronzekrankheit
narrower: Bimetallkorrosion
narrower: Spannungsrisskorrosion
narrower: Zinnpest
narrower: Flächenkorrosion
narrower: Spaltkorrosion
narrower: Lochkorrosion
narrower: interkristalline Korrosion
narrower: Patinabildung

[spezifische Schadensphänomene an Holz]
type: Concept
type: NonIndexingConcept
type: GuideTerm
notation: F1621A
created: 2026-01-30
issued: 2026-01-30
modified: 2026-02-04
publisher: Leibniz-Zentrum für Archäologie (LEIZA)
broader: [materialspezifische Schadensphänomene]
broader transitive: [Untersuchungsergebnisse]
broader transitive: Zustandserfassung
broader transitive: Objektuntersuchung
broader transitive: Schadensphänomen
broader transitive: [materialspezifische Schadensphänomene]
definition: negative Veränderungen an Objekten, die nur bei Holz auftreten.
in scheme: Konservierungs- und Restaurierungsfachthesaurus für archäologische Kulturgüter
pref label: [spezifische Schadensphänomene an Holz]
  type: Label
  rank: preferred

[spezifische Schadensphänomene an Glas]
type: Concept
type: NonIndexingConcept
type: GuideTerm
notation: G1C1DC
created: 2026-01-30
issued: 2026-01-30
modified: 2026-02-04
publisher: Leibniz-Zentrum für Archäologie (LEIZA)
broader: [materialspezifische Schadensphänomene]
broader transitive: [materialspezifische Schadensphänomene]
broader transitive: [Untersuchungsergebnisse]
broader transitive: Zustandserfassung
broader transitive: Objektuntersuchung
broader transitive: Schadensphänomen
definition: negative Veränderungen an Objekten, die nur bei Glas auftreten.
in scheme: Konservierungs- und Restaurierungsfachthesaurus für archäologische Kulturgüter
pref label: [spezifische Schadensphänomene an Glas]
  type: Label
  rank: preferred
narrower: weeping
narrower: Glaskorrosion
narrower: irisierende Farbveränderung

[spezifische Schadensphänomene an Leder]
type: Concept
type: NonIndexingConcept
type: GuideTerm
notation: G77F84
created: 2026-01-30
issued: 2026-01-30
modified: 2026-02-04
publisher: Leibniz-Zentrum für Archäologie (LEIZA)
broader: [materialspezifische Schadensphänomene]
broader transitive: [materialspezifische Schadensphänomene]
broader transitive: [Untersuchungsergebnisse]
broader transitive: Zustandserfassung
broader transitive: Objektuntersuchung
broader transitive: Schadensphänomen
definition: negative Veränderungen an Objekten, die nur bei Leder auftreten.
in scheme: Konservierungs- und Restaurierungsfachthesaurus für archäologische Kulturgüter
pref label: [spezifische Schadensphänomene an Leder]
  type: Label
  rank: preferred
narrower: roter Zerfall

Pseudomorphose
type: Concept
notation: B19D33
created: 2026-01-30
issued: 2026-01-30
modified: 2026-02-04
publisher: Leibniz-Zentrum für Archäologie (LEIZA)
alternative label: mineralisierte Organik
broader: [spezifische Schadensphänomene an Metallen]
broader transitive: [materialspezifische Schadensphänomene]
broader transitive: [spezifische Schadensphänomene an Metallen]
broader transitive: [Untersuchungsergebnisse]
broader transitive: Zustandserfassung
broader transitive: Objektuntersuchung
broader transitive: Schadensphänomen
definition: Durch Korrosionsprodukte auf Eisenobjekten in mineralisierter Form abgebildetet Spuren von vergangenem organischen Material
in scheme: Konservierungs- und Restaurierungsfachthesaurus für archäologische Kulturgüter
alt label: mineralisierte Organik
  type: Label
  rank: preferred
pref label: Pseudomorphose
  type: Label
  rank: preferred

Bronzekrankheit
type: Concept
notation: B9C457
preferred label: bronze disease @en
created: 2026-01-30
issued: 2026-01-30
modified: 2026-02-04
publisher: Leibniz-Zentrum für Archäologie (LEIZA)
broader: [spezifische Schadensphänomene an Metallen]
broader transitive: [materialspezifische Schadensphänomene]
broader transitive: [spezifische Schadensphänomene an Metallen]
broader transitive: [Untersuchungsergebnisse]
broader transitive: Zustandserfassung
broader transitive: Objektuntersuchung
broader transitive: Schadensphänomen
definition: Bildung von hellgrünen, pulverförmigen Agglomeraten in der Matrix eines Buntmetallobjektes, dass die originale Oberfläche und das ursprüngliche Aussehen des Objektes negativ beeinflusst. Die Bildung dieser Produkte ist auf eine fortschreitende Korrosion, durch die Wechselwirkung von enthaltenen Chloriden und den metallischen Bestandteilen des Objektes bei hoher Luftfeuchtigkeit, zurück zu führen.
definition:
  literal form: Bildung von hellgrünen, pulverförmigen Agglomeraten in der Matrix eines Buntmetallobjektes, dass die originale Oberfläche und das ursprüngliche Aussehen des Objektes negativ beeinflusst. Die Bildung dieser Produkte ist auf eine fortschreitende Korrosion, durch die Wechselwirkung von enthaltenen Chloriden und den metallischen Bestandteilen des Objektes bei hoher Luftfeuchtigkeit, zurück zu führen.
in scheme: Konservierungs- und Restaurierungsfachthesaurus für archäologische Kulturgüter
pref label: Bronzekrankheit
  type: Label
  rank: preferred
pref label: bronze disease
  type: Label
  rank: normal

Bimetallkorrosion
type: Concept
notation: BCDC47
preferred label: galvanic corrosion @en
created: 2026-01-30
issued: 2026-01-30
modified: 2026-02-04
publisher: Leibniz-Zentrum für Archäologie (LEIZA)
alternative label: Kontaktkorrosion
alternative label: bimetallic corrosion @en
alternative label: galvanische Korrosion
broader: [spezifische Schadensphänomene an Metallen]
broader transitive: [Untersuchungsergebnisse]
broader transitive: Zustandserfassung
broader transitive: Objektuntersuchung
broader transitive: [materialspezifische Schadensphänomene]
broader transitive: Schadensphänomen
broader transitive: [spezifische Schadensphänomene an Metallen]
definition: Korrosionsangriff, der durch die Berührung zweier Metalle mit unterschiedlicher Elektronegativität auftritt. An den Berührungspunkten entsteht, unter Anwesenheit eines Elektrolyten (z.B. Wasser/Luftfeuchtigkeit), eine galvanische Zelle bei der das unedlere Metall als Anode fungiert und entsprechend korrodiert wird, während das edlere Metall als Kathode relativ unbeschädigt bleibt. Typische Beobachtungen bei Kontaktkorrosion sind eine verstärkte Korrosion an den Berührungsstellen der beiden Metalle sowie Verfärbungen, Materialverlust und Ablagerungen von Korrosionsprodukten.
definition:
  literal form: Korrosionsangriff, der durch die Berührung zweier Metalle mit unterschiedlicher Elektronegativität auftritt. An den Berührungspunkten entsteht, unter Anwesenheit eines Elektrolyten (z.B. Wasser/Luftfeuchtigkeit), eine galvanische Zelle bei der das unedlere Metall als Anode fungiert und entsprechend korrodiert wird, während das edlere Metall als Kathode relativ unbeschädigt bleibt. Typische Beobachtungen bei Kontaktkorrosion sind eine verstärkte Korrosion an den Berührungsstellen der beiden Metalle sowie Verfärbungen, Materialverlust und Ablagerungen von Korrosionsprodukten.
in scheme: Konservierungs- und Restaurierungsfachthesaurus für archäologische Kulturgüter
alt label: bimetallic corrosion
  type: Label
  rank: normal
alt label: galvanische Korrosion
  type: Label
  rank: preferred
alt label: Kontaktkorrosion
  type: Label
  rank: normal
pref label: Bimetallkorrosion
  type: Label
  rank: preferred
pref label: galvanic corrosion
  type: Label
  rank: normal

Spannungsrisskorrosion
type: Concept
notation: BFDB22
preferred label: stress corrosion cracking @en
created: 2026-01-30
issued: 2026-01-30
modified: 2026-02-04
publisher: Leibniz-Zentrum für Archäologie (LEIZA)
alternative label: Transkristalline Korrosion
broader: [spezifische Schadensphänomene an Metallen]
broader transitive: [Untersuchungsergebnisse]
broader transitive: Zustandserfassung
broader transitive: Objektuntersuchung
broader transitive: [materialspezifische Schadensphänomene]
broader transitive: Schadensphänomen
broader transitive: [spezifische Schadensphänomene an Metallen]
definition: Rissbildung bis hin zum vollständigen Versagen des Materials durch Eigenspannungen im Werkstoffgefüge in Kombination mit korrosiven Umgebungsbedingungen (u.a. die Anwesenheit eines Elektrolyten). Erstes Anzeichen einer beginnenden Spannungsrisskorrosion ist eine feine, vielfach verzweigte Rissbildung an Stellen mit hoher Spannung oder Materialdefekten.
definition:
  literal form: Rissbildung bis hin zum vollständigen Versagen des Materials durch Eigenspannungen im Werkstoffgefüge in Kombination mit korrosiven Umgebungsbedingungen (u.a. die Anwesenheit eines Elektrolyten). Erstes Anzeichen einer beginnenden Spannungsrisskorrosion ist eine feine, vielfach verzweigte Rissbildung an Stellen mit hoher Spannung oder Materialdefekten.
in scheme: Konservierungs- und Restaurierungsfachthesaurus für archäologische Kulturgüter
alt label: Transkristalline Korrosion
  type: Label
  rank: preferred
pref label: Spannungsrisskorrosion
  type: Label
  rank: preferred
pref label: stress corrosion cracking
  type: Label
  rank: normal

Zinnpest
type: Concept
notation: CFC44A
created: 2026-01-30
issued: 2026-01-30
modified: 2026-02-04
publisher: Leibniz-Zentrum für Archäologie (LEIZA)
broader: [spezifische Schadensphänomene an Metallen]
broader transitive: [Untersuchungsergebnisse]
broader transitive: Zustandserfassung
broader transitive: Objektuntersuchung
broader transitive: [materialspezifische Schadensphänomene]
broader transitive: Schadensphänomen
broader transitive: [spezifische Schadensphänomene an Metallen]
definition: Bei Lagerung unter 13°C auftretende Zerstörung von Zinnobjekten, durch Umwandlungsprozesse innerhalb des metallischen Gefüges. Das Schadensbild zeigt sich im Anfangsstadium meist durch Flecken und Pusteln auf der Metalloberfläche, die sich allmählich ausbreiten und bis zur vollständigen Zerstörung des Objektes durch Materialinstabilität fortschreiten kann.
definition:
  literal form: Bei Lagerung unter 13°C auftretende Zerstörung von Zinnobjekten, durch Umwandlungsprozesse innerhalb des metallischen Gefüges. Das Schadensbild zeigt sich im Anfangsstadium meist durch Flecken und Pusteln auf der Metalloberfläche, die sich allmählich ausbreiten und bis zur vollständigen Zerstörung des Objektes durch Materialinstabilität fortschreiten kann.
in scheme: Konservierungs- und Restaurierungsfachthesaurus für archäologische Kulturgüter
pref label: Zinnpest
  type: Label
  rank: preferred

Flächenkorrosion
type: Concept
notation: D68BAA
created: 2026-01-30
issued: 2026-01-30
modified: 2026-02-04
publisher: Leibniz-Zentrum für Archäologie (LEIZA)
broader: [spezifische Schadensphänomene an Metallen]
broader transitive: [Untersuchungsergebnisse]
broader transitive: Zustandserfassung
broader transitive: Objektuntersuchung
broader transitive: [materialspezifische Schadensphänomene]
broader transitive: Schadensphänomen
broader transitive: [spezifische Schadensphänomene an Metallen]
definition: Über einen großen Bereich der Oberfläche (oder die gesamte Oberfläche) des Objektes verteilt findet ein Korrosionsangriff statt, der zu einem gleichmäßigen Abtrag und der Verdünnung des Materials führt. Die strukturelle Integrität als auch das ästhetische Erscheinungsbild des Objektes sind beeinträchtigt.
definition:
  literal form: Über einen großen Bereich der Oberfläche (oder die gesamte Oberfläche) des Objektes verteilt findet ein Korrosionsangriff statt, der zu einem gleichmäßigen Abtrag und der Verdünnung des Materials führt. Die strukturelle Integrität als auch das ästhetische Erscheinungsbild des Objektes sind beeinträchtigt.
in scheme: Konservierungs- und Restaurierungsfachthesaurus für archäologische Kulturgüter
pref label: Flächenkorrosion
  type: Label
  rank: preferred

Spaltkorrosion
type: Concept
notation: F7F2A4
created: 2026-01-30
issued: 2026-01-30
modified: 2026-02-04
publisher: Leibniz-Zentrum für Archäologie (LEIZA)
broader: [spezifische Schadensphänomene an Metallen]
broader transitive: [materialspezifische Schadensphänomene]
broader transitive: [spezifische Schadensphänomene an Metallen]
broader transitive: [Untersuchungsergebnisse]
broader transitive: Zustandserfassung
broader transitive: Objektuntersuchung
broader transitive: Schadensphänomen
definition: Korrosionserscheinung, die örtlich begrenzt zur Spaltbildung zwischen Oberflächen führt.
in scheme: Konservierungs- und Restaurierungsfachthesaurus für archäologische Kulturgüter
pref label: Spaltkorrosion
  type: Label
  rank: preferred

Lochkorrosion
type: Concept
notation: F9C118
preferred label: pitting corrosion @en
created: 2026-01-30
issued: 2026-01-30
modified: 2026-02-04
publisher: Leibniz-Zentrum für Archäologie (LEIZA)
alternative label: Lochfraßkorrosion
broader: [spezifische Schadensphänomene an Metallen]
broader transitive: [Untersuchungsergebnisse]
broader transitive: Zustandserfassung
broader transitive: Objektuntersuchung
broader transitive: [materialspezifische Schadensphänomene]
broader transitive: Schadensphänomen
broader transitive: [spezifische Schadensphänomene an Metallen]
definition: Bildung von lokalen, punktuellen Vertiefungen oder Löchern auf der Oberfläche eines Objektes, die durch chemische Reaktionen in einem korrosiven Umfeld entstehen. Diese Korrosionserscheinung schwächt das Material lokalisiert und kann zu strukturellen Schäden führen, insbesondere wenn sie unbehandelt bleibt.
definition:
  literal form: Bildung von lokalen, punktuellen Vertiefungen oder Löchern auf der Oberfläche eines Objektes, die durch chemische Reaktionen in einem korrosiven Umfeld entstehen. Diese Korrosionserscheinung schwächt das Material lokalisiert und kann zu strukturellen Schäden führen, insbesondere wenn sie unbehandelt bleibt.
in scheme: Konservierungs- und Restaurierungsfachthesaurus für archäologische Kulturgüter
alt label: Lochfraßkorrosion
  type: Label
  rank: preferred
pref label: Lochkorrosion
  type: Label
  rank: preferred
pref label: pitting corrosion
  type: Label
  rank: normal

interkristalline Korrosion
type: Concept
notation: G2AFC3
created: 2026-01-30
issued: 2026-01-30
modified: 2026-02-04
publisher: Leibniz-Zentrum für Archäologie (LEIZA)
broader: [spezifische Schadensphänomene an Metallen]
broader transitive: [materialspezifische Schadensphänomene]
broader transitive: [spezifische Schadensphänomene an Metallen]
broader transitive: [Untersuchungsergebnisse]
broader transitive: Zustandserfassung
broader transitive: Objektuntersuchung
broader transitive: Schadensphänomen
definition: Korrosionsangriff entlang der Korngrenzen eines Metalls oder einer Legierung.
in scheme: Konservierungs- und Restaurierungsfachthesaurus für archäologische Kulturgüter
pref label: interkristalline Korrosion
  type: Label
  rank: preferred

Patinabildung
type: Concept
notation: GC4CA7
created: 2026-01-30
issued: 2026-01-30
modified: 2026-02-04
publisher: Leibniz-Zentrum für Archäologie (LEIZA)
alternative label: Passivierung
broader: [spezifische Schadensphänomene an Metallen]
broader transitive: [Untersuchungsergebnisse]
broader transitive: Zustandserfassung
broader transitive: Objektuntersuchung
broader transitive: [materialspezifische Schadensphänomene]
broader transitive: Schadensphänomen
broader transitive: [spezifische Schadensphänomene an Metallen]
definition: Natürliche oder künstliche Entstehung einer oberflächlichen Schicht auf dem Objekt, die durch Oxidation, Witterungseinflüsse oder chemische Reaktionen des Objektwerkstoffes entsteht. Diese Schicht sorgt für einen Schutz des darunterliegenden Materials vor weiteren korrosovienen Einflüssen.
definition:
  literal form: Natürliche oder künstliche Entstehung einer oberflächlichen Schicht auf dem Objekt, die durch Oxidation, Witterungseinflüsse oder chemische Reaktionen des Objektwerkstoffes entsteht. Diese Schicht sorgt für einen Schutz des darunterliegenden Materials vor weiteren korrosovienen Einflüssen.
in scheme: Konservierungs- und Restaurierungsfachthesaurus für archäologische Kulturgüter
alt label: Passivierung
  type: Label
  rank: preferred
pref label: Patinabildung
  type: Label
  rank: preferred

[allgemeine Schadensphänomene]
type: Concept
type: NonIndexingConcept
type: GuideTerm
notation: FD4C48
created: 2026-01-30
issued: 2026-01-30
modified: 2026-02-04
publisher: Leibniz-Zentrum für Archäologie (LEIZA)
broader: Schadensphänomen
broader transitive: [Untersuchungsergebnisse]
broader transitive: Zustandserfassung
broader transitive: Objektuntersuchung
broader transitive: Schadensphänomen
definition: negative Veränderungen an Objekten, die unabhängig vom Material bzw. bei verschiedenen Materialen auftreten können.
in scheme: Konservierungs- und Restaurierungsfachthesaurus für archäologische Kulturgüter
pref label: [allgemeine Schadensphänomene]
  type: Label
  rank: preferred
narrower: Formänderung
narrower: Materialhinzufügung
narrower: Substanzverlust
narrower: chemische Veränderung
narrower: Kohäsionsverlust
narrower: visuelle Veränderung

weeping
type: Concept
notation: BG987D
preferred label: weeping glas @en
created: 2026-01-30
issued: 2026-01-30
modified: 2026-02-04
publisher: Leibniz-Zentrum für Archäologie (LEIZA)
alternative label: Tröpfchenbildung
alternative label: schwitzendes Glas
alternative label: weinendes Glas
broader: [spezifische Schadensphänomene an Glas]
broader transitive: [materialspezifische Schadensphänomene]
broader transitive: [Untersuchungsergebnisse]
broader transitive: Zustandserfassung
broader transitive: Objektuntersuchung
broader transitive: Schadensphänomen
broader transitive: [spezifische Schadensphänomene an Glas]
definition: Bildung von Feuchtigkeitströpfchen bzw. -filmen auf der Oberfläche von Glas unter Umgebungsbedingungen mit hoher Luftfeuchtigkeit.
in scheme: Konservierungs- und Restaurierungsfachthesaurus für archäologische Kulturgüter
alt label: schwitzendes Glas
  type: Label
  rank: preferred
alt label: Tröpfchenbildung
  type: Label
  rank: normal
alt label: weinendes Glas
  type: Label
  rank: normal
pref label: weeping
  type: Label
  rank: preferred
pref label: weeping glas
  type: Label
  rank: normal

roter Zerfall
type: Concept
notation: D4BG7C
created: 2026-01-30
issued: 2026-01-30
modified: 2026-02-04
publisher: Leibniz-Zentrum für Archäologie (LEIZA)
broader: [spezifische Schadensphänomene an Leder]
broader transitive: [materialspezifische Schadensphänomene]
broader transitive: [Untersuchungsergebnisse]
broader transitive: Zustandserfassung
broader transitive: Objektuntersuchung
broader transitive: Schadensphänomen
broader transitive: [spezifische Schadensphänomene an Leder]
definition: rötlich, pudernde Oberfläche, begleitet von Rissen, Delamination und einem Verlust an Festigkeit. Verursacht durch irreversible Abbauprozesse an pflanzlich gegerbtem Leder, bei welchem die faserige Struktur durch Polymerisation der pflanzlichen Gerbstoffe nach und nach zerfällt.
definition:
  literal form: rötlich, pudernde Oberfläche, begleitet von Rissen, Delamination und einem Verlust an Festigkeit. Verursacht durch irreversible Abbauprozesse an pflanzlich gegerbtem Leder, bei welchem die faserige Struktur durch Polymerisation der pflanzlichen Gerbstoffe nach und nach zerfällt.
in scheme: Konservierungs- und Restaurierungsfachthesaurus für archäologische Kulturgüter
pref label: roter Zerfall
  type: Label
  rank: preferred

Glaskorrosion
type: Concept
notation: DGC3A9
preferred label: sugaring @en
created: 2026-01-30
issued: 2026-01-30
modified: 2026-02-04
publisher: Leibniz-Zentrum für Archäologie (LEIZA)
alternative label: Glaskrankheit
alternative label: Glaspest
broader: [spezifische Schadensphänomene an Glas]
broader transitive: [materialspezifische Schadensphänomene]
broader transitive: [Untersuchungsergebnisse]
broader transitive: Zustandserfassung
broader transitive: Objektuntersuchung
broader transitive: Schadensphänomen
broader transitive: [spezifische Schadensphänomene an Glas]
definition: Fachbegriff für eine Reihe von Schäden, die typischerweise an archäologischen Gläsern beobachtet werden. Durch chemische Reaktionen mit ihrer Umgebung können die Gläser Trübungen, Farbveränderungen, Mattierung der Oberfläche oder auch eine erhöhte Fragilität aufweisen.
definition:
  literal form: Fachbegriff für eine Reihe von Schäden, die typischerweise an archäologischen Gläsern beobachtet werden. Durch chemische Reaktionen mit ihrer Umgebung können die Gläser Trübungen, Farbveränderungen, Mattierung der Oberfläche oder auch eine erhöhte Fragilität aufweisen.
in scheme: Konservierungs- und Restaurierungsfachthesaurus für archäologische Kulturgüter
alt label: Glaspest
  type: Label
  rank: preferred
alt label: Glaskrankheit
  type: Label
  rank: normal
pref label: Glaskorrosion
  type: Label
  rank: preferred
pref label: sugaring
  type: Label
  rank: normal

irisierende Farbveränderung
type: Concept
notation: F4D633
created: 2026-01-30
issued: 2026-01-30
modified: 2026-02-04
publisher: Leibniz-Zentrum für Archäologie (LEIZA)
alternative label: schillernd
broader: [spezifische Schadensphänomene an Glas]
broader transitive: [materialspezifische Schadensphänomene]
broader transitive: [Untersuchungsergebnisse]
broader transitive: Zustandserfassung
broader transitive: Objektuntersuchung
broader transitive: Schadensphänomen
broader transitive: [spezifische Schadensphänomene an Glas]
definition: Bildung von bunt schillernden Flecken auf archäologischen Gläsern verursacht durch Auslaugungsprozesse der alkalireichen Bestandteile.
in scheme: Konservierungs- und Restaurierungsfachthesaurus für archäologische Kulturgüter
alt label: schillernd
  type: Label
  rank: preferred
pref label: irisierende Farbveränderung
  type: Label
  rank: preferred

aufgeraut (Schadensphänomen)
type: Concept
notation: A21DB2
created: 2026-01-30
issued: 2026-01-30
modified: 2026-02-04
publisher: Leibniz-Zentrum für Archäologie (LEIZA)
alternative label: Aufrauhung
broader: Formänderung
broader transitive: Formänderung
broader transitive: [Untersuchungsergebnisse]
broader transitive: Zustandserfassung
broader transitive: Objektuntersuchung
broader transitive: Schadensphänomen
broader transitive: [allgemeine Schadensphänomene]
definition: Das Objekt weist eine zunehmend ungleichmäßiger werdende Oberfläche auf.
in scheme: Konservierungs- und Restaurierungsfachthesaurus für archäologische Kulturgüter
alt label: Aufrauhung
  type: Label
  rank: preferred
pref label: aufgeraut (Schadensphänomen)
  type: Label
  rank: preferred

Formänderung
type: Concept
notation: B224CD
created: 2026-01-30
issued: 2026-01-30
modified: 2026-02-04
publisher: Leibniz-Zentrum für Archäologie (LEIZA)
broader: [allgemeine Schadensphänomene]
broader transitive: [Untersuchungsergebnisse]
broader transitive: Zustandserfassung
broader transitive: Objektuntersuchung
broader transitive: Schadensphänomen
broader transitive: [allgemeine Schadensphänomene]
definition: Das Objekt zeigte eine mehr oder weniger stark ausgeprägte Veränderung seiner ursprünglichen oder als ursprünglich angesehenen Form, ohne Verlust des strukturellen Zusammenhalts.
in scheme: Konservierungs- und Restaurierungsfachthesaurus für archäologische Kulturgüter
pref label: Formänderung
  type: Label
  rank: preferred
narrower: aufgeraut (Schadensphänomen)
narrower: deformiert
narrower: ausgedehnt
narrower: geschrumpft
narrower: blasig

deformiert
type: Concept
notation: A8D9GF
created: 2026-01-30
issued: 2026-01-30
modified: 2026-02-04
publisher: Leibniz-Zentrum für Archäologie (LEIZA)
alternative label: Verformung
broader: Formänderung
broader transitive: Formänderung
broader transitive: [Untersuchungsergebnisse]
broader transitive: Zustandserfassung
broader transitive: Objektuntersuchung
broader transitive: Schadensphänomen
broader transitive: [allgemeine Schadensphänomene]
definition: Das Objekt zeigt eine oder mehrere bruchlose Veränderung(en) seiner ursprünglichen Form oder Abmessung.
in scheme: Konservierungs- und Restaurierungsfachthesaurus für archäologische Kulturgüter
alt label: Verformung
  type: Label
  rank: preferred
pref label: deformiert
  type: Label
  rank: preferred
narrower: geknickt
narrower: gewellt
narrower: ausgebeult
narrower: verbogen
narrower: verdreht
narrower: verworfen
narrower: eingedrückt (Schadensphänomen)

geknickt
type: Concept
notation: ABB9FA
created: 2026-01-30
issued: 2026-01-30
modified: 2026-02-04
publisher: Leibniz-Zentrum für Archäologie (LEIZA)
alternative label: gefaltet
broader: deformiert
broader transitive: [Untersuchungsergebnisse]
broader transitive: Zustandserfassung
broader transitive: Objektuntersuchung
broader transitive: Schadensphänomen
broader transitive: [allgemeine Schadensphänomene]
broader transitive: deformiert
broader transitive: Formänderung
definition: Das Objekt zeigt eine scharf umgebogene Deformation
in scheme: Konservierungs- und Restaurierungsfachthesaurus für archäologische Kulturgüter
alt label: gefaltet
  type: Label
  rank: preferred
pref label: geknickt
  type: Label
  rank: preferred

gewellt
type: Concept
notation: B89818
created: 2026-01-30
issued: 2026-01-30
modified: 2026-02-04
publisher: Leibniz-Zentrum für Archäologie (LEIZA)
alternative label: bucklig
alternative label: wellig
broader: deformiert
broader transitive: Formänderung
broader transitive: [Untersuchungsergebnisse]
broader transitive: Zustandserfassung
broader transitive: Objektuntersuchung
broader transitive: Schadensphänomen
broader transitive: [allgemeine Schadensphänomene]
broader transitive: deformiert
definition: Das Objekt zeigt eine wellenförmige/bucklige Formänderung auf.
in scheme: Konservierungs- und Restaurierungsfachthesaurus für archäologische Kulturgüter
alt label: bucklig
  type: Label
  rank: preferred
alt label: wellig
  type: Label
  rank: normal
pref label: gewellt
  type: Label
  rank: preferred

ausgebeult
type: Concept
notation: C4A59C
created: 2026-01-30
issued: 2026-01-30
modified: 2026-02-04
publisher: Leibniz-Zentrum für Archäologie (LEIZA)
alternative label: gewölbt
broader: deformiert
broader transitive: [Untersuchungsergebnisse]
broader transitive: Zustandserfassung
broader transitive: Objektuntersuchung
broader transitive: Schadensphänomen
broader transitive: [allgemeine Schadensphänomene]
broader transitive: deformiert
broader transitive: Formänderung
in scheme: Konservierungs- und Restaurierungsfachthesaurus für archäologische Kulturgüter
alt label: gewölbt
  type: Label
  rank: preferred
pref label: ausgebeult
  type: Label
  rank: preferred

verbogen
type: Concept
notation: C535G6
created: 2026-01-30
issued: 2026-01-30
modified: 2026-02-04
publisher: Leibniz-Zentrum für Archäologie (LEIZA)
broader: deformiert
broader transitive: [Untersuchungsergebnisse]
broader transitive: Zustandserfassung
broader transitive: Objektuntersuchung
broader transitive: Schadensphänomen
broader transitive: [allgemeine Schadensphänomene]
broader transitive: deformiert
broader transitive: Formänderung
definition: Das Objekt weist eine gekrümmte Deformation in einer Ebene auf
in scheme: Konservierungs- und Restaurierungsfachthesaurus für archäologische Kulturgüter
pref label: verbogen
  type: Label
  rank: preferred

verdreht
type: Concept
notation: CF4199
created: 2026-01-30
issued: 2026-01-30
modified: 2026-02-04
publisher: Leibniz-Zentrum für Archäologie (LEIZA)
broader: deformiert
broader transitive: [Untersuchungsergebnisse]
broader transitive: Zustandserfassung
broader transitive: Objektuntersuchung
broader transitive: Schadensphänomen
broader transitive: [allgemeine Schadensphänomene]
broader transitive: deformiert
broader transitive: Formänderung
definition: Das Objekt zeigt eine um eine Achse herumlaufende Deformation
in scheme: Konservierungs- und Restaurierungsfachthesaurus für archäologische Kulturgüter
pref label: verdreht
  type: Label
  rank: preferred

verworfen
type: Concept
notation: FC4DGB
created: 2026-01-30
issued: 2026-01-30
modified: 2026-02-04
publisher: Leibniz-Zentrum für Archäologie (LEIZA)
broader: deformiert
broader transitive: [Untersuchungsergebnisse]
broader transitive: Zustandserfassung
broader transitive: Objektuntersuchung
broader transitive: Schadensphänomen
broader transitive: [allgemeine Schadensphänomene]
broader transitive: deformiert
broader transitive: Formänderung
definition: Das Objekt weist eine in sich (gegeneinander) verschobene, unebene Fläche bzw. Form auf. Verwerfungen gehen häufig mit Brüchen einher.
in scheme: Konservierungs- und Restaurierungsfachthesaurus für archäologische Kulturgüter
pref label: verworfen
  type: Label
  rank: preferred

eingedrückt (Schadensphänomen)
type: Concept
notation: GAC37B
created: 2026-01-30
issued: 2026-01-30
modified: 2026-02-04
publisher: Leibniz-Zentrum für Archäologie (LEIZA)
alternative label: Abdruck
alternative label: eingedellt
broader: deformiert
broader transitive: Formänderung
broader transitive: [Untersuchungsergebnisse]
broader transitive: Zustandserfassung
broader transitive: Objektuntersuchung
broader transitive: Schadensphänomen
broader transitive: [allgemeine Schadensphänomene]
broader transitive: deformiert
definition: Die Deformation des Objektes weist eine nach innen gerichtete Form auf.
in scheme: Konservierungs- und Restaurierungsfachthesaurus für archäologische Kulturgüter
alt label: eingedellt
  type: Label
  rank: preferred
alt label: Abdruck
  type: Label
  rank: normal
pref label: eingedrückt (Schadensphänomen)
  type: Label
  rank: preferred

ausgedehnt
type: Concept
notation: C7859F
created: 2026-01-30
issued: 2026-01-30
modified: 2026-02-04
publisher: Leibniz-Zentrum für Archäologie (LEIZA)
alternative label: Quellung
broader: Formänderung
broader transitive: Formänderung
broader transitive: [Untersuchungsergebnisse]
broader transitive: Zustandserfassung
broader transitive: Objektuntersuchung
broader transitive: Schadensphänomen
broader transitive: [allgemeine Schadensphänomene]
definition: Das Objekt zeigt eine Vergrößerung seiner Abmessungen im Vergleich zu seinen ursprünglichen Maßen. Diese kann durch Veränderungen des Objektmaterial selbst oder durch Hinzufügen von Fremdmaterial erfolgt sein.
definition:
  literal form: Das Objekt zeigt eine Vergrößerung seiner Abmessungen im Vergleich zu seinen ursprünglichen Maßen. Diese kann durch Veränderungen des Objektmaterial selbst oder durch Hinzufügen von Fremdmaterial erfolgt sein.
in scheme: Konservierungs- und Restaurierungsfachthesaurus für archäologische Kulturgüter
alt label: Quellung
  type: Label
  rank: preferred
pref label: ausgedehnt
  type: Label
  rank: preferred

geschrumpft
type: Concept
notation: G23692
created: 2026-01-30
issued: 2026-01-30
modified: 2026-02-04
publisher: Leibniz-Zentrum für Archäologie (LEIZA)
alternative label: Schwindung
broader: Formänderung
broader transitive: Formänderung
broader transitive: [Untersuchungsergebnisse]
broader transitive: Zustandserfassung
broader transitive: Objektuntersuchung
broader transitive: Schadensphänomen
broader transitive: [allgemeine Schadensphänomene]
definition: Das Objekt zeigt eine Verkleinerung seiner Abmessungen im Vergleich zu seinen ursprünglichen Maßen.
in scheme: Konservierungs- und Restaurierungsfachthesaurus für archäologische Kulturgüter
alt label: Schwindung
  type: Label
  rank: preferred
pref label: geschrumpft
  type: Label
  rank: preferred

blasig
type: Concept
notation: G7D438
created: 2026-01-30
issued: 2026-01-30
modified: 2026-02-04
publisher: Leibniz-Zentrum für Archäologie (LEIZA)
alternative label: Blasenbildung
broader: Formänderung
broader transitive: Formänderung
broader transitive: [Untersuchungsergebnisse]
broader transitive: Zustandserfassung
broader transitive: Objektuntersuchung
broader transitive: Schadensphänomen
broader transitive: [allgemeine Schadensphänomene]
definition: Das Objekt weist eine gewölbte Oberfläche bzw. mehrere oberflächliche Wölbungen mit Hohlraum darunter auf. Der Hohlraum kann Gas, Flüssigkeit und/oder feste Stoffe enthalten.
in scheme: Konservierungs- und Restaurierungsfachthesaurus für archäologische Kulturgüter
alt label: Blasenbildung
  type: Label
  rank: preferred
pref label: blasig
  type: Label
  rank: preferred

Materialhinzufügung
type: Concept
notation: B86G16
created: 2026-01-30
issued: 2026-01-30
modified: 2026-02-04
publisher: Leibniz-Zentrum für Archäologie (LEIZA)
alternative label: Ablagerung
alternative label: Anlagerung
alternative label: Hinzufügung
broader: [allgemeine Schadensphänomene]
broader transitive: [Untersuchungsergebnisse]
broader transitive: Zustandserfassung
broader transitive: Objektuntersuchung
broader transitive: Schadensphänomen
broader transitive: [allgemeine Schadensphänomene]
definition: Hinzukommen von Material auf, an oder in ein Objekt als Ergebnis natürlicher Prozesse (z. B. Sediment, Staub) oder menschlicher Eingriffe (z. B. konservatorisch-restauratorische Maßnahmen). Der Begriff beschreibt das Vorhandensein zusätzlichen Materials, das nicht zum originalen Material des Objektes gehört.
definition:
  literal form: Hinzukommen von Material auf, an oder in ein Objekt als Ergebnis natürlicher Prozesse (z. B. Sediment, Staub) oder menschlicher Eingriffe (z. B. konservatorisch-restauratorische Maßnahmen). Der Begriff beschreibt das Vorhandensein zusätzlichen Materials, das nicht zum originalen Material des Objektes gehört.
in scheme: Konservierungs- und Restaurierungsfachthesaurus für archäologische Kulturgüter
alt label: Hinzufügung
  type: Label
  rank: preferred
alt label: Ablagerung
  type: Label
  rank: normal
alt label: Anlagerung
  type: Label
  rank: normal
pref label: Materialhinzufügung
  type: Label
  rank: preferred
narrower: staubbedeckt
narrower: salzausblühend
narrower: verkrustet
narrower: rußbedeckt
narrower: abgelagert
narrower: fettverschmiert
narrower: sedimentiert
narrower: biologisch bewachsen

Substanzverlust
type: Concept
notation: C188DA
preferred label: Loss of substance @en
created: 2026-01-30
issued: 2026-01-30
modified: 2026-02-04
publisher: Leibniz-Zentrum für Archäologie (LEIZA)
broader: [allgemeine Schadensphänomene]
broader transitive: [Untersuchungsergebnisse]
broader transitive: Zustandserfassung
broader transitive: Objektuntersuchung
broader transitive: Schadensphänomen
broader transitive: [allgemeine Schadensphänomene]
definition: Material bzw. Teile des Objektes fehlen teilweise oder vollständig infolge physikalischer, chemischer, biologischer oder mechanischer Prozesse.
in scheme: Konservierungs- und Restaurierungsfachthesaurus für archäologische Kulturgüter
pref label: Substanzverlust
  type: Label
  rank: preferred
pref label: Loss of substance
  type: Label
  rank: normal
narrower: durchwurzelt
narrower: Fehlstellen aufweisend
narrower: abgerieben
narrower: zerfressen
narrower: erodiert
narrower: zerkratzt

chemische Veränderung
type: Concept
notation: C9D991
created: 2026-01-30
issued: 2026-01-30
modified: 2026-02-04
publisher: Leibniz-Zentrum für Archäologie (LEIZA)
broader: [allgemeine Schadensphänomene]
broader transitive: [Untersuchungsergebnisse]
broader transitive: Zustandserfassung
broader transitive: Objektuntersuchung
broader transitive: Schadensphänomen
broader transitive: [allgemeine Schadensphänomene]
definition: Das Material des Objektes zeigt durch chemische Reaktionen mit seiner Umwelt verursachte Veränderungen seiner strukturellen Zusammensetzung oder Eigenschaften.
in scheme: Konservierungs- und Restaurierungsfachthesaurus für archäologische Kulturgüter
pref label: chemische Veränderung
  type: Label
  rank: preferred
narrower: verkohlt
narrower: versalzen
narrower: verätzt
narrower: mineralisiert
narrower: korrodiert

Kohäsionsverlust
type: Concept
notation: CB9GD3
created: 2026-01-30
issued: 2026-01-30
modified: 2026-02-04
publisher: Leibniz-Zentrum für Archäologie (LEIZA)
broader: [allgemeine Schadensphänomene]
broader transitive: [Untersuchungsergebnisse]
broader transitive: Zustandserfassung
broader transitive: Objektuntersuchung
broader transitive: Schadensphänomen
broader transitive: [allgemeine Schadensphänomene]
definition: Der innere Zusammenhalt des Objektes ist geschwächt bis vollständig zerstört, das Material ist mechanisch schwach, bricht leicht, zerfällt oder ist bröselig.
in scheme: Konservierungs- und Restaurierungsfachthesaurus für archäologische Kulturgüter
pref label: Kohäsionsverlust
  type: Label
  rank: preferred
narrower: pulvrig
narrower: hohl
narrower: zerschnitten
narrower: verhärtet
narrower: aufgeweicht
narrower: Pitting
narrower: kollabiert
narrower: abgeplatzt
narrower: zersetzt
narrower: versprödet
narrower: fragmentiert
narrower: abschollend
narrower: rissig
narrower: delaminiert
narrower: gebrochen
narrower: gesprungen
narrower: offene Fuge
narrower: gerissen

visuelle Veränderung
type: Concept
notation: D3AGG6
preferred label: visual alteration @en
created: 2026-01-30
issued: 2026-01-30
modified: 2026-02-04
publisher: Leibniz-Zentrum für Archäologie (LEIZA)
alternative label: optical alteration @en
alternative label: optische Veränderung
broader: [allgemeine Schadensphänomene]
broader transitive: [Untersuchungsergebnisse]
broader transitive: Zustandserfassung
broader transitive: Objektuntersuchung
broader transitive: Schadensphänomen
broader transitive: [allgemeine Schadensphänomene]
definition: Eine negative Veränderung des visuellen Erscheinungsbilds des Objektes
in scheme: Konservierungs- und Restaurierungsfachthesaurus für archäologische Kulturgüter
narrower: farbverändert
narrower: eingetrübt
narrower: fleckig
narrower: mattiert
alt label: optische Veränderung
  type: Label
  rank: preferred
alt label: optical alteration
  type: Label
  rank: normal
pref label: visuelle Veränderung
  type: Label
  rank: preferred
pref label: visual alteration
  type: Label
  rank: normal

farbverändert
type: Concept
notation: A4G8FA
created: 2026-01-30
issued: 2026-01-30
modified: 2026-02-04
publisher: Leibniz-Zentrum für Archäologie (LEIZA)
alternative label: Verfärbung
broader: visuelle Veränderung
broader transitive: visuelle Veränderung
broader transitive: [Untersuchungsergebnisse]
broader transitive: Zustandserfassung
broader transitive: Objektuntersuchung
broader transitive: Schadensphänomen
broader transitive: [allgemeine Schadensphänomene]
definition: Das Objekt zeigt in seiner Farbigkeit eine Änderung, die mindestend eine der drei Farbparameter Ton, Helligkeit oder Sättigung betrifft.
in scheme: Konservierungs- und Restaurierungsfachthesaurus für archäologische Kulturgüter
narrower: verblasst
narrower: verschwärzt
narrower: nachgedunkelt
narrower: vergilbt
alt label: Verfärbung
  type: Label
  rank: preferred
pref label: farbverändert
  type: Label
  rank: preferred

verblasst
type: Concept
notation: ABCF99
created: 2026-01-30
issued: 2026-01-30
modified: 2026-02-04
publisher: Leibniz-Zentrum für Archäologie (LEIZA)
alternative label: ausgeblichen
broader: farbverändert
broader transitive: farbverändert
broader transitive: [Untersuchungsergebnisse]
broader transitive: Zustandserfassung
broader transitive: Objektuntersuchung
broader transitive: visuelle Veränderung
broader transitive: Schadensphänomen
broader transitive: [allgemeine Schadensphänomene]
definition: Die Farbigkeit des Objektes zeigt eine reduzierte Farbsättigung
in scheme: Konservierungs- und Restaurierungsfachthesaurus für archäologische Kulturgüter
alt label: ausgeblichen
  type: Label
  rank: preferred
pref label: verblasst
  type: Label
  rank: preferred

verschwärzt
type: Concept
notation: DF2DFG
created: 2026-01-30
issued: 2026-01-30
modified: 2026-02-04
publisher: Leibniz-Zentrum für Archäologie (LEIZA)
broader: farbverändert
broader transitive: farbverändert
broader transitive: [Untersuchungsergebnisse]
broader transitive: Zustandserfassung
broader transitive: Objektuntersuchung
broader transitive: visuelle Veränderung
broader transitive: Schadensphänomen
broader transitive: [allgemeine Schadensphänomene]
in scheme: Konservierungs- und Restaurierungsfachthesaurus für archäologische Kulturgüter
pref label: verschwärzt
  type: Label
  rank: preferred

nachgedunkelt
type: Concept
notation: G8GAA6
created: 2026-01-30
issued: 2026-01-30
modified: 2026-02-04
publisher: Leibniz-Zentrum für Archäologie (LEIZA)
alternative label: verdunkelt
broader: farbverändert
broader transitive: farbverändert
broader transitive: [Untersuchungsergebnisse]
broader transitive: Zustandserfassung
broader transitive: Objektuntersuchung
broader transitive: visuelle Veränderung
broader transitive: Schadensphänomen
broader transitive: [allgemeine Schadensphänomene]
definition: Die Farbigkeit des Objektes zeigt eine Reduktion hinsichtlich des Lichtreflexionsvermögen, Tons und/oder Helligkeit
in scheme: Konservierungs- und Restaurierungsfachthesaurus für archäologische Kulturgüter
alt label: verdunkelt
  type: Label
  rank: preferred
pref label: nachgedunkelt
  type: Label
  rank: preferred

vergilbt
type: Concept
notation: GDCD91
created: 2026-01-30
issued: 2026-01-30
modified: 2026-02-04
publisher: Leibniz-Zentrum für Archäologie (LEIZA)
alternative label: verbräunt
broader: farbverändert
broader transitive: farbverändert
broader transitive: [Untersuchungsergebnisse]
broader transitive: Zustandserfassung
broader transitive: Objektuntersuchung
broader transitive: visuelle Veränderung
broader transitive: Schadensphänomen
broader transitive: [allgemeine Schadensphänomene]
definition: Die Farbigkeit des Objektes hat sich zu einem gelben, braunen bis goldbraunen Farbton verändert
in scheme: Konservierungs- und Restaurierungsfachthesaurus für archäologische Kulturgüter
alt label: verbräunt
  type: Label
  rank: preferred
pref label: vergilbt
  type: Label
  rank: preferred

eingetrübt
type: Concept
notation: D8CBG2
created: 2026-01-30
issued: 2026-01-30
modified: 2026-02-04
publisher: Leibniz-Zentrum für Archäologie (LEIZA)
alternative label: Trübung
broader: visuelle Veränderung
broader transitive: visuelle Veränderung
broader transitive: [Untersuchungsergebnisse]
broader transitive: Zustandserfassung
broader transitive: Objektuntersuchung
broader transitive: Schadensphänomen
broader transitive: [allgemeine Schadensphänomene]
definition: Das Objekt zeigt eine teilweise oder ganzheitliche Trübung der Oberfläche, bei der die Klarheit und Transparenz des ursprünglichen Aussehens verloren gegangen ist.
in scheme: Konservierungs- und Restaurierungsfachthesaurus für archäologische Kulturgüter
alt label: Trübung
  type: Label
  rank: preferred
pref label: eingetrübt
  type: Label
  rank: preferred

fleckig
type: Concept
notation: FDC65D
created: 2026-01-30
issued: 2026-01-30
modified: 2026-02-04
publisher: Leibniz-Zentrum für Archäologie (LEIZA)
alternative label: Fleckbildung
broader: visuelle Veränderung
broader transitive: visuelle Veränderung
broader transitive: [Untersuchungsergebnisse]
broader transitive: Zustandserfassung
broader transitive: Objektuntersuchung
broader transitive: Schadensphänomen
broader transitive: [allgemeine Schadensphänomene]
definition: Das Objekt zeigt partielle farbliche Veränderungen der Oberfläche
in scheme: Konservierungs- und Restaurierungsfachthesaurus für archäologische Kulturgüter
alt label: Fleckbildung
  type: Label
  rank: preferred
pref label: fleckig
  type: Label
  rank: preferred

mattiert
type: Concept
notation: GA2C4A
created: 2026-01-30
issued: 2026-01-30
modified: 2026-02-04
publisher: Leibniz-Zentrum für Archäologie (LEIZA)
alternative label: Glanzverlust
broader: visuelle Veränderung
broader transitive: visuelle Veränderung
broader transitive: [Untersuchungsergebnisse]
broader transitive: Zustandserfassung
broader transitive: Objektuntersuchung
broader transitive: Schadensphänomen
broader transitive: [allgemeine Schadensphänomene]
definition: Die vormals glänzende Oberfläche eines Objektes geht zunehmend in ein mattes Erscheinungsbild über.
in scheme: Konservierungs- und Restaurierungsfachthesaurus für archäologische Kulturgüter
alt label: Glanzverlust
  type: Label
  rank: preferred
pref label: mattiert
  type: Label
  rank: preferred

kontaminiert
type: Concept
notation: B221BB
created: 2026-01-30
issued: 2026-01-30
modified: 2026-02-04
publisher: Leibniz-Zentrum für Archäologie (LEIZA)
broader: staubbedeckt
broader transitive: [Untersuchungsergebnisse]
broader transitive: Zustandserfassung
broader transitive: Objektuntersuchung
broader transitive: Schadensphänomen
broader transitive: [allgemeine Schadensphänomene]
broader transitive: staubbedeckt
broader transitive: Materialhinzufügung
definition: Das Objekt ist mit Gefahr-/Schadstoffen belastet.
in scheme: Konservierungs- und Restaurierungsfachthesaurus für archäologische Kulturgüter
pref label: kontaminiert
  type: Label
  rank: preferred

staubbedeckt
type: Concept
notation: BBF64G
created: 2026-01-30
issued: 2026-01-30
modified: 2026-02-04
publisher: Leibniz-Zentrum für Archäologie (LEIZA)
alternative label: Staubbedeckung
alternative label: Staubschicht
broader: Materialhinzufügung
broader transitive: [Untersuchungsergebnisse]
broader transitive: Zustandserfassung
broader transitive: Objektuntersuchung
broader transitive: Schadensphänomen
broader transitive: [allgemeine Schadensphänomene]
broader transitive: Materialhinzufügung
definition: Ablagerung von Staubpartikeln auf der Objektoberfläche
in scheme: Konservierungs- und Restaurierungsfachthesaurus für archäologische Kulturgüter
alt label: Staubbedeckung
  type: Label
  rank: preferred
alt label: Staubschicht
  type: Label
  rank: normal
pref label: staubbedeckt
  type: Label
  rank: preferred
narrower: kontaminiert

salzausblühend
type: Concept
notation: BA75DG
created: 2026-01-30
issued: 2026-01-30
modified: 2026-02-04
publisher: Leibniz-Zentrum für Archäologie (LEIZA)
alternative label: Effloreszenz
alternative label: Kristallbildung
alternative label: Salzausblühungen
alternative label: salzbelastet
broader: Materialhinzufügung
broader transitive: [Untersuchungsergebnisse]
broader transitive: Zustandserfassung
broader transitive: Objektuntersuchung
broader transitive: Schadensphänomen
broader transitive: [allgemeine Schadensphänomene]
broader transitive: Materialhinzufügung
definition: Kristalline Ausfällungen von Salzen auf oder im Objekt
in scheme: Konservierungs- und Restaurierungsfachthesaurus für archäologische Kulturgüter
alt label: Salzausblühungen
  type: Label
  rank: preferred
alt label: salzbelastet
  type: Label
  rank: normal
alt label: Effloreszenz
  type: Label
  rank: normal
alt label: Kristallbildung
  type: Label
  rank: normal
pref label: salzausblühend
  type: Label
  rank: preferred

verkrustet
type: Concept
notation: C3C616
created: 2026-01-30
issued: 2026-01-30
modified: 2026-02-04
publisher: Leibniz-Zentrum für Archäologie (LEIZA)
alternative label: Verkrustung
alternative label: überkrustet
broader: Materialhinzufügung
broader transitive: [Untersuchungsergebnisse]
broader transitive: Zustandserfassung
broader transitive: Objektuntersuchung
broader transitive: Schadensphänomen
broader transitive: [allgemeine Schadensphänomene]
broader transitive: Materialhinzufügung
definition: Auf dem Objekt befinden sich fest haftende, harte Ablagerungen aus mineralischen und/oder organischen Bestandteilen. Auf archäologischen (Metall-)Objekten oft in Form von Konglomeraten aus Sediment und Korrosionsprodukten zu finden.
definition:
  literal form: Auf dem Objekt befinden sich fest haftende, harte Ablagerungen aus mineralischen und/oder organischen Bestandteilen. Auf archäologischen (Metall-)Objekten oft in Form von Konglomeraten aus Sediment und Korrosionsprodukten zu finden.
in scheme: Konservierungs- und Restaurierungsfachthesaurus für archäologische Kulturgüter
alt label: überkrustet
  type: Label
  rank: preferred
alt label: Verkrustung
  type: Label
  rank: normal
pref label: verkrustet
  type: Label
  rank: preferred

rußbedeckt
type: Concept
notation: D48G16
created: 2026-01-30
issued: 2026-01-30
modified: 2026-02-04
publisher: Leibniz-Zentrum für Archäologie (LEIZA)
alternative label: Ruß geschwärzt
alternative label: Rußablagerung
alternative label: verrußt
broader: Materialhinzufügung
broader transitive: [Untersuchungsergebnisse]
broader transitive: Zustandserfassung
broader transitive: Objektuntersuchung
broader transitive: Schadensphänomen
broader transitive: [allgemeine Schadensphänomene]
broader transitive: Materialhinzufügung
definition: Auf der Objektoberfläche zeigen sich schwarze Ablagerungen von Rußpartikeln.
in scheme: Konservierungs- und Restaurierungsfachthesaurus für archäologische Kulturgüter
alt label: Rußablagerung
  type: Label
  rank: preferred
alt label: verrußt
  type: Label
  rank: normal
alt label: Ruß geschwärzt
  type: Label
  rank: normal
pref label: rußbedeckt
  type: Label
  rank: preferred

abgelagert
type: Concept
notation: F473B6
created: 2026-01-30
issued: 2026-01-30
modified: 2026-02-04
publisher: Leibniz-Zentrum für Archäologie (LEIZA)
alternative label: Ablagerung
alternative label: Anlagerung
broader: Materialhinzufügung
broader transitive: [Untersuchungsergebnisse]
broader transitive: Zustandserfassung
broader transitive: Objektuntersuchung
broader transitive: Schadensphänomen
broader transitive: [allgemeine Schadensphänomene]
broader transitive: Materialhinzufügung
definition: generische Angaben zu jeglicher Form von fremdartiger Ablagerung von Material auf der Oberfläche des Objektes.
in scheme: Konservierungs- und Restaurierungsfachthesaurus für archäologische Kulturgüter
alt label: Ablagerung
  type: Label
  rank: preferred
alt label: Anlagerung
  type: Label
  rank: normal
pref label: abgelagert
  type: Label
  rank: preferred

fettverschmiert
type: Concept
notation: F9F255
created: 2026-01-30
issued: 2026-01-30
modified: 2026-02-04
publisher: Leibniz-Zentrum für Archäologie (LEIZA)
alternative label: fettig
broader: Materialhinzufügung
broader transitive: [Untersuchungsergebnisse]
broader transitive: Zustandserfassung
broader transitive: Objektuntersuchung
broader transitive: Schadensphänomen
broader transitive: [allgemeine Schadensphänomene]
broader transitive: Materialhinzufügung
definition: Die Oberfläche des Objekt zeigt einen klebrige Ablagerung von Fettpartikeln.
in scheme: Konservierungs- und Restaurierungsfachthesaurus für archäologische Kulturgüter
alt label: fettig
  type: Label
  rank: preferred
pref label: fettverschmiert
  type: Label
  rank: preferred

sedimentiert
type: Concept
notation: FC7715
created: 2026-01-30
issued: 2026-01-30
modified: 2026-02-04
publisher: Leibniz-Zentrum für Archäologie (LEIZA)
alternative label: Erdanhaftungen
alternative label: Sedimentanhaftungen
broader: Materialhinzufügung
broader transitive: [Untersuchungsergebnisse]
broader transitive: Zustandserfassung
broader transitive: Objektuntersuchung
broader transitive: Schadensphänomen
broader transitive: [allgemeine Schadensphänomene]
broader transitive: Materialhinzufügung
definition: Das Objekt ist mit lockeren oder leicht verfestigten mineralischen Materialanhaftungen bedeckt. Meist aus feinkörnigen Bodenbestandteilen wie Sand, Schluff, Ton oder Schlamm, die sich durch die Bodenlagerung auf dem Objekt abgesetzt haben.
definition:
  literal form: Das Objekt ist mit lockeren oder leicht verfestigten mineralischen Materialanhaftungen bedeckt. Meist aus feinkörnigen Bodenbestandteilen wie Sand, Schluff, Ton oder Schlamm, die sich durch die Bodenlagerung auf dem Objekt abgesetzt haben.
in scheme: Konservierungs- und Restaurierungsfachthesaurus für archäologische Kulturgüter
alt label: Erdanhaftungen
  type: Label
  rank: preferred
alt label: Sedimentanhaftungen
  type: Label
  rank: normal
pref label: sedimentiert
  type: Label
  rank: preferred

biologisch bewachsen
type: Concept
notation: G57G31
created: 2026-01-30
issued: 2026-01-30
modified: 2026-02-04
publisher: Leibniz-Zentrum für Archäologie (LEIZA)
alternative label: biologischer Bewuchs
alternative label: mikrobiell bewachsen
broader: Materialhinzufügung
broader transitive: [Untersuchungsergebnisse]
broader transitive: Zustandserfassung
broader transitive: Objektuntersuchung
broader transitive: Schadensphänomen
broader transitive: [allgemeine Schadensphänomene]
broader transitive: Materialhinzufügung
definition: biologische Besiedlung des Objektes durch Mikro- oder Makroorganismen.
in scheme: Konservierungs- und Restaurierungsfachthesaurus für archäologische Kulturgüter
alt label: mikrobiell bewachsen
  type: Label
  rank: preferred
alt label: biologischer Bewuchs
  type: Label
  rank: normal
pref label: biologisch bewachsen
  type: Label
  rank: preferred
narrower: schimmelbedeckt

schimmelbedeckt
type: Concept
notation: GD4F94
created: 2026-01-30
issued: 2026-01-30
modified: 2026-02-04
publisher: Leibniz-Zentrum für Archäologie (LEIZA)
alternative label: Schimmelbefall
alternative label: Schimmelpilzbefall
alternative label: schimmlig
broader: biologisch bewachsen
broader transitive: [Untersuchungsergebnisse]
broader transitive: Zustandserfassung
broader transitive: Objektuntersuchung
broader transitive: Schadensphänomen
broader transitive: [allgemeine Schadensphänomene]
broader transitive: Materialhinzufügung
broader transitive: biologisch bewachsen
definition: Auf der Oberfläche des Objektes sind visuell sichtbare Ausbreitungen von Schimmelpilz vorhanden.
in scheme: Konservierungs- und Restaurierungsfachthesaurus für archäologische Kulturgüter
alt label: Schimmelbefall
  type: Label
  rank: preferred
alt label: schimmlig
  type: Label
  rank: normal
alt label: Schimmelpilzbefall
  type: Label
  rank: normal
pref label: schimmelbedeckt
  type: Label
  rank: preferred

durchwurzelt
type: Concept
notation: A77283
created: 2026-01-30
issued: 2026-01-30
modified: 2026-02-04
publisher: Leibniz-Zentrum für Archäologie (LEIZA)
broader: Substanzverlust
broader transitive: Substanzverlust
broader transitive: [Untersuchungsergebnisse]
broader transitive: Zustandserfassung
broader transitive: Objektuntersuchung
broader transitive: Schadensphänomen
broader transitive: [allgemeine Schadensphänomene]
definition: Materialverlust durch Eindringen/Einwachsen von pflanzlichen Wurzeln in das Objekt
in scheme: Konservierungs- und Restaurierungsfachthesaurus für archäologische Kulturgüter
pref label: durchwurzelt
  type: Label
  rank: preferred

Fehlstellen aufweisend
type: Concept
notation: A8588A
created: 2026-01-30
issued: 2026-01-30
modified: 2026-02-04
publisher: Leibniz-Zentrum für Archäologie (LEIZA)
alternative label: abgebrochen
alternative label: löchrig
broader: Substanzverlust
broader transitive: Substanzverlust
broader transitive: [Untersuchungsergebnisse]
broader transitive: Zustandserfassung
broader transitive: Objektuntersuchung
broader transitive: Schadensphänomen
broader transitive: [allgemeine Schadensphänomene]
definition: Das Objekt ist unvollständig und besitzt eine oder mehrere Fehlstellen
in scheme: Konservierungs- und Restaurierungsfachthesaurus für archäologische Kulturgüter
alt label: löchrig
  type: Label
  rank: preferred
alt label: abgebrochen
  type: Label
  rank: normal
pref label: Fehlstellen aufweisend
  type: Label
  rank: preferred

abgerieben
type: Concept
notation: C36GDB
created: 2026-01-30
issued: 2026-01-30
modified: 2026-02-04
publisher: Leibniz-Zentrum für Archäologie (LEIZA)
alternative label: Abrieb
broader: Substanzverlust
broader transitive: Substanzverlust
broader transitive: [Untersuchungsergebnisse]
broader transitive: Zustandserfassung
broader transitive: Objektuntersuchung
broader transitive: Schadensphänomen
broader transitive: [allgemeine Schadensphänomene]
definition: An der Objektoberfläche sind durch Reibungskräfte abgetragene Stellen festzustellen.
in scheme: Konservierungs- und Restaurierungsfachthesaurus für archäologische Kulturgüter
alt label: Abrieb
  type: Label
  rank: preferred
pref label: abgerieben
  type: Label
  rank: preferred

zerfressen
type: Concept
notation: C5GCB6
created: 2026-01-30
issued: 2026-01-30
modified: 2026-02-04
publisher: Leibniz-Zentrum für Archäologie (LEIZA)
broader: Substanzverlust
broader transitive: Substanzverlust
broader transitive: [Untersuchungsergebnisse]
broader transitive: Zustandserfassung
broader transitive: Objektuntersuchung
broader transitive: Schadensphänomen
broader transitive: [allgemeine Schadensphänomene]
definition: Materialverlust an/in einem Objekt verursacht durch Fressaktivitäten von Organismen.
in scheme: Konservierungs- und Restaurierungsfachthesaurus für archäologische Kulturgüter
pref label: zerfressen
  type: Label
  rank: preferred
alternative label: Fressspuren
alt label: Fressspuren
  type: Label
  rank: preferred

erodiert
type: Concept
notation: D45638
created: 2026-01-30
issued: 2026-01-30
modified: 2026-02-04
publisher: Leibniz-Zentrum für Archäologie (LEIZA)
alternative label: Erosion
broader: Substanzverlust
broader transitive: Substanzverlust
broader transitive: [Untersuchungsergebnisse]
broader transitive: Zustandserfassung
broader transitive: Objektuntersuchung
broader transitive: Schadensphänomen
broader transitive: [allgemeine Schadensphänomene]
definition: Durch die Einwirkung externer Faktoren schleichender Verlust von Oberflächenmaterial des Objektes.
in scheme: Konservierungs- und Restaurierungsfachthesaurus für archäologische Kulturgüter
alt label: Erosion
  type: Label
  rank: preferred
pref label: erodiert
  type: Label
  rank: preferred

zerkratzt
type: Concept
notation: D99GD4
created: 2026-01-30
issued: 2026-01-30
modified: 2026-02-04
publisher: Leibniz-Zentrum für Archäologie (LEIZA)
alternative label: Kratzer (Schadensphänomen)
alternative label: verkratzt
broader: Substanzverlust
broader transitive: Substanzverlust
broader transitive: [Untersuchungsergebnisse]
broader transitive: Zustandserfassung
broader transitive: Objektuntersuchung
broader transitive: Schadensphänomen
broader transitive: [allgemeine Schadensphänomene]
definition: Durch die mechanische Einwirkung scharfer Kanten ist ein Materialverlust an der Objektoberfläche festzustellen.
in scheme: Konservierungs- und Restaurierungsfachthesaurus für archäologische Kulturgüter
alt label: verkratzt
  type: Label
  rank: preferred
alt label: Kratzer (Schadensphänomen)
  type: Label
  rank: normal
pref label: zerkratzt
  type: Label
  rank: preferred

pulvrig
type: Concept
notation: A8C236
created: 2026-01-30
issued: 2026-01-30
modified: 2026-02-04
publisher: Leibniz-Zentrum für Archäologie (LEIZA)
alternative label: pudernde Oberfläche
alternative label: pulverisierte Oberfläche
broader: Kohäsionsverlust
broader transitive: Kohäsionsverlust
broader transitive: [Untersuchungsergebnisse]
broader transitive: Zustandserfassung
broader transitive: Objektuntersuchung
broader transitive: Schadensphänomen
broader transitive: [allgemeine Schadensphänomene]
definition: Das Material liegt ganz oder teilweise in feiner, staubartiger Form vor oder zerfällt bei mechanischer Belastung in diese. Der innere Zusammenhalt ist nahezu vollständig verloren.
in scheme: Konservierungs- und Restaurierungsfachthesaurus für archäologische Kulturgüter
alt label: pudernde Oberfläche
  type: Label
  rank: preferred
alt label: pulverisierte Oberfläche
  type: Label
  rank: normal
pref label: pulvrig
  type: Label
  rank: preferred

hohl
type: Concept
notation: AF7CC8
created: 2026-01-30
issued: 2026-01-30
modified: 2026-02-04
publisher: Leibniz-Zentrum für Archäologie (LEIZA)
alternative label: Hohllage
alternative label: Hohlstelle
broader: Kohäsionsverlust
broader transitive: Kohäsionsverlust
broader transitive: [Untersuchungsergebnisse]
broader transitive: Zustandserfassung
broader transitive: Objektuntersuchung
broader transitive: Schadensphänomen
broader transitive: [allgemeine Schadensphänomene]
definition: Im Materialgefüge des Objektes hat sich ein oder mehrere Leerraum/Leerräume gebildet.
in scheme: Konservierungs- und Restaurierungsfachthesaurus für archäologische Kulturgüter
alt label: Hohlstelle
  type: Label
  rank: preferred
alt label: Hohllage
  type: Label
  rank: normal
pref label: hohl
  type: Label
  rank: preferred

zerschnitten
type: Concept
notation: B4C3B9
created: 2026-01-30
issued: 2026-01-30
modified: 2026-02-04
publisher: Leibniz-Zentrum für Archäologie (LEIZA)
broader: Kohäsionsverlust
broader transitive: [Untersuchungsergebnisse]
broader transitive: Zustandserfassung
broader transitive: Objektuntersuchung
broader transitive: Schadensphänomen
broader transitive: [allgemeine Schadensphänomene]
broader transitive: Kohäsionsverlust
definition: Das Materialgefüge des Objektes ist unter Erzeugung einer scharf definierten Kante in zwei oder mehr Teile getrennt worden.
in scheme: Konservierungs- und Restaurierungsfachthesaurus für archäologische Kulturgüter
pref label: zerschnitten
  type: Label
  rank: preferred
alternative label: Schnitt
alternative label: verschnitten
alt label: Schnitt
  type: Label
  rank: preferred
alt label: verschnitten
  type: Label
  rank: normal

verhärtet
type: Concept
notation: BC1DCG
created: 2026-01-30
issued: 2026-01-30
modified: 2026-02-04
publisher: Leibniz-Zentrum für Archäologie (LEIZA)
broader: Kohäsionsverlust
broader transitive: [Untersuchungsergebnisse]
broader transitive: Zustandserfassung
broader transitive: Objektuntersuchung
broader transitive: Schadensphänomen
broader transitive: [allgemeine Schadensphänomene]
broader transitive: Kohäsionsverlust
definition: Das Material des Objektes zeigt eine deutliche Steigerung der inneren Verfestigung, bis hin zur völligen Versteifung/Starrheit.
in scheme: Konservierungs- und Restaurierungsfachthesaurus für archäologische Kulturgüter
pref label: verhärtet
  type: Label
  rank: preferred
alternative label: Verhärtung
alt label: Verhärtung
  type: Label
  rank: preferred

aufgeweicht
type: Concept
notation: BFCC33
created: 2026-01-30
issued: 2026-01-30
modified: 2026-02-04
publisher: Leibniz-Zentrum für Archäologie (LEIZA)
alternative label: Erweicht
alternative label: Weich geworden
broader: Kohäsionsverlust
broader transitive: Kohäsionsverlust
broader transitive: [Untersuchungsergebnisse]
broader transitive: Zustandserfassung
broader transitive: Objektuntersuchung
broader transitive: Schadensphänomen
broader transitive: [allgemeine Schadensphänomene]
definition: Das Material des Objektes hat durch Wasseraufnahme seine Festigkeit und Formstabilität verloren.
in scheme: Konservierungs- und Restaurierungsfachthesaurus für archäologische Kulturgüter
alt label: Weich geworden
  type: Label
  rank: preferred
alt label: Erweicht
  type: Label
  rank: normal
pref label: aufgeweicht
  type: Label
  rank: preferred

Pitting
type: Concept
notation: BFGD3B
created: 2026-01-30
issued: 2026-01-30
modified: 2026-02-04
publisher: Leibniz-Zentrum für Archäologie (LEIZA)
alternative label: Grübchenbildung
broader: Kohäsionsverlust
broader transitive: Kohäsionsverlust
broader transitive: [Untersuchungsergebnisse]
broader transitive: Zustandserfassung
broader transitive: Objektuntersuchung
broader transitive: Schadensphänomen
broader transitive: [allgemeine Schadensphänomene]
definition: Die Objektoberfläche weist dicht nebeneinander liegende, flache Hohlräume/Grübchen auf.
in scheme: Konservierungs- und Restaurierungsfachthesaurus für archäologische Kulturgüter
alt label: Grübchenbildung
  type: Label
  rank: preferred
pref label: Pitting
  type: Label
  rank: preferred

kollabiert
type: Concept
notation: BGA41C
created: 2026-01-30
issued: 2026-01-30
modified: 2026-02-04
publisher: Leibniz-Zentrum für Archäologie (LEIZA)
broader: Kohäsionsverlust
broader transitive: [Untersuchungsergebnisse]
broader transitive: Zustandserfassung
broader transitive: Objektuntersuchung
broader transitive: Schadensphänomen
broader transitive: [allgemeine Schadensphänomene]
broader transitive: Kohäsionsverlust
definition: Das innere Materialgefüges eines Objektes ist vollkommen destabilisiert, was zu einem kompletten Zerfall der Struktur geführt hat.
in scheme: Konservierungs- und Restaurierungsfachthesaurus für archäologische Kulturgüter
pref label: kollabiert
  type: Label
  rank: preferred
alternative label: Kollaps
alternative label: Zusammenbruch
alt label: Kollaps
  type: Label
  rank: preferred
alt label: Zusammenbruch
  type: Label
  rank: normal

abgeplatzt
type: Concept
notation: D2364A
created: 2026-01-30
issued: 2026-01-30
modified: 2026-02-04
publisher: Leibniz-Zentrum für Archäologie (LEIZA)
alternative label: Abplatzung
broader: Kohäsionsverlust
broader transitive: Kohäsionsverlust
broader transitive: [Untersuchungsergebnisse]
broader transitive: Zustandserfassung
broader transitive: Objektuntersuchung
broader transitive: Schadensphänomen
broader transitive: [allgemeine Schadensphänomene]
definition: Ganz Schollen oder Stücke haben sich vollständig von der Objektoberfläche gelöst und sind entweder komplett verloren oder liegen getrennt von dem Objekt.
in scheme: Konservierungs- und Restaurierungsfachthesaurus für archäologische Kulturgüter
alt label: Abplatzung
  type: Label
  rank: preferred
pref label: abgeplatzt
  type: Label
  rank: preferred

zersetzt
type: Concept
notation: D9C8A4
preferred label: degradation @en
created: 2026-01-30
issued: 2026-01-30
modified: 2026-02-04
publisher: Leibniz-Zentrum für Archäologie (LEIZA)
broader: Kohäsionsverlust
broader transitive: [Untersuchungsergebnisse]
broader transitive: Zustandserfassung
broader transitive: Objektuntersuchung
broader transitive: Schadensphänomen
broader transitive: [allgemeine Schadensphänomene]
broader transitive: Kohäsionsverlust
definition: Das Objekt bzw. sein Material ist durch fortschreitende physikalische, chemische oder biologische Prozesse in seiner inneren Struktur stark geschädigt. Der innere Zusammenhalt ist weitgehend verloren und kann bei mechanischer Belastung zum vollständigen Materialverlust führen. Der Begriff bildet
definition:
  literal form: Das Objekt bzw. sein Material ist durch fortschreitende physikalische, chemische oder biologische Prozesse in seiner inneren Struktur stark geschädigt. Der innere Zusammenhalt ist weitgehend verloren und kann bei mechanischer Belastung zum vollständigen Materialverlust führen. Der Begriff bildet
in scheme: Konservierungs- und Restaurierungsfachthesaurus für archäologische Kulturgüter
pref label: zersetzt
  type: Label
  rank: preferred
pref label: degradation
  type: Label
  rank: normal
alternative label: Zersetzung
alt label: Zersetzung
  type: Label
  rank: preferred

versprödet
type: Concept
notation: DDFG97
created: 2026-01-30
issued: 2026-01-30
modified: 2026-02-04
publisher: Leibniz-Zentrum für Archäologie (LEIZA)
alternative label: Versprödung
broader: Kohäsionsverlust
broader transitive: Kohäsionsverlust
broader transitive: [Untersuchungsergebnisse]
broader transitive: Zustandserfassung
broader transitive: Objektuntersuchung
broader transitive: Schadensphänomen
broader transitive: [allgemeine Schadensphänomene]
definition: Das Material hat seine Elastizität, Flexibilität und Bruchfestigkeit verloren. Es ist zunächst als feste Struktur erhalten geblieben, bricht oder reiß jedoch leicht bei mechanischer Belastung.
in scheme: Konservierungs- und Restaurierungsfachthesaurus für archäologische Kulturgüter
alt label: Versprödung
  type: Label
  rank: preferred
pref label: versprödet
  type: Label
  rank: preferred

fragmentiert
type: Concept
notation: F6CG68
created: 2026-01-30
issued: 2026-01-30
modified: 2026-02-04
publisher: Leibniz-Zentrum für Archäologie (LEIZA)
broader: Kohäsionsverlust
broader transitive: [Untersuchungsergebnisse]
broader transitive: Zustandserfassung
broader transitive: Objektuntersuchung
broader transitive: Schadensphänomen
broader transitive: [allgemeine Schadensphänomene]
broader transitive: Kohäsionsverlust
definition: Das Objekt ist in ein oder mehrere Teile auseinandergefallen. Je nach Feinheitsgrad der entstandenen Fragmente, kann der Begriff weiter spezifiziert werden.
in scheme: Konservierungs- und Restaurierungsfachthesaurus für archäologische Kulturgüter
pref label: fragmentiert
  type: Label
  rank: preferred
alternative label: Fragmentierung
alt label: Fragmentierung
  type: Label
  rank: preferred

abschollend
type: Concept
notation: F97BFF
created: 2026-01-30
issued: 2026-01-30
modified: 2026-02-04
publisher: Leibniz-Zentrum für Archäologie (LEIZA)
alternative label: Schollenbildung
alternative label: abblätternd
broader: Kohäsionsverlust
broader transitive: Kohäsionsverlust
broader transitive: [Untersuchungsergebnisse]
broader transitive: Zustandserfassung
broader transitive: Objektuntersuchung
broader transitive: Schadensphänomen
broader transitive: [allgemeine Schadensphänomene]
definition: Auf der Objektoberfläche sind ein oder mehrere dünne Materialschichten zu sehen, die sich teilweise von dieser abgelöst haben und abstehen.
in scheme: Konservierungs- und Restaurierungsfachthesaurus für archäologische Kulturgüter
alt label: Schollenbildung
  type: Label
  rank: preferred
alt label: abblätternd
  type: Label
  rank: normal
pref label: abschollend
  type: Label
  rank: preferred

rissig
type: Concept
notation: FA14C2
created: 2026-01-30
issued: 2026-01-30
modified: 2026-02-04
publisher: Leibniz-Zentrum für Archäologie (LEIZA)
broader: Kohäsionsverlust
broader transitive: Kohäsionsverlust
broader transitive: [Untersuchungsergebnisse]
broader transitive: Zustandserfassung
broader transitive: Objektuntersuchung
broader transitive: Schadensphänomen
broader transitive: [allgemeine Schadensphänomene]
definition: Das Materialgefüge des Objektes zeigt Risse, die jedoch nicht zu einer vollständigen Abtrennung geführt haben.
in scheme: Konservierungs- und Restaurierungsfachthesaurus für archäologische Kulturgüter
pref label: rissig
  type: Label
  rank: preferred
narrower: Tiefenriss
narrower: Craquellée
narrower: Haarriss
narrower: Oberflächenriss

delaminiert
type: Concept
notation: FA9B73
created: 2026-01-30
issued: 2026-01-30
modified: 2026-02-04
publisher: Leibniz-Zentrum für Archäologie (LEIZA)
alternative label: Schichtentrennung
alternative label: Spaltung
broader: Kohäsionsverlust
broader transitive: Kohäsionsverlust
broader transitive: [Untersuchungsergebnisse]
broader transitive: Zustandserfassung
broader transitive: Objektuntersuchung
broader transitive: Schadensphänomen
broader transitive: [allgemeine Schadensphänomene]
definition: Das Materialgefüge des Objektes weist eine Ablösung in mehr oder weniger klar definierten Schichten auf.
in scheme: Konservierungs- und Restaurierungsfachthesaurus für archäologische Kulturgüter
alt label: Schichtentrennung
  type: Label
  rank: preferred
alt label: Spaltung
  type: Label
  rank: normal
pref label: delaminiert
  type: Label
  rank: preferred

gebrochen
type: Concept
notation: FGG2C4
created: 2026-01-30
issued: 2026-01-30
modified: 2026-02-04
publisher: Leibniz-Zentrum für Archäologie (LEIZA)
broader: Kohäsionsverlust
broader transitive: [Untersuchungsergebnisse]
broader transitive: Zustandserfassung
broader transitive: Objektuntersuchung
broader transitive: Schadensphänomen
broader transitive: [allgemeine Schadensphänomene]
broader transitive: Kohäsionsverlust
definition: Das vormals fest gefügte Material des Objektes weist eine vollkommene Trennung in zwei oder mehr lose Teile auf.
in scheme: Konservierungs- und Restaurierungsfachthesaurus für archäologische Kulturgüter
pref label: gebrochen
  type: Label
  rank: preferred
alternative label: Bruch
alt label: Bruch
  type: Label
  rank: preferred

gesprungen
type: Concept
notation: G74A2D
created: 2026-01-30
issued: 2026-01-30
modified: 2026-02-04
publisher: Leibniz-Zentrum für Archäologie (LEIZA)
broader: Kohäsionsverlust
broader transitive: [Untersuchungsergebnisse]
broader transitive: Zustandserfassung
broader transitive: Objektuntersuchung
broader transitive: Schadensphänomen
broader transitive: [allgemeine Schadensphänomene]
broader transitive: Kohäsionsverlust
definition: Das vormals fest gefügte Material weist eine Teilung ohne vollständiges Auseinanderbrechen des Objektes auf.
in scheme: Konservierungs- und Restaurierungsfachthesaurus für archäologische Kulturgüter
pref label: gesprungen
  type: Label
  rank: preferred
alternative label: Spalt
alternative label: Sprung
alternative label: gespalten
alt label: gespalten
  type: Label
  rank: preferred
alt label: Sprung
  type: Label
  rank: normal
alt label: Spalt
  type: Label
  rank: normal

offene Fuge
type: Concept
notation: G84156
created: 2026-01-30
issued: 2026-01-30
modified: 2026-02-04
publisher: Leibniz-Zentrum für Archäologie (LEIZA)
alternative label: offene Verbindung
broader: Kohäsionsverlust
broader transitive: Kohäsionsverlust
broader transitive: [Untersuchungsergebnisse]
broader transitive: Zustandserfassung
broader transitive: Objektuntersuchung
broader transitive: Schadensphänomen
broader transitive: [allgemeine Schadensphänomene]
definition: Zwei oder mehr Teile des Objektes weisen eine Lücke zueinander auf.
in scheme: Konservierungs- und Restaurierungsfachthesaurus für archäologische Kulturgüter
alt label: offene Verbindung
  type: Label
  rank: preferred
pref label: offene Fuge
  type: Label
  rank: preferred

gerissen
type: Concept
notation: GB33C3
created: 2026-01-30
issued: 2026-01-30
modified: 2026-02-04
publisher: Leibniz-Zentrum für Archäologie (LEIZA)
alternative label: Riss
broader: Kohäsionsverlust
broader transitive: Kohäsionsverlust
broader transitive: [Untersuchungsergebnisse]
broader transitive: Zustandserfassung
broader transitive: Objektuntersuchung
broader transitive: Schadensphänomen
broader transitive: [allgemeine Schadensphänomene]
definition: Das Materialgefüge des Objektes zeigt eine Abtrennung mit unregelmäßiger Kanten. Häufig verursacht durch Spannungsabbau im Gefüge.
in scheme: Konservierungs- und Restaurierungsfachthesaurus für archäologische Kulturgüter
alt label: Riss
  type: Label
  rank: preferred
pref label: gerissen
  type: Label
  rank: preferred

Tiefenriss
type: Concept
notation: BFAC52
created: 2026-01-30
issued: 2026-01-30
modified: 2026-02-04
publisher: Leibniz-Zentrum für Archäologie (LEIZA)
broader: rissig
broader transitive: Kohäsionsverlust
broader transitive: [Untersuchungsergebnisse]
broader transitive: Zustandserfassung
broader transitive: Objektuntersuchung
broader transitive: Schadensphänomen
broader transitive: [allgemeine Schadensphänomene]
broader transitive: rissig
definition: Das Objekt zeigt mindestens einen Riss, der bis tief in das Material hineinreicht
in scheme: Konservierungs- und Restaurierungsfachthesaurus für archäologische Kulturgüter
pref label: Tiefenriss
  type: Label
  rank: preferred

Craquellée
type: Concept
notation: D937D1
preferred label: crizzling @en
created: 2026-01-30
issued: 2026-01-30
modified: 2026-02-04
publisher: Leibniz-Zentrum für Archäologie (LEIZA)
broader: rissig
broader transitive: Kohäsionsverlust
broader transitive: [Untersuchungsergebnisse]
broader transitive: Zustandserfassung
broader transitive: Objektuntersuchung
broader transitive: Schadensphänomen
broader transitive: [allgemeine Schadensphänomene]
broader transitive: rissig
definition: Im Objektmaterial oder auf dessen Oberfläche (Glasur) sind feine, netzartige Risse oder Haarrisse zu beobachten.
in scheme: Konservierungs- und Restaurierungsfachthesaurus für archäologische Kulturgüter
pref label: Craquellée
  type: Label
  rank: preferred
pref label: crizzling
  type: Label
  rank: normal

Haarriss
type: Concept
notation: F2A5A7
created: 2026-01-30
issued: 2026-01-30
modified: 2026-02-04
publisher: Leibniz-Zentrum für Archäologie (LEIZA)
broader: rissig
broader transitive: Kohäsionsverlust
broader transitive: [Untersuchungsergebnisse]
broader transitive: Zustandserfassung
broader transitive: Objektuntersuchung
broader transitive: Schadensphänomen
broader transitive: [allgemeine Schadensphänomene]
broader transitive: rissig
definition: Das Objekt zeigt einen sehr feinen, oberflächlichen Riss, der nur wenige Millimeter tief und breit ist.
in scheme: Konservierungs- und Restaurierungsfachthesaurus für archäologische Kulturgüter
pref label: Haarriss
  type: Label
  rank: preferred

Oberflächenriss
type: Concept
notation: GD5454
created: 2026-01-30
issued: 2026-01-30
modified: 2026-02-04
publisher: Leibniz-Zentrum für Archäologie (LEIZA)
broader: rissig
broader transitive: Kohäsionsverlust
broader transitive: [Untersuchungsergebnisse]
broader transitive: Zustandserfassung
broader transitive: Objektuntersuchung
broader transitive: Schadensphänomen
broader transitive: [allgemeine Schadensphänomene]
broader transitive: rissig
definition: Das Objekt zeigt einen Riss, im Bereich seiner Oberfläche
in scheme: Konservierungs- und Restaurierungsfachthesaurus für archäologische Kulturgüter
pref label: Oberflächenriss
  type: Label
  rank: preferred

verkohlt
type: Concept
notation: A9B23D
created: 2026-01-30
issued: 2026-01-30
modified: 2026-02-04
publisher: Leibniz-Zentrum für Archäologie (LEIZA)
broader: chemische Veränderung
broader transitive: Zustandserfassung
broader transitive: Objektuntersuchung
broader transitive: chemische Veränderung
broader transitive: [Untersuchungsergebnisse]
broader transitive: Schadensphänomen
broader transitive: [allgemeine Schadensphänomene]
definition: Das Objekt zeigt Spuren von Hitze- bzw. Feuereinwirkung in Form von abgebautem oder gänzlich verloren gegangenem Material
in scheme: Konservierungs- und Restaurierungsfachthesaurus für archäologische Kulturgüter
pref label: verkohlt
  type: Label
  rank: preferred
alternative label: Verbrennung
alternative label: Verkohlung
alt label: Verbrennung
  type: Label
  rank: preferred
alt label: Verkohlung
  type: Label
  rank: normal

versalzen
type: Concept
notation: AA3CA7
created: 2026-01-30
issued: 2026-01-30
modified: 2026-02-04
publisher: Leibniz-Zentrum für Archäologie (LEIZA)
broader: chemische Veränderung
broader transitive: [Untersuchungsergebnisse]
broader transitive: Zustandserfassung
broader transitive: Objektuntersuchung
broader transitive: Schadensphänomen
broader transitive: [allgemeine Schadensphänomene]
broader transitive: chemische Veränderung
definition: Im Material oder an der Oberfläche sind lösliche Salze angereichert, die hygroskopisch Wasser aufnehmen und langfristig Schäden verursachen können.
in scheme: Konservierungs- und Restaurierungsfachthesaurus für archäologische Kulturgüter
pref label: versalzen
  type: Label
  rank: preferred

verätzt
type: Concept
notation: B799FA
created: 2026-01-30
issued: 2026-01-30
modified: 2026-02-04
publisher: Leibniz-Zentrum für Archäologie (LEIZA)
broader: chemische Veränderung
broader transitive: Zustandserfassung
broader transitive: Objektuntersuchung
broader transitive: chemische Veränderung
broader transitive: [Untersuchungsergebnisse]
broader transitive: Schadensphänomen
broader transitive: [allgemeine Schadensphänomene]
definition: Die Oberfläche bzw. das Material wurde durch aggressive Chemikalien, Gase oder Umweltstoffe angegriffen und zeigt deutliche Gefügeveränderungen.
in scheme: Konservierungs- und Restaurierungsfachthesaurus für archäologische Kulturgüter
pref label: verätzt
  type: Label
  rank: preferred

mineralisiert
type: Concept
notation: DD6CC9
created: 2026-01-30
issued: 2026-01-30
modified: 2026-02-04
publisher: Leibniz-Zentrum für Archäologie (LEIZA)
broader: chemische Veränderung
broader transitive: [Untersuchungsergebnisse]
broader transitive: Zustandserfassung
broader transitive: Objektuntersuchung
broader transitive: Schadensphänomen
broader transitive: [allgemeine Schadensphänomene]
broader transitive: chemische Veränderung
definition: Umwandlung und Erhaltung organischer Materialien durch Einlagerung mineralischer Substanzen.
in scheme: Konservierungs- und Restaurierungsfachthesaurus für archäologische Kulturgüter
pref label: mineralisiert
  type: Label
  rank: preferred

korrodiert
type: Concept
notation: G3D2F5
created: 2026-01-30
issued: 2026-01-30
modified: 2026-02-04
publisher: Leibniz-Zentrum für Archäologie (LEIZA)
alternative label: Korrosionsprodukt
broader: chemische Veränderung
broader transitive: [Untersuchungsergebnisse]
broader transitive: Zustandserfassung
broader transitive: Objektuntersuchung
broader transitive: Schadensphänomen
broader transitive: [allgemeine Schadensphänomene]
broader transitive: chemische Veränderung
definition: Materialumwandlungserscheinungen aufgrund chemischer Reaktionen des Objektmaterials mit seiner Umgebung. Häufig unter Beteiligung von Wasser, Salzen, Säuren oder Basen. Korrosionsprodukte bilden oft Auflagerungen unterschiedlicher Farben und Konsistenzen.
definition:
  literal form: Materialumwandlungserscheinungen aufgrund chemischer Reaktionen des Objektmaterials mit seiner Umgebung. Häufig unter Beteiligung von Wasser, Salzen, Säuren oder Basen. Korrosionsprodukte bilden oft Auflagerungen unterschiedlicher Farben und Konsistenzen.
in scheme: Konservierungs- und Restaurierungsfachthesaurus für archäologische Kulturgüter
alt label: Korrosionsprodukt
  type: Label
  rank: preferred
pref label: korrodiert
  type: Label
  rank: preferred
narrower: oxidiert

oxidiert
type: Concept
notation: D2FD5A
created: 2026-01-30
issued: 2026-01-30
modified: 2026-02-04
publisher: Leibniz-Zentrum für Archäologie (LEIZA)
alternative label: Oxidation
broader: korrodiert
broader transitive: [Untersuchungsergebnisse]
broader transitive: Zustandserfassung
broader transitive: Objektuntersuchung
broader transitive: Schadensphänomen
broader transitive: [allgemeine Schadensphänomene]
broader transitive: chemische Veränderung
broader transitive: korrodiert
definition: Bildung von Oxiden auf bzw. mit dem Objektmaterial durch Reaktion mit Sauerstoff.
in scheme: Konservierungs- und Restaurierungsfachthesaurus für archäologische Kulturgüter
alt label: Oxidation
  type: Label
  rank: preferred
pref label: oxidiert
  type: Label
  rank: preferred

Stereomikroskop
type: Concept
notation: A75779
preferred label: stereomicroscop @en
created: 2026-01-30
issued: 2026-01-30
modified: 2026-02-04
publisher: Leibniz-Zentrum für Archäologie (LEIZA)
broader: Lichtmikroskop
broader transitive: Lichtmikroskop
broader transitive: [Untersuchungsgerät]
broader transitive: Mikroskop
broader transitive: Zustandserfassung
broader transitive: Objektuntersuchung
definition: optisches Lichtmikroskop, das zwei getrennte Strahlengänge verwendet um ein dreidimensionales Bild eines Objektes zu erzeugen. Dadurch können detaillierte Oberflächenstrukturen besser untersucht werden. Es bietet eine geringere Vergrößerung im Vergleich zu anderen Mikroskopen aber eine größerer Tiefenschärfe.
definition:
  literal form: optisches Lichtmikroskop, das zwei getrennte Strahlengänge verwendet um ein dreidimensionales Bild eines Objektes zu erzeugen. Dadurch können detaillierte Oberflächenstrukturen besser untersucht werden. Es bietet eine geringere Vergrößerung im Vergleich zu anderen Mikroskopen aber eine größerer Tiefenschärfe.
in scheme: Konservierungs- und Restaurierungsfachthesaurus für archäologische Kulturgüter
pref label: Stereomikroskop
  type: Label
  rank: preferred
pref label: stereomicroscop
  type: Label
  rank: normal

Polarisationsmikroskop
type: Concept
notation: A7FA3B
preferred label: petrographic microscope @en
created: 2026-01-30
issued: 2026-01-30
modified: 2026-02-04
publisher: Leibniz-Zentrum für Archäologie (LEIZA)
broader: Lichtmikroskop
broader transitive: Lichtmikroskop
broader transitive: [Untersuchungsgerät]
broader transitive: Mikroskop
broader transitive: Zustandserfassung
broader transitive: Objektuntersuchung
definition: spezielles Lichtmikroskop, das polarisiertes Licht verwendet, um die optischen Eigenschaften von Materialien zu untersuchen. Bei Polarisationsmikroskopen handelt es sich in der Regel um Durchlichtmikroskope, bei denen unterhalb des Objekttisches ein Polarisationsfilter (Polarisator) über der Lichtquelle eingebracht ist. Dieser polarisiert das aus der Lichtquelle austretende Licht linear und lässt somit nur in einer Schwingungsebene schwingendes Licht durch das Präperat auf dem Objekttisch. Oberhalb des Objektives trifft dieses Licht auf einen weiteren Polarisationsfilter (Analysator), der das durch das Präperat geleitete Licht analysiert. Auf diese Weise werden z.B. bei kristallinen Substanzen charakteristische Eigenschaften wie Farbe, innere Strukturen, Doppelbrechung, optische Aktivität oder Stressmuster sichtbar, was wiederum eine nähere Differenzierung des untersuchten Materials ermöglicht.
definition:
  literal form: spezielles Lichtmikroskop, das polarisiertes Licht verwendet, um die optischen Eigenschaften von Materialien zu untersuchen. Bei Polarisationsmikroskopen handelt es sich in der Regel um Durchlichtmikroskope, bei denen unterhalb des Objekttisches ein Polarisationsfilter (Polarisator) über der Lichtquelle eingebracht ist. Dieser polarisiert das aus der Lichtquelle austretende Licht linear und lässt somit nur in einer Schwingungsebene schwingendes Licht durch das Präperat auf dem Objekttisch. Oberhalb des Objektives trifft dieses Licht auf einen weiteren Polarisationsfilter (Analysator), der das durch das Präperat geleitete Licht analysiert. Auf diese Weise werden z.B. bei kristallinen Substanzen charakteristische Eigenschaften wie Farbe, innere Strukturen, Doppelbrechung, optische Aktivität oder Stressmuster sichtbar, was wiederum eine nähere Differenzierung des untersuchten Materials ermöglicht.
in scheme: Konservierungs- und Restaurierungsfachthesaurus für archäologische Kulturgüter
pref label: Polarisationsmikroskop
  type: Label
  rank: preferred
pref label: petrographic microscope
  type: Label
  rank: normal

Durchlichtmikroskop
type: Concept
notation: A9611D
preferred label: transmitted light microscope @en
created: 2026-01-30
issued: 2026-01-30
modified: 2026-02-04
publisher: Leibniz-Zentrum für Archäologie (LEIZA)
broader: Lichtmikroskop
broader transitive: Lichtmikroskop
broader transitive: [Untersuchungsgerät]
broader transitive: Mikroskop
broader transitive: Zustandserfassung
broader transitive: Objektuntersuchung
definition: Lichtmikroskop, bei dem sich die Lichtquelle unterhalb des Objekttisches befindet und das Licht somit durch das Präperat hindurch geleitet wird, bevor es vom Objektiv eingefangen und weiter zum Okular und schließlich auf das menschliche Auge bzw. auf eine Kamera gelenkt wird. Auf diese Weise können die inneren Strukturen durchsichtiger/durchscheinender bzw. dünn geschnittener Präperate vergrößert sichtbar gemacht werden.
definition:
  literal form: Lichtmikroskop, bei dem sich die Lichtquelle unterhalb des Objekttisches befindet und das Licht somit durch das Präperat hindurch geleitet wird, bevor es vom Objektiv eingefangen und weiter zum Okular und schließlich auf das menschliche Auge bzw. auf eine Kamera gelenkt wird. Auf diese Weise können die inneren Strukturen durchsichtiger/durchscheinender bzw. dünn geschnittener Präperate vergrößert sichtbar gemacht werden.
in scheme: Konservierungs- und Restaurierungsfachthesaurus für archäologische Kulturgüter
pref label: Durchlichtmikroskop
  type: Label
  rank: preferred
pref label: transmitted light microscope
  type: Label
  rank: normal

Spektrometer
type: Concept
notation: A9A54D
created: 2026-01-30
issued: 2026-01-30
modified: 2026-02-04
publisher: Leibniz-Zentrum für Archäologie (LEIZA)
broader: [Untersuchungsgerät]
broader transitive: [Untersuchungsgerät]
broader transitive: Zustandserfassung
broader transitive: Objektuntersuchung
definition: technisches Geräte, mit dem sich Spektren darstellen und ausmessen lassen.
in scheme: Konservierungs- und Restaurierungsfachthesaurus für archäologische Kulturgüter
narrower: RFA-Spektrometer
narrower: Fourier-Transform-Infrarotspektrometer
pref label: Spektrometer
  type: Label
  rank: preferred

RFA-Spektrometer
type: Concept
notation: C2788C
preferred label: X-ray fluorescence spectrometer @en
created: 2026-01-30
issued: 2026-01-30
modified: 2026-02-04
publisher: Leibniz-Zentrum für Archäologie (LEIZA)
broader: Spektrometer
broader transitive: Spektrometer
broader transitive: [Untersuchungsgerät]
broader transitive: Zustandserfassung
broader transitive: Objektuntersuchung
definition: Gerät mit dem eine Röntgenfluoreszenzanalyse durchgeführt werden kann. Das Gerät misst dabei die Intensitäten der emmitierten Fluoreszenzsröntgenstrahlung eines Materials/einer Probe, sodass Rückschlüsse auf die Elementzusammensetzung innerhalb der Probe gezogen werden können.
definition:
  literal form: Gerät mit dem eine Röntgenfluoreszenzanalyse durchgeführt werden kann. Das Gerät misst dabei die Intensitäten der emmitierten Fluoreszenzsröntgenstrahlung eines Materials/einer Probe, sodass Rückschlüsse auf die Elementzusammensetzung innerhalb der Probe gezogen werden können.
in scheme: Konservierungs- und Restaurierungsfachthesaurus für archäologische Kulturgüter
pref label: RFA-Spektrometer
  type: Label
  rank: preferred
pref label: X-ray fluorescence spectrometer
  type: Label
  rank: normal
alternative label: Röntgenfluoreszenz-Spektrometer
alt label: Röntgenfluoreszenz-Spektrometer
  type: Label
  rank: preferred

Fourier-Transform-Infrarotspektrometer
type: Concept
notation: C33933
created: 2026-01-30
issued: 2026-01-30
modified: 2026-02-04
publisher: Leibniz-Zentrum für Archäologie (LEIZA)
broader: Spektrometer
broader transitive: Spektrometer
broader transitive: [Untersuchungsgerät]
broader transitive: Zustandserfassung
broader transitive: Objektuntersuchung
in scheme: Konservierungs- und Restaurierungsfachthesaurus für archäologische Kulturgüter
pref label: Fourier-Transform-Infrarotspektrometer
  type: Label
  rank: preferred
alternative label: FTIR-Spektrometer
alt label: FTIR-Spektrometer
  type: Label
  rank: preferred

Fluoreszenzmikroskopen
type: Concept
notation: A9F854
preferred label: fluorescence microscope @en
created: 2026-01-30
issued: 2026-01-30
modified: 2026-02-04
publisher: Leibniz-Zentrum für Archäologie (LEIZA)
broader: Lichtmikroskop
broader transitive: Lichtmikroskop
broader transitive: [Untersuchungsgerät]
broader transitive: Mikroskop
broader transitive: Zustandserfassung
broader transitive: Objektuntersuchung
definition: spezielles Lichtmikroskop, welches die Fluoresenz von Stoffen, bei einer Anregung mit spezifischen Wellenlängen, zur Visualisierung von internen Strukturen, Anordnungen und Zusammensetzungen nutzt. Die Probe wird dabei gezielt mit Licht einer bestimmten Wellenlänge beleuchtet und die emittierte Fluoresenzstrahlung erfasst. Besonders gut können dabei Strukturen erfasst werden, wenn nur ein Teil der Probe fluorisziert und sich somit die hellen Signale vor dem dunklen Hintergrund der nicht fluoreszierenden Stoffe abheben.
definition:
  literal form: spezielles Lichtmikroskop, welches die Fluoresenz von Stoffen, bei einer Anregung mit spezifischen Wellenlängen, zur Visualisierung von internen Strukturen, Anordnungen und Zusammensetzungen nutzt. Die Probe wird dabei gezielt mit Licht einer bestimmten Wellenlänge beleuchtet und die emittierte Fluoresenzstrahlung erfasst. Besonders gut können dabei Strukturen erfasst werden, wenn nur ein Teil der Probe fluorisziert und sich somit die hellen Signale vor dem dunklen Hintergrund der nicht fluoreszierenden Stoffe abheben.
in scheme: Konservierungs- und Restaurierungsfachthesaurus für archäologische Kulturgüter
pref label: Fluoreszenzmikroskopen
  type: Label
  rank: preferred
pref label: fluorescence microscope
  type: Label
  rank: normal

Mikroskop
type: Concept
notation: B538AG
preferred label: microscope @en
created: 2026-01-30
issued: 2026-01-30
modified: 2026-02-04
publisher: Leibniz-Zentrum für Archäologie (LEIZA)
broader: [Untersuchungsgerät]
broader transitive: [Untersuchungsgerät]
broader transitive: Zustandserfassung
broader transitive: Objektuntersuchung
definition: Instrument, zur detaillierten bildlichen Darstellung von mikroskopisch kleinen Strukturen, die für das menschliche Auge ohne Hilfmittel nicht erkennbar sind. Mit Hilfe von Linsen und Licht oder Elektronenstrahlen, können die Strukturen/Abbildungen vergrößert und für das menschliche Auge wahrnehmbar gemacht werden.
definition:
  literal form: Instrument, zur detaillierten bildlichen Darstellung von mikroskopisch kleinen Strukturen, die für das menschliche Auge ohne Hilfmittel nicht erkennbar sind. Mit Hilfe von Linsen und Licht oder Elektronenstrahlen, können die Strukturen/Abbildungen vergrößert und für das menschliche Auge wahrnehmbar gemacht werden.
in scheme: Konservierungs- und Restaurierungsfachthesaurus für archäologische Kulturgüter
narrower: Rasterelektronenmikroskop
narrower: Lichtmikroskop
pref label: Mikroskop
  type: Label
  rank: preferred
pref label: microscope
  type: Label
  rank: normal

Computertomograph
type: Concept
notation: DG6841
preferred label: computed tomography scanner @en
created: 2026-01-30
issued: 2026-01-30
modified: 2026-02-04
publisher: Leibniz-Zentrum für Archäologie (LEIZA)
broader: [Untersuchungsgerät]
broader transitive: [Untersuchungsgerät]
broader transitive: Zustandserfassung
broader transitive: Objektuntersuchung
definition: technisches Gerät, mit dem dreidimensionale Röntgenaufnahmen und Schichtbilder erzeugt werden können. Das Gerät besteht prinzipiell, ebenso wie das konventionelle Röntgengerät, aus einer Röntgenröhre, die Röntgenstrahlen erzeugt, und einem Detektor, der die Strahlen erfasst. Der Unterschied liegt jedoch in der rotierenden Bewegung des zu untersuchenden Objektes, welches sich auf einem Drehteller zwischen Strahlenquelle und Detektor langsam und gleichmäßig um die eigene Achse dreht. Auf diese Weise wird das Objekt aus verschiedenen Winklen von den Röntgenstrahlen durchleuchtet.
definition:
  literal form: technisches Gerät, mit dem dreidimensionale Röntgenaufnahmen und Schichtbilder erzeugt werden können. Das Gerät besteht prinzipiell, ebenso wie das konventionelle Röntgengerät, aus einer Röntgenröhre, die Röntgenstrahlen erzeugt, und einem Detektor, der die Strahlen erfasst. Der Unterschied liegt jedoch in der rotierenden Bewegung des zu untersuchenden Objektes, welches sich auf einem Drehteller zwischen Strahlenquelle und Detektor langsam und gleichmäßig um die eigene Achse dreht. Auf diese Weise wird das Objekt aus verschiedenen Winklen von den Röntgenstrahlen durchleuchtet.
in scheme: Konservierungs- und Restaurierungsfachthesaurus für archäologische Kulturgüter
pref label: Computertomograph
  type: Label
  rank: preferred
pref label: computed tomography scanner
  type: Label
  rank: normal
alternative label: CT (Gerät)
alt label: CT (Gerät)
  type: Label
  rank: preferred

UV-Lampe
type: Concept
notation: G8C987
created: 2026-01-30
issued: 2026-01-30
modified: 2026-02-04
publisher: Leibniz-Zentrum für Archäologie (LEIZA)
broader: [Untersuchungsgerät]
broader transitive: [Untersuchungsgerät]
broader transitive: Zustandserfassung
broader transitive: Objektuntersuchung
definition: Lichquelle, die ultraviolettes Licht emittieren kann. In der Regel handelt es sich dabei um Lampen mit UV-A Filter, Gasentladungslampen oder spezielle LEDs.
in scheme: Konservierungs- und Restaurierungsfachthesaurus für archäologische Kulturgüter
pref label: UV-Lampe
  type: Label
  rank: preferred
alternative label: Schwarzlicht
alternative label: UV-Licht
alt label: UV-Licht
  type: Label
  rank: preferred
alt label: Schwarzlicht
  type: Label
  rank: normal

konventionelles Röntgengerät
type: Concept
notation: G8D62A
preferred label: X-ray unit @en
created: 2026-01-30
issued: 2026-01-30
modified: 2026-02-04
publisher: Leibniz-Zentrum für Archäologie (LEIZA)
broader: [Untersuchungsgerät]
broader transitive: [Untersuchungsgerät]
broader transitive: Zustandserfassung
broader transitive: Objektuntersuchung
definition: technisches Gerät, mit dem zweidimensionale Röntgenaufnahmen erzeugt werden können. Das Gerät besteht dabei aus einer Röntgenröhre, die Röntgenstrahlen erzeugt und einem Detektor oder Film, der die Strahlen erfasst. Das zu untersuchende Objekt wird zwischen Röntgenröhre und Detektor positioniert und somit von den Strahlen aus der Strahlenquelle durchleuchtet. Im Gegensatz zum Aufbau eines CT-Scanners handelt es sich beim konventionellen Röntgengerät um einen starren Aufbau, bei dem keine Bewegung während des Aufnahmevorgangs stattfindet.
definition:
  literal form: technisches Gerät, mit dem zweidimensionale Röntgenaufnahmen erzeugt werden können. Das Gerät besteht dabei aus einer Röntgenröhre, die Röntgenstrahlen erzeugt und einem Detektor oder Film, der die Strahlen erfasst. Das zu untersuchende Objekt wird zwischen Röntgenröhre und Detektor positioniert und somit von den Strahlen aus der Strahlenquelle durchleuchtet. Im Gegensatz zum Aufbau eines CT-Scanners handelt es sich beim konventionellen Röntgengerät um einen starren Aufbau, bei dem keine Bewegung während des Aufnahmevorgangs stattfindet.
in scheme: Konservierungs- und Restaurierungsfachthesaurus für archäologische Kulturgüter
pref label: konventionelles Röntgengerät
  type: Label
  rank: preferred
pref label: X-ray unit
  type: Label
  rank: normal

Digitalmikroskop
type: Concept
notation: AG4G3C
created: 2026-01-30
issued: 2026-01-30
modified: 2026-02-04
publisher: Leibniz-Zentrum für Archäologie (LEIZA)
broader: Lichtmikroskop
broader transitive: Lichtmikroskop
broader transitive: [Untersuchungsgerät]
broader transitive: Mikroskop
broader transitive: Zustandserfassung
broader transitive: Objektuntersuchung
definition: Lichtmikroskop ohne Okular, bei dem die vom Objektiv eingefangenen Lichtstrahlen auf eine Kamera gelenkt werden. Über einen mit der Kamera verbundenen Bildschirm wird der durch das Mikroskop eingefangene Bildausschnitt digital sichtbar.
definition:
  literal form: Lichtmikroskop ohne Okular, bei dem die vom Objektiv eingefangenen Lichtstrahlen auf eine Kamera gelenkt werden. Über einen mit der Kamera verbundenen Bildschirm wird der durch das Mikroskop eingefangene Bildausschnitt digital sichtbar.
in scheme: Konservierungs- und Restaurierungsfachthesaurus für archäologische Kulturgüter
pref label: Digitalmikroskop
  type: Label
  rank: preferred

Rasterelektronenmikroskop
type: Concept
notation: B764C6
preferred label: scanning electron microscope @en
created: 2026-01-30
issued: 2026-01-30
modified: 2026-02-04
publisher: Leibniz-Zentrum für Archäologie (LEIZA)
broader: Mikroskop
broader transitive: [Untersuchungsgerät]
broader transitive: Mikroskop
broader transitive: Zustandserfassung
broader transitive: Objektuntersuchung
definition: Mikroskop, bei dem ein erzeugter Elektronenstrahl gezielt auf die Oberfläche eines Objekt gelenkt wird, diese in einem bestimmten Muster abrastert und durch die Wechselwirkung zwischen Elektronen und Objektoberfläche eine Abbildung der Oberflächenbeschaffenheit erzeugt wird.
definition:
  literal form: Mikroskop, bei dem ein erzeugter Elektronenstrahl gezielt auf die Oberfläche eines Objekt gelenkt wird, diese in einem bestimmten Muster abrastert und durch die Wechselwirkung zwischen Elektronen und Objektoberfläche eine Abbildung der Oberflächenbeschaffenheit erzeugt wird.
in scheme: Konservierungs- und Restaurierungsfachthesaurus für archäologische Kulturgüter
pref label: Rasterelektronenmikroskop
  type: Label
  rank: preferred
pref label: scanning electron microscope
  type: Label
  rank: normal
alternative label: REM (Gerät)
alternative label: SEM @en
alt label: REM (Gerät)
  type: Label
  rank: preferred
alt label: SEM
  type: Label
  rank: normal

Lichtmikroskop
type: Concept
notation: FC2113
preferred label: light microscope @en
created: 2026-01-30
issued: 2026-01-30
modified: 2026-02-04
publisher: Leibniz-Zentrum für Archäologie (LEIZA)
broader: Mikroskop
broader transitive: [Untersuchungsgerät]
broader transitive: Zustandserfassung
broader transitive: Objektuntersuchung
broader transitive: Mikroskop
definition: Instrument, bei dem mit Hilfe von sichtbarem Licht Objekte vergrößert betrachtet werden können. Es besteht aus einer Lichtquelle, Linsen und einer Bildgebungseinheit, die es ermöglichen, Details von Objekten im Bereich von Mikrometern bis Millimetern zu visualisieren.
definition:
  literal form: Instrument, bei dem mit Hilfe von sichtbarem Licht Objekte vergrößert betrachtet werden können. Es besteht aus einer Lichtquelle, Linsen und einer Bildgebungseinheit, die es ermöglichen, Details von Objekten im Bereich von Mikrometern bis Millimetern zu visualisieren.
in scheme: Konservierungs- und Restaurierungsfachthesaurus für archäologische Kulturgüter
narrower: Stereomikroskop
narrower: Polarisationsmikroskop
narrower: Durchlichtmikroskop
narrower: Fluoreszenzmikroskopen
narrower: Digitalmikroskop
narrower: Konfokalmikroskop
narrower: Auflichtmikroskop
pref label: Lichtmikroskop
  type: Label
  rank: preferred
pref label: light microscope
  type: Label
  rank: normal
alternative label: Optisches Mikroskop
alt label: Optisches Mikroskop
  type: Label
  rank: preferred

Konfokalmikroskop
type: Concept
notation: B7AF8G
created: 2026-01-30
issued: 2026-01-30
modified: 2026-02-04
publisher: Leibniz-Zentrum für Archäologie (LEIZA)
broader: Lichtmikroskop
broader transitive: Lichtmikroskop
broader transitive: [Untersuchungsgerät]
broader transitive: Mikroskop
broader transitive: Zustandserfassung
broader transitive: Objektuntersuchung
definition: Spezielle Art des Lichtmikroskops, bei dem nur einzelne Bereiche der zu untersuchenden Probe mit einer punkförmigen Lichquelle beleuchtet werde. Diese Beleuchtung wird Schritt für Schritt über die gesamte Probe gerastert, sodass nacheinander an allen Bereichen der Probe die Lichtintensitäten des reflektierten oder fluoreszierten Lichtes gemessen und zu einem gesamt Bild konstruiert wird.
definition:
  literal form: Spezielle Art des Lichtmikroskops, bei dem nur einzelne Bereiche der zu untersuchenden Probe mit einer punkförmigen Lichquelle beleuchtet werde. Diese Beleuchtung wird Schritt für Schritt über die gesamte Probe gerastert, sodass nacheinander an allen Bereichen der Probe die Lichtintensitäten des reflektierten oder fluoreszierten Lichtes gemessen und zu einem gesamt Bild konstruiert wird.
in scheme: Konservierungs- und Restaurierungsfachthesaurus für archäologische Kulturgüter
pref label: Konfokalmikroskop
  type: Label
  rank: preferred

Auflichtmikroskop
type: Concept
notation: B94DCD
preferred label: reflected light microscope @en
created: 2026-01-30
issued: 2026-01-30
modified: 2026-02-04
publisher: Leibniz-Zentrum für Archäologie (LEIZA)
broader: Lichtmikroskop
broader transitive: Lichtmikroskop
broader transitive: [Untersuchungsgerät]
broader transitive: Mikroskop
broader transitive: Zustandserfassung
broader transitive: Objektuntersuchung
definition: Lichtmikroskop, bei dem die Lichtquelle von oben oder von der Seite auf das zu betrachtende Objekt/ die Probe gerichtet ist. Das Objekt reflektiert die auftreffenden Lichtstrahlen, die dann durch das Objektiv hindurch mit Hilfe von Spiegeln in Richtung des Okulars und damit auf das menschliche Auge bzw. auf eine Kamera gelenkt werden. Auf diese Weise können bei lichtundurchlässigen Objekten die oberflächlichen Strukturen, wie z.B. Feilspuren der Herstellung auf Metallobjekten, vergrößert betrachtet werden.
definition:
  literal form: Lichtmikroskop, bei dem die Lichtquelle von oben oder von der Seite auf das zu betrachtende Objekt/ die Probe gerichtet ist. Das Objekt reflektiert die auftreffenden Lichtstrahlen, die dann durch das Objektiv hindurch mit Hilfe von Spiegeln in Richtung des Okulars und damit auf das menschliche Auge bzw. auf eine Kamera gelenkt werden. Auf diese Weise können bei lichtundurchlässigen Objekten die oberflächlichen Strukturen, wie z.B. Feilspuren der Herstellung auf Metallobjekten, vergrößert betrachtet werden.
in scheme: Konservierungs- und Restaurierungsfachthesaurus für archäologische Kulturgüter
pref label: Auflichtmikroskop
  type: Label
  rank: preferred
pref label: reflected light microscope
  type: Label
  rank: normal

Laser Ablation – Inductively Coupled Plasma – Mass Spectrometry
type: Concept
notation: BFGB1A
created: 2026-01-30
issued: 2026-01-30
modified: 2026-02-04
publisher: Leibniz-Zentrum für Archäologie (LEIZA)
alternative label: LA-ICP-MS
broader: Materialanalyse
broader transitive: Materialanalyse
broader transitive: Zustandserfassung
broader transitive: Objektuntersuchung
broader transitive: [Untersuchungsmethode]
in scheme: Konservierungs- und Restaurierungsfachthesaurus für archäologische Kulturgüter
alt label: LA-ICP-MS
  type: Label
  rank: preferred
pref label: Laser Ablation – Inductively Coupled Plasma – Mass Spectrometry
  type: Label
  rank: preferred

Fourier-Transform-Infrarotspektrometrie
type: Concept
notation: C2DF6G
preferred label: fourier transform infrared spectroscopy @en
created: 2026-01-30
issued: 2026-01-30
modified: 2026-02-04
publisher: Leibniz-Zentrum für Archäologie (LEIZA)
alternative label: FTIR
broader: Analyse der chemischen Zusammensetzung
broader transitive: Materialanalyse
broader transitive: Zustandserfassung
broader transitive: Objektuntersuchung
broader transitive: [Untersuchungsmethode]
broader transitive: Analyse der chemischen Zusammensetzung
in scheme: Konservierungs- und Restaurierungsfachthesaurus für archäologische Kulturgüter
alt label: FTIR
  type: Label
  rank: preferred
pref label: Fourier-Transform-Infrarotspektrometrie
  type: Label
  rank: preferred
pref label: fourier transform infrared spectroscopy
  type: Label
  rank: normal
definition: analytische Methode, die zur Identifizierung und Charakterisierung von organischen und anorganischen Verbindungen verwendet wird. Das Prinzip beruht auf der Interferenz von Strahlung zwischen zwei Lichtstrahlen, bei der die Änderung der Weglänge zwischen den beiden Strahlen in Form eines Signals (Interferogram) gemessen und als Infrarotspektrum am Computer ausgewertet werden kann. Dieses gibt Auskunft über die molekulare Struktur und chemische Zusammensetzung einer Probe.
definition:
  literal form: analytische Methode, die zur Identifizierung und Charakterisierung von organischen und anorganischen Verbindungen verwendet wird. Das Prinzip beruht auf der Interferenz von Strahlung zwischen zwei Lichtstrahlen, bei der die Änderung der Weglänge zwischen den beiden Strahlen in Form eines Signals (Interferogram) gemessen und als Infrarotspektrum am Computer ausgewertet werden kann. Dieses gibt Auskunft über die molekulare Struktur und chemische Zusammensetzung einer Probe.

Analyse der chemischen Zusammensetzung
type: Concept
notation: G17B8B
created: 2026-01-30
issued: 2026-01-30
modified: 2026-02-04
publisher: Leibniz-Zentrum für Archäologie (LEIZA)
broader: Materialanalyse
broader transitive: Materialanalyse
broader transitive: Zustandserfassung
broader transitive: Objektuntersuchung
broader transitive: [Untersuchungsmethode]
in scheme: Konservierungs- und Restaurierungsfachthesaurus für archäologische Kulturgüter
pref label: Analyse der chemischen Zusammensetzung
  type: Label
  rank: preferred
definition: Methode, bei der mit Hilfe technischer Geräte die Eigenschaften von Stoffen untersucht und Rückschlüsse auf die chemische Zusammensetzung von Materialien gezogen werden kann.
narrower: Fourier-Transform-Infrarotspektrometrie
narrower: Instrumentelle Neutronenaktivierungsanalyse
narrower: energiedispersive Röntgenspektroskopie
narrower: Optische Emissionsspektrometrie mit induktiv gekoppeltem Plasma
narrower: Laserinduzierte Plasmaspektroskopie

Akemi Marmorkitt 1000
type: Concept
notation: DAC425
created: 2026-01-30
issued: 2026-01-30
modified: 2026-02-04
publisher: Leibniz-Zentrum für Archäologie (LEIZA)
broader: Polyesterharz
broader transitive: synthetisches Polymer
broader transitive: [Adhäsivstoff]
broader transitive: Konservierungs- und Restaurierungsmaterialien
broader transitive: Maßnahme
broader transitive: Polyesterharz
in scheme: Konservierungs- und Restaurierungsfachthesaurus für archäologische Kulturgüter
pref label: Akemi Marmorkitt 1000
  type: Label
  rank: preferred
definition: Produktname eines 2-Komponenten Polyesterharzes mit mineralischen Füllstoffen der Firma Akemi® . Das Produkt wurde ursprünglich für Verkittungen und Verklebungen in der steinverarbeitenden Industrie hergestellt, eignet sich aufgrund seiner Eigenschaften jedoch auch in der Konservierung und Restaurierung für die stabile und schnelle Füllung und Verklebung von kleineren Fehlstellen. Es besitzt eine flüssig bis cremige Konsistenz, eine Verarbeitungszeit von ca. 20 - 40 Minuten und lässt sich nach dem Aushärten gut mit verschiedenen Werkzeugen (Schleifen, Bohren, Fräsen) bearbeiten.
definition:
  literal form: Produktname eines 2-Komponenten Polyesterharzes mit mineralischen Füllstoffen der Firma Akemi® . Das Produkt wurde ursprünglich für Verkittungen und Verklebungen in der steinverarbeitenden Industrie hergestellt, eignet sich aufgrund seiner Eigenschaften jedoch auch in der Konservierung und Restaurierung für die stabile und schnelle Füllung und Verklebung von kleineren Fehlstellen. Es besitzt eine flüssig bis cremige Konsistenz, eine Verarbeitungszeit von ca. 20 - 40 Minuten und lässt sich nach dem Aushärten gut mit verschiedenen Werkzeugen (Schleifen, Bohren, Fräsen) bearbeiten.

Polyesterharz
type: Concept
notation: F8A93F
created: 2026-01-30
issued: 2026-01-30
modified: 2026-02-04
publisher: Leibniz-Zentrum für Archäologie (LEIZA)
broader: synthetisches Polymer
broader transitive: synthetisches Polymer
broader transitive: Konservierungs- und Restaurierungsmaterialien
broader transitive: Maßnahme
broader transitive: [Adhäsivstoff]
definition: synthetisches Polymerharz bestehend aus einer Mischung von ungesättigten Polyester und einem Reaktivmonomer (häufig Styrol), die durch Zugabe eines Initiators bei Raumtemperatur polymerisieren. Charakteristisch ist eine gute mechanische Festigkeit, hohe Viskosität, hohe Klebefähigkeit, aber schwache Widerstandsfähigkeit gegen UV-Licht. In der Konservierung und Restaurierung findet Polyesterharz vorwiegend in der Strukturfestigung von porösem Steinmaterial, als Klebstoff, Füllmittel und für die Herstellung von wissenschaftlichen Kopien Verwendung. Zu den kristischen Aspekten in der restauratorischen Verwendung gehören die irreversible Aushärtung sowie die starke Schrumpfung (bis zu 8%) und Empfindlichkeit gegenüber Feuchtigkeit während der Polymerisation.
definition:
  literal form: synthetisches Polymerharz bestehend aus einer Mischung von ungesättigten Polyester und einem Reaktivmonomer (häufig Styrol), die durch Zugabe eines Initiators bei Raumtemperatur polymerisieren. Charakteristisch ist eine gute mechanische Festigkeit, hohe Viskosität, hohe Klebefähigkeit, aber schwache Widerstandsfähigkeit gegen UV-Licht. In der Konservierung und Restaurierung findet Polyesterharz vorwiegend in der Strukturfestigung von porösem Steinmaterial, als Klebstoff, Füllmittel und für die Herstellung von wissenschaftlichen Kopien Verwendung. Zu den kristischen Aspekten in der restauratorischen Verwendung gehören die irreversible Aushärtung sowie die starke Schrumpfung (bis zu 8%) und Empfindlichkeit gegenüber Feuchtigkeit während der Polymerisation.
in scheme: Konservierungs- und Restaurierungsfachthesaurus für archäologische Kulturgüter
pref label: Polyesterharz
  type: Label
  rank: preferred
narrower: Palatal® P 4-01
narrower: Akemi Marmorkitt 1000

Instrumentelle Neutronenaktivierungsanalyse
type: Concept
notation: DADDD6
created: 2026-01-30
issued: 2026-01-30
modified: 2026-02-04
publisher: Leibniz-Zentrum für Archäologie (LEIZA)
alternative label: INAA
broader: Analyse der chemischen Zusammensetzung
broader transitive: Materialanalyse
broader transitive: Zustandserfassung
broader transitive: Objektuntersuchung
broader transitive: [Untersuchungsmethode]
broader transitive: Analyse der chemischen Zusammensetzung
in scheme: Konservierungs- und Restaurierungsfachthesaurus für archäologische Kulturgüter
alt label: INAA
  type: Label
  rank: preferred
pref label: Instrumentelle Neutronenaktivierungsanalyse
  type: Label
  rank: preferred

energiedispersive Röntgenspektroskopie
type: Concept
notation: DG129D
preferred label: energy dispersive X-ray spectroscopy @en
created: 2026-01-30
issued: 2026-01-30
modified: 2026-02-04
publisher: Leibniz-Zentrum für Archäologie (LEIZA)
alternative label: EDS
alternative label: EDX
broader: Analyse der chemischen Zusammensetzung
broader transitive: Materialanalyse
broader transitive: Zustandserfassung
broader transitive: Objektuntersuchung
broader transitive: [Untersuchungsmethode]
broader transitive: Analyse der chemischen Zusammensetzung
in scheme: Konservierungs- und Restaurierungsfachthesaurus für archäologische Kulturgüter
alt label: EDX
  type: Label
  rank: preferred
alt label: EDS
  type: Label
  rank: normal
pref label: energy dispersive X-ray spectroscopy
  type: Label
  rank: normal
pref label: energiedispersive Röntgenspektroskopie
  type: Label
  rank: preferred

Röntgenfluoresezenzanalyse
type: Concept
notation: FCB7A5
preferred label: XRF @en
created: 2026-01-30
issued: 2026-01-30
modified: 2026-02-04
publisher: Leibniz-Zentrum für Archäologie (LEIZA)
alternative label: RFA
alternative label: X-ray fluorescence analysis @en
broader: Materialanalyse
broader transitive: Materialanalyse
broader transitive: Zustandserfassung
broader transitive: Objektuntersuchung
broader transitive: [Untersuchungsmethode]
in scheme: Konservierungs- und Restaurierungsfachthesaurus für archäologische Kulturgüter
alt label: RFA
  type: Label
  rank: preferred
alt label: X-ray fluorescence analysis
  type: Label
  rank: normal
pref label: Röntgenfluoresezenzanalyse
  type: Label
  rank: preferred
pref label: XRF
  type: Label
  rank: normal

Optische Emissionsspektrometrie mit induktiv gekoppeltem Plasma
type: Concept
notation: G69G4B
preferred label: inductively coupled plasma optical emission spectrometry @en
created: 2026-01-30
issued: 2026-01-30
modified: 2026-02-04
publisher: Leibniz-Zentrum für Archäologie (LEIZA)
alternative label: ICP-OES
broader: Analyse der chemischen Zusammensetzung
broader transitive: Materialanalyse
broader transitive: Zustandserfassung
broader transitive: Objektuntersuchung
broader transitive: [Untersuchungsmethode]
broader transitive: Analyse der chemischen Zusammensetzung
in scheme: Konservierungs- und Restaurierungsfachthesaurus für archäologische Kulturgüter
alt label: ICP-OES
  type: Label
  rank: preferred
pref label: Optische Emissionsspektrometrie mit induktiv gekoppeltem Plasma
  type: Label
  rank: preferred
pref label: inductively coupled plasma optical emission spectrometry
  type: Label
  rank: normal

Laserinduzierte Plasmaspektroskopie
type: Concept
notation: GA6422
preferred label: laser-induced breakdown spectroscopy @en
created: 2026-01-30
issued: 2026-01-30
modified: 2026-02-04
publisher: Leibniz-Zentrum für Archäologie (LEIZA)
alternative label: LIBS
alternative label: LIPS
broader: Analyse der chemischen Zusammensetzung
broader transitive: Materialanalyse
broader transitive: Zustandserfassung
broader transitive: Objektuntersuchung
broader transitive: [Untersuchungsmethode]
broader transitive: Analyse der chemischen Zusammensetzung
in scheme: Konservierungs- und Restaurierungsfachthesaurus für archäologische Kulturgüter
alt label: LIBS
  type: Label
  rank: preferred
alt label: LIPS
  type: Label
  rank: normal
pref label: Laserinduzierte Plasmaspektroskopie
  type: Label
  rank: preferred
pref label: laser-induced breakdown spectroscopy
  type: Label
  rank: normal

Polyurethan
type: Concept
notation: A3G356
created: 2026-01-30
issued: 2026-01-30
modified: 2026-02-04
publisher: Leibniz-Zentrum für Archäologie (LEIZA)
alternative label: PU
alternative label: PUR
broader: synthetisches Polymer
broader transitive: synthetisches Polymer
broader transitive: [Adhäsivstoff]
broader transitive: Konservierungs- und Restaurierungsmaterialien
broader transitive: Maßnahme
definition: synthetisches Polymere, das durch eine Reaktion von Polyisocyanaten mit einem Polyol hergestellt wird. In der Konservierung und Restaurierung wird es als Festigungs- und Bindemittel sowie in Form von Schäumen als Stabilisierung von Blockbergungen verwendet. Die Eigenschaften wie Härte, Elastizität und Beständigkeit lassen sich durch die Wahl der Ausgangskomponenten gezielt steuern, wobei die genaue Formulierung von kommerziell erwärblichen Polyurethanen häufig unklar ist.
definition:
  literal form: synthetisches Polymere, das durch eine Reaktion von Polyisocyanaten mit einem Polyol hergestellt wird. In der Konservierung und Restaurierung wird es als Festigungs- und Bindemittel sowie in Form von Schäumen als Stabilisierung von Blockbergungen verwendet. Die Eigenschaften wie Härte, Elastizität und Beständigkeit lassen sich durch die Wahl der Ausgangskomponenten gezielt steuern, wobei die genaue Formulierung von kommerziell erwärblichen Polyurethanen häufig unklar ist.
in scheme: Konservierungs- und Restaurierungsfachthesaurus für archäologische Kulturgüter
alt label: PU
  type: Label
  rank: preferred
alt label: PUR
  type: Label
  rank: normal
pref label: Polyurethan
  type: Label
  rank: preferred

natürliches Polymer
type: Concept
notation: AG2965
created: 2026-01-30
issued: 2026-01-30
modified: 2026-02-04
publisher: Leibniz-Zentrum für Archäologie (LEIZA)
alternative label: Naturharz
broader: [Adhäsivstoff]
broader transitive: [Adhäsivstoff]
broader transitive: Konservierungs- und Restaurierungsmaterialien
broader transitive: Maßnahme
definition: Oberbegriff für Polymere, die aus natürlichen Quellen stammen, leicht bis garnicht synthetisch modifiziert wurden und vielseitig einsetzbar sind. Diese Stoffe wurden vor allem in den Anfängen der Restaurierungsgeschichte, bevor synthetische Polymere in breiter Bandbreite zur Verfügung standen, häufig zum Kleben und Stabilisieren von Objekten eingesetzt. In der modernen Restaurierung spielen sie eher eine untergeordnete Rollen, finden jedoch nach wie vor vereinzelt Verwendung.
definition:
  literal form: Oberbegriff für Polymere, die aus natürlichen Quellen stammen, leicht bis garnicht synthetisch modifiziert wurden und vielseitig einsetzbar sind. Diese Stoffe wurden vor allem in den Anfängen der Restaurierungsgeschichte, bevor synthetische Polymere in breiter Bandbreite zur Verfügung standen, häufig zum Kleben und Stabilisieren von Objekten eingesetzt. In der modernen Restaurierung spielen sie eher eine untergeordnete Rollen, finden jedoch nach wie vor vereinzelt Verwendung.
in scheme: Konservierungs- und Restaurierungsfachthesaurus für archäologische Kulturgüter
alt label: Naturharz
  type: Label
  rank: preferred
pref label: natürliches Polymer
  type: Label
  rank: preferred
narrower: Schellack

Schellack
type: Concept
notation: C176FC
created: 2026-01-30
issued: 2026-01-30
modified: 2026-02-04
publisher: Leibniz-Zentrum für Archäologie (LEIZA)
broader: natürliches Polymer
broader transitive: [Adhäsivstoff]
broader transitive: Konservierungs- und Restaurierungsmaterialien
broader transitive: Maßnahme
broader transitive: natürliches Polymer
definition: Ausscheidungssekret der Lackschildlaus, welcher in Alkohol gelöst zu einer streichbaren Konsistenz verarbeitet werden kann. Nach der Verflüchtigung des Alkohols trocknet Shellack zu einer dicken, dunkelbraunen Schicht die im Laufe der Zeit durch Alterungsprozesse (cross-linking) zu einer praktisch unlöslichen Masse polymerisiert. Aus chemischer Sicht handelt es sich bei Shellack um ein Polyester aus den Hauptbestandteilen Aleursäure, Aldehyde und andere Carboxylsäuren.
definition:
  literal form: Ausscheidungssekret der Lackschildlaus, welcher in Alkohol gelöst zu einer streichbaren Konsistenz verarbeitet werden kann. Nach der Verflüchtigung des Alkohols trocknet Shellack zu einer dicken, dunkelbraunen Schicht die im Laufe der Zeit durch Alterungsprozesse (cross-linking) zu einer praktisch unlöslichen Masse polymerisiert. Aus chemischer Sicht handelt es sich bei Shellack um ein Polyester aus den Hauptbestandteilen Aleursäure, Aldehyde und andere Carboxylsäuren.
in scheme: Konservierungs- und Restaurierungsfachthesaurus für archäologische Kulturgüter
pref label: Schellack
  type: Label
  rank: preferred
narrower: Mastix
narrower: Stärkeleim
narrower: Dextrinleim
narrower: Cellulose
narrower: Dammarharz
narrower: Gummi arabicum
narrower: Kanadabalsam
narrower: Proteinleim

Mastix
type: Concept
notation: B2F4F2
preferred label: mastic @en
created: 2026-01-30
issued: 2026-01-30
modified: 2026-02-04
publisher: Leibniz-Zentrum für Archäologie (LEIZA)
broader: Schellack
broader transitive: Konservierungs- und Restaurierungsmaterialien
broader transitive: Maßnahme
broader transitive: natürliches Polymer
broader transitive: Schellack
broader transitive: [Adhäsivstoff]
definition: natürliches Polymer, das aus dem hauptsächlich auf den griechischen Inseln vorkommenden Mastixbaum gewonnen wird. In der Konservierung und Restaurierung wird Mastix, gelöst in Terpentinöl, insbesondere in der Gemälderestaurierung verwendet. Es dient als Bestandteil von Bindemitteln und Firnissen, da es eine glänzende, klare Schicht bildet, die jedoch im Laufe der Alterung vergilbt.
definition:
  literal form: natürliches Polymer, das aus dem hauptsächlich auf den griechischen Inseln vorkommenden Mastixbaum gewonnen wird. In der Konservierung und Restaurierung wird Mastix, gelöst in Terpentinöl, insbesondere in der Gemälderestaurierung verwendet. Es dient als Bestandteil von Bindemitteln und Firnissen, da es eine glänzende, klare Schicht bildet, die jedoch im Laufe der Alterung vergilbt.
in scheme: Konservierungs- und Restaurierungsfachthesaurus für archäologische Kulturgüter
pref label: Mastix
  type: Label
  rank: preferred
pref label: mastic
  type: Label
  rank: normal

Stärkeleim
type: Concept
notation: BA71DA
created: 2026-01-30
issued: 2026-01-30
modified: 2026-02-04
publisher: Leibniz-Zentrum für Archäologie (LEIZA)
alternative label: Stärkeklebstoff
broader: Schellack
broader transitive: [Adhäsivstoff]
broader transitive: Konservierungs- und Restaurierungsmaterialien
broader transitive: Maßnahme
broader transitive: natürliches Polymer
broader transitive: Schellack
definition: natürlicher Klebstoff, hergestellt durch die Gelatinierung von Stärke aus unterschiedlichen Pflanzen. Mit Wasser angerührte Stärke bildet einen milch weißen Leim mit guter Klebekraft, der je nach gewünschter Anwendung zu unterschiedlichen Konsistenzen verarbeitet werden kann. Stärkeleim war ein häufig verwendeter Klebstoff in der Restaurierungsgeschichte und wird heute teilweiße noch in der Papierverabeitung und Buchbinderei eingesetzt.
definition:
  literal form: natürlicher Klebstoff, hergestellt durch die Gelatinierung von Stärke aus unterschiedlichen Pflanzen. Mit Wasser angerührte Stärke bildet einen milch weißen Leim mit guter Klebekraft, der je nach gewünschter Anwendung zu unterschiedlichen Konsistenzen verarbeitet werden kann. Stärkeleim war ein häufig verwendeter Klebstoff in der Restaurierungsgeschichte und wird heute teilweiße noch in der Papierverabeitung und Buchbinderei eingesetzt.
in scheme: Konservierungs- und Restaurierungsfachthesaurus für archäologische Kulturgüter
alt label: Stärkeklebstoff
  type: Label
  rank: preferred
pref label: Stärkeleim
  type: Label
  rank: preferred

Dextrinleim
type: Concept
notation: C143C4
preferred label: dextrine @en
created: 2026-01-30
issued: 2026-01-30
modified: 2026-02-04
publisher: Leibniz-Zentrum für Archäologie (LEIZA)
alternative label: Dextrin
broader: Schellack
broader transitive: [Adhäsivstoff]
broader transitive: Konservierungs- und Restaurierungsmaterialien
broader transitive: Maßnahme
broader transitive: natürliches Polymer
broader transitive: Schellack
definition: natürlicher Klebstoff, der durch die gezielte Modifizierung von Stärke, zum Teil unter geringfügiger Zugabe von weiteren Chemikalien, hergestellt wird. In der Konservierung und Restaurierung wurde es früher für die Klebung von Gläsern und Papier, als Klebstoff für Etiketten sowie als Bindemedium für Farben verwendet. Allerdings zeigt Dixtrinleim, wie viele andere natürliche Polymerleime, aufgrund der organischen Natur eine hohe Anfälligkeit für mikrobiellen Befall und eine starke Hygroskopizität, was zu Quellungen und mechanischer Spannung führen kann.
definition:
  literal form: natürlicher Klebstoff, der durch die gezielte Modifizierung von Stärke, zum Teil unter geringfügiger Zugabe von weiteren Chemikalien, hergestellt wird. In der Konservierung und Restaurierung wurde es früher für die Klebung von Gläsern und Papier, als Klebstoff für Etiketten sowie als Bindemedium für Farben verwendet. Allerdings zeigt Dixtrinleim, wie viele andere natürliche Polymerleime, aufgrund der organischen Natur eine hohe Anfälligkeit für mikrobiellen Befall und eine starke Hygroskopizität, was zu Quellungen und mechanischer Spannung führen kann.
in scheme: Konservierungs- und Restaurierungsfachthesaurus für archäologische Kulturgüter
alt label: Dextrin
  type: Label
  rank: preferred
pref label: Dextrinleim
  type: Label
  rank: preferred
pref label: dextrine
  type: Label
  rank: normal

Cellulose
type: Concept
notation: C4AG61
created: 2026-01-30
issued: 2026-01-30
modified: 2026-02-04
publisher: Leibniz-Zentrum für Archäologie (LEIZA)
broader: Schellack
broader transitive: [Adhäsivstoff]
broader transitive: Konservierungs- und Restaurierungsmaterialien
broader transitive: Maßnahme
broader transitive: natürliches Polymer
broader transitive: Schellack
definition: natürliches Polymer aus linearen Glycosemonomeren, dessen Fasern häufig zur Verstärkung von Klebstoffen zugesetzt werden.
in scheme: Konservierungs- und Restaurierungsfachthesaurus für archäologische Kulturgüter
pref label: Cellulose
  type: Label
  rank: preferred

Dammarharz
type: Concept
notation: D769C3
preferred label: dammar @en
created: 2026-01-30
issued: 2026-01-30
modified: 2026-02-04
publisher: Leibniz-Zentrum für Archäologie (LEIZA)
broader: Schellack
broader transitive: Konservierungs- und Restaurierungsmaterialien
broader transitive: Maßnahme
broader transitive: natürliches Polymer
broader transitive: Schellack
broader transitive: [Adhäsivstoff]
definition: helles, gelbliches, leicht splitterndes Naturharz, das aus Südostasien stammt und aus den Harzen verschiedener Bäume der Familie der Diptocarpaceae gewonnen wird. Es beginnt bei 90°C weich zu werden, schmilzt bei 180°C und zeichnet sich durch seine Transparenz und gute Löslichkeit in Terpentinöl, Chloroform und anderen organischen Lösungsmitteln aus. In der Konservierung und Restaurierung wird Dammarharz traditionell für die Herstellung von hellen, klaren Schlussfirnissen und als Zusatz in Malmitteln verwendet, da es leicht löslich, reversibel und für die Tempera- und Ölmalerei geeignet ist.
definition:
  literal form: helles, gelbliches, leicht splitterndes Naturharz, das aus Südostasien stammt und aus den Harzen verschiedener Bäume der Familie der Diptocarpaceae gewonnen wird. Es beginnt bei 90°C weich zu werden, schmilzt bei 180°C und zeichnet sich durch seine Transparenz und gute Löslichkeit in Terpentinöl, Chloroform und anderen organischen Lösungsmitteln aus. In der Konservierung und Restaurierung wird Dammarharz traditionell für die Herstellung von hellen, klaren Schlussfirnissen und als Zusatz in Malmitteln verwendet, da es leicht löslich, reversibel und für die Tempera- und Ölmalerei geeignet ist.
in scheme: Konservierungs- und Restaurierungsfachthesaurus für archäologische Kulturgüter
pref label: Dammarharz
  type: Label
  rank: preferred
pref label: dammar
  type: Label
  rank: normal

Gummi arabicum
type: Concept
notation: G379BF
created: 2026-01-30
issued: 2026-01-30
modified: 2026-02-04
publisher: Leibniz-Zentrum für Archäologie (LEIZA)
broader: Schellack
broader transitive: Konservierungs- und Restaurierungsmaterialien
broader transitive: Maßnahme
broader transitive: natürliches Polymer
broader transitive: Schellack
broader transitive: [Adhäsivstoff]
definition: natürlicher Pflanzenleim, der aus dem Harz bestimmter Akazienbäume gewonnen wird. Er wird in Form gelber bis farbloser Tropfen oder Brocken verkauft und lässt sich in Wasser zu einem klaren, klebrigen Leim lösen.
definition:
  literal form: natürlicher Pflanzenleim, der aus dem Harz bestimmter Akazienbäume gewonnen wird. Er wird in Form gelber bis farbloser Tropfen oder Brocken verkauft und lässt sich in Wasser zu einem klaren, klebrigen Leim lösen.
in scheme: Konservierungs- und Restaurierungsfachthesaurus für archäologische Kulturgüter
pref label: Gummi arabicum
  type: Label
  rank: preferred

Kanadabalsam
type: Concept
notation: GC7994
preferred label: canada balsam @en
created: 2026-01-30
issued: 2026-01-30
modified: 2026-02-04
publisher: Leibniz-Zentrum für Archäologie (LEIZA)
broader: Schellack
broader transitive: Konservierungs- und Restaurierungsmaterialien
broader transitive: Maßnahme
broader transitive: natürliches Polymer
broader transitive: Schellack
broader transitive: [Adhäsivstoff]
definition: klebriger und dickflüssiger Naturbalsam, der aus Harzausscheidungen kanadischer Nadelbäume, insbesondere der Tanne (Abies balsamea), gewonnen wird. Frisch ist er farblos bis leicht gelblich, wird jedoch mit der Zeit dunkler und härtet zu einem transparenten, hartlackähnlichen Material aus. Kanadabalsam ist gut löslich in organischen Lösungsmitteln wie Benzol, Xylol oder Terpentinöl und findet Anwendung in der Mikroskopie zum Einschließen von Präparaten. In der Konservierung und Restaurierung wurde es früher aufgrund seiner farblos, klaren Filmbildung zum Teil für die Klebung von Glas und Keramik verwendet.
definition:
  literal form: klebriger und dickflüssiger Naturbalsam, der aus Harzausscheidungen kanadischer Nadelbäume, insbesondere der Tanne (Abies balsamea), gewonnen wird. Frisch ist er farblos bis leicht gelblich, wird jedoch mit der Zeit dunkler und härtet zu einem transparenten, hartlackähnlichen Material aus. Kanadabalsam ist gut löslich in organischen Lösungsmitteln wie Benzol, Xylol oder Terpentinöl und findet Anwendung in der Mikroskopie zum Einschließen von Präparaten. In der Konservierung und Restaurierung wurde es früher aufgrund seiner farblos, klaren Filmbildung zum Teil für die Klebung von Glas und Keramik verwendet.
in scheme: Konservierungs- und Restaurierungsfachthesaurus für archäologische Kulturgüter
pref label: Kanadabalsam
  type: Label
  rank: preferred
pref label: canada balsam
  type: Label
  rank: normal
alternative label: Canadabalsam
alt label: Canadabalsam
  type: Label
  rank: preferred

Proteinleim
type: Concept
notation: GD86C1
created: 2026-01-30
issued: 2026-01-30
modified: 2026-02-04
publisher: Leibniz-Zentrum für Archäologie (LEIZA)
broader: Schellack
broader transitive: [Adhäsivstoff]
broader transitive: Konservierungs- und Restaurierungsmaterialien
broader transitive: Maßnahme
broader transitive: natürliches Polymer
broader transitive: Schellack
definition: natürliches Produkt, bei denen die haftenden Eigenschaften der wiederkehrenden -NH-CO-Bindungen zur Verwendung als Klebstoff/Leim genutzt werden. Das Protein kann dabei aus verschiedenen Quellen und unter unterschiedliche Verfahren gewonnen werden.
definition:
  literal form: natürliches Produkt, bei denen die haftenden Eigenschaften der wiederkehrenden -NH-CO-Bindungen zur Verwendung als Klebstoff/Leim genutzt werden. Das Protein kann dabei aus verschiedenen Quellen und unter unterschiedliche Verfahren gewonnen werden.
in scheme: Konservierungs- und Restaurierungsfachthesaurus für archäologische Kulturgüter
pref label: Proteinleim
  type: Label
  rank: preferred
narrower: Kaseinleim
narrower: Glutinleim

Palatal® P 4-01
type: Concept
notation: D39264
created: 2026-01-30
issued: 2026-01-30
modified: 2026-02-04
publisher: Leibniz-Zentrum für Archäologie (LEIZA)
broader: Polyesterharz
broader transitive: synthetisches Polymer
broader transitive: [Adhäsivstoff]
broader transitive: Konservierungs- und Restaurierungsmaterialien
broader transitive: Maßnahme
broader transitive: Polyesterharz
definition: Palatal® P 4-01 der Firma AOC ist ein ungesättigtes Polyesterharz, gelöst in Stryol. Es wird durch die Zugabe eines Katalysator (Butanox) und Kobaltbeschleuniger vernetzt
in scheme: Konservierungs- und Restaurierungsfachthesaurus für archäologische Kulturgüter
pref label: Palatal® P 4-01
  type: Label
  rank: preferred

Kaseinleim
type: Concept
notation: F5BDAB
preferred label: casein @en
created: 2026-01-30
issued: 2026-01-30
modified: 2026-02-04
publisher: Leibniz-Zentrum für Archäologie (LEIZA)
alternative label: Casein
broader: Proteinleim
broader transitive: [Adhäsivstoff]
broader transitive: Konservierungs- und Restaurierungsmaterialien
broader transitive: Maßnahme
broader transitive: natürliches Polymer
broader transitive: Schellack
broader transitive: Proteinleim
definition: proteinhaltiger Klebstoff, der aus dem natürlichen Milcheiweiß (Kasein) in Verbindung mit einer alkalischen Substanz wie Kalk, Ammoniak oder Borax hergestellt wird. Durch die Modifizierung entsteht ein wasserlöslicher Leim mit guter Klebekraft, der nach dem Aushärten einen wasserbeständigen Film bildet. Wie andere Proteinleime neigt auch Kaseinleim während der Aushärtung zur Schrumpfung. In der modernen Restaurierung wurde Kaseinleim größtenteils durch synthetische Polymere abgelöst.
definition:
  literal form: proteinhaltiger Klebstoff, der aus dem natürlichen Milcheiweiß (Kasein) in Verbindung mit einer alkalischen Substanz wie Kalk, Ammoniak oder Borax hergestellt wird. Durch die Modifizierung entsteht ein wasserlöslicher Leim mit guter Klebekraft, der nach dem Aushärten einen wasserbeständigen Film bildet. Wie andere Proteinleime neigt auch Kaseinleim während der Aushärtung zur Schrumpfung. In der modernen Restaurierung wurde Kaseinleim größtenteils durch synthetische Polymere abgelöst.
in scheme: Konservierungs- und Restaurierungsfachthesaurus für archäologische Kulturgüter
alt label: Casein
  type: Label
  rank: preferred
pref label: Kaseinleim
  type: Label
  rank: preferred
pref label: casein
  type: Label
  rank: normal

Glutinleim
type: Concept
notation: FA91B1
preferred label: animal glue @en
created: 2026-01-30
issued: 2026-01-30
modified: 2026-02-04
publisher: Leibniz-Zentrum für Archäologie (LEIZA)
alternative label: Kollagen
alternative label: Tierleim
broader: Proteinleim
broader transitive: [Adhäsivstoff]
broader transitive: Konservierungs- und Restaurierungsmaterialien
broader transitive: Maßnahme
broader transitive: natürliches Polymer
broader transitive: Schellack
broader transitive: Proteinleim
definition: natürlicher Klebstoff, welcher durch die Verarbeitung von kollagenhaltigen Tierprodukten wie Haut, Knochen und Bindegewebe gewonnen wird. Je nach gewälter Kollagenquelle und Herstellungsart des Leims ergeben sich unterschiedliche Viskositäten, Festigkeiten und generelle mechanische Eigenschaften. Glutinleime werden in Form von erwärmten Lösungen oder Gelen aufgetragen und trocknen durch Verdunstung des Wassers zu einem mehr oder weniger festen Film, wobei eine nicht unerhebliche Schrumpfung eintritt. Sie sind in der Regel gut reversibel und können mit Hilfe von warmem Wasser entfernt werden.
definition:
  literal form: natürlicher Klebstoff, welcher durch die Verarbeitung von kollagenhaltigen Tierprodukten wie Haut, Knochen und Bindegewebe gewonnen wird. Je nach gewälter Kollagenquelle und Herstellungsart des Leims ergeben sich unterschiedliche Viskositäten, Festigkeiten und generelle mechanische Eigenschaften. Glutinleime werden in Form von erwärmten Lösungen oder Gelen aufgetragen und trocknen durch Verdunstung des Wassers zu einem mehr oder weniger festen Film, wobei eine nicht unerhebliche Schrumpfung eintritt. Sie sind in der Regel gut reversibel und können mit Hilfe von warmem Wasser entfernt werden.
in scheme: Konservierungs- und Restaurierungsfachthesaurus für archäologische Kulturgüter
alt label: Kollagen
  type: Label
  rank: preferred
alt label: Tierleim
  type: Label
  rank: normal
pref label: Glutinleim
  type: Label
  rank: preferred
pref label: animal glue
  type: Label
  rank: normal

Silikonkautschuk
type: Concept
notation: A44BG6
preferred label: silicone rubber @en
created: 2026-01-30
issued: 2026-01-30
modified: 2026-02-04
publisher: Leibniz-Zentrum für Archäologie (LEIZA)
broader: [Abform- und Ergänzungsmaterial]
broader transitive: [Abform- und Ergänzungsmaterial]
broader transitive: Konservierungs- und Restaurierungsmaterialien
broader transitive: Maßnahme
definition: synthetischer Werkstoff auf Basis langkettiger Polysiloxane und diverser Füllstoffe (z.B. pyrogene Kieselsäure, Silkonöl, etc.), der durch Zugabe eines Vernetzers und ggfs. Katalysators zu elastischem Silikongummi vulkanisiert. Es lassen sich je nach Vulkanisationsart und Eigenschaften des Basispolymers unterschiedliche Kautschukklassen sowie Heiß- und Kaltvulkanisation unterscheiden. In der Konservierung und Restaurierung werden meist bei Raumtemperatur vernetzende, zwei-komponentige Systeme (RTV-2) für die Abformung und Herstellung von Negativformen verwendet. Hervorzuhebende Eigenschaften der Silikonkautschucke sind die hohe Abbildungsgenauigkeit, die Langzeitstabilität und die selbsttrennende Wirkung gegenüber den meisten Werkstoffen.
definition:
  literal form: synthetischer Werkstoff auf Basis langkettiger Polysiloxane und diverser Füllstoffe (z.B. pyrogene Kieselsäure, Silkonöl, etc.), der durch Zugabe eines Vernetzers und ggfs. Katalysators zu elastischem Silikongummi vulkanisiert. Es lassen sich je nach Vulkanisationsart und Eigenschaften des Basispolymers unterschiedliche Kautschukklassen sowie Heiß- und Kaltvulkanisation unterscheiden. In der Konservierung und Restaurierung werden meist bei Raumtemperatur vernetzende, zwei-komponentige Systeme (RTV-2) für die Abformung und Herstellung von Negativformen verwendet. Hervorzuhebende Eigenschaften der Silikonkautschucke sind die hohe Abbildungsgenauigkeit, die Langzeitstabilität und die selbsttrennende Wirkung gegenüber den meisten Werkstoffen.
in scheme: Konservierungs- und Restaurierungsfachthesaurus für archäologische Kulturgüter
narrower: additionsvernetzender Silikonkautschuk
narrower: kondensationsvernetzender Silikonkautschuk
pref label: Silikonkautschuk
  type: Label
  rank: preferred
pref label: silicone rubber
  type: Label
  rank: normal

[Abform- und Ergänzungsmaterial]
type: Concept
type: NonIndexingConcept
type: GuideTerm
notation: FBFFF5
created: 2026-01-30
issued: 2026-01-30
modified: 2026-02-04
publisher: Leibniz-Zentrum für Archäologie (LEIZA)
alternative label: Abformmaterial
alternative label: Ergänzungsmaterial
broader: Konservierungs- und Restaurierungsmaterialien
broader transitive: Konservierungs- und Restaurierungsmaterialien
broader transitive: Maßnahme
definition: strukturierender Oberbegriff für eine Reihe von Materialien, die sowohl für die Abformung von Objekten als auch für die Ergänzung von fehlenden Teilen verwendet werden.
in scheme: Konservierungs- und Restaurierungsfachthesaurus für archäologische Kulturgüter
narrower: Silikonkautschuk
narrower: Modelliermasse
narrower: Naturkautschuk
narrower: Fett
alt label: Abformmaterial
  type: Label
  rank: preferred
alt label: Ergänzungsmaterial
  type: Label
  rank: normal
pref label: [Abform- und Ergänzungsmaterial]
  type: Label
  rank: preferred

additionsvernetzender Silikonkautschuk
type: Concept
notation: DA841D
preferred label: Addition-curing silicone rubber @en
created: 2026-01-30
issued: 2026-01-30
modified: 2026-02-04
publisher: Leibniz-Zentrum für Archäologie (LEIZA)
broader: Silikonkautschuk
broader transitive: Silikonkautschuk
broader transitive: [Abform- und Ergänzungsmaterial]
broader transitive: Konservierungs- und Restaurierungsmaterialien
broader transitive: Maßnahme
definition: zweikomponentiger Silikonkautschuk, der durch eine Additionsreaktion mittels Platinkatalysator bei Raumtemperatur vernetzt. Charakteristisch sind die nahezu schrumpfungsfreie Aushärtung, hohe Zeichnungsgenauigkeit und chemische Inertheit. Beim Auftragen mehrerer Schichten sollte "Nass in Nass" gearbeitet werden um einen sicheren Verbund zu gewährleisten. Die Verarbeitung kann durch katalysatorhemmende Substanzen, wie Schwefel oder Amine, gestört werden. In der Konservierung und Restaurierung eignet sich additionsvernetzender Silikonkautschuk besonders gut für die Herstellung von Galvanoformen.
definition:
  literal form: zweikomponentiger Silikonkautschuk, der durch eine Additionsreaktion mittels Platinkatalysator bei Raumtemperatur vernetzt. Charakteristisch sind die nahezu schrumpfungsfreie Aushärtung, hohe Zeichnungsgenauigkeit und chemische Inertheit. Beim Auftragen mehrerer Schichten sollte "Nass in Nass" gearbeitet werden um einen sicheren Verbund zu gewährleisten. Die Verarbeitung kann durch katalysatorhemmende Substanzen, wie Schwefel oder Amine, gestört werden. In der Konservierung und Restaurierung eignet sich additionsvernetzender Silikonkautschuk besonders gut für die Herstellung von Galvanoformen.
in scheme: Konservierungs- und Restaurierungsfachthesaurus für archäologische Kulturgüter
narrower: Smooth On Mold Star 30
narrower: Dentalsilikon
narrower: Smooth On Rebound 25
narrower: Nedform Silikon Addition Transparent 25
pref label: additionsvernetzender Silikonkautschuk
  type: Label
  rank: preferred
pref label: Addition-curing silicone rubber
  type: Label
  rank: normal

kondensationsvernetzender Silikonkautschuk
type: Concept
notation: GD9CA3
preferred label: Condensation-curing silicone rubber @en
created: 2026-01-30
issued: 2026-01-30
modified: 2026-02-04
publisher: Leibniz-Zentrum für Archäologie (LEIZA)
broader: Silikonkautschuk
broader transitive: Silikonkautschuk
broader transitive: Konservierungs- und Restaurierungsmaterialien
broader transitive: Maßnahme
broader transitive: [Abform- und Ergänzungsmaterial]
definition: zweikomponenten Silikonkautschuk, der durch eine Polykondensationsreaktion mittels Zinnkatalysatoren vernetzt. In der Konservierung und Restaurierung wird kondensationsvernetzender Silikonkautschuk aufgrund seiner einfachen Verarbeitung, Zeichnungsgenauigkeit und moderaten Kosten für die Abformung von Objekten verwendet. Bei dieser Art von Silikonkautschuk ist ein Auftrag in mehrere Schichten, auch nach Polymerisation der Vorherigen möglich. Während der Vernetzungsreaktion werden Alkohole (typischerweise Ethanol) abgespalten, was zu einem Volumenschwund des Silikonkautschuks führt. Aus diesem Grund weist das Material eine begrenzte Langzeitstabilität auf und kann zur Versprödung neigen. Darüber hinaus können austretende Silikonöle bei porösen Materialien zu Verfärbungen führen.
definition:
  literal form: zweikomponenten Silikonkautschuk, der durch eine Polykondensationsreaktion mittels Zinnkatalysatoren vernetzt. In der Konservierung und Restaurierung wird kondensationsvernetzender Silikonkautschuk aufgrund seiner einfachen Verarbeitung, Zeichnungsgenauigkeit und moderaten Kosten für die Abformung von Objekten verwendet. Bei dieser Art von Silikonkautschuk ist ein Auftrag in mehrere Schichten, auch nach Polymerisation der Vorherigen möglich. Während der Vernetzungsreaktion werden Alkohole (typischerweise Ethanol) abgespalten, was zu einem Volumenschwund des Silikonkautschuks führt. Aus diesem Grund weist das Material eine begrenzte Langzeitstabilität auf und kann zur Versprödung neigen. Darüber hinaus können austretende Silikonöle bei porösen Materialien zu Verfärbungen führen.
in scheme: Konservierungs- und Restaurierungsfachthesaurus für archäologische Kulturgüter
pref label: kondensationsvernetzender Silikonkautschuk
  type: Label
  rank: preferred
pref label: Condensation-curing silicone rubber
  type: Label
  rank: normal
narrower: Elastosil M 4503
narrower: Bluesil RTV 3325
narrower: Silikon Kondensation 20 A+B
narrower: Elastosil M3500
narrower: Elastosil M4514

Smooth On Mold Star 30
type: Concept
notation: AF6D7D
created: 2026-01-30
issued: 2026-01-30
modified: 2026-02-04
publisher: Leibniz-Zentrum für Archäologie (LEIZA)
broader: additionsvernetzender Silikonkautschuk
broader transitive: Silikonkautschuk
broader transitive: [Abform- und Ergänzungsmaterial]
broader transitive: Konservierungs- und Restaurierungsmaterialien
broader transitive: Maßnahme
broader transitive: additionsvernetzender Silikonkautschuk
definition: Produktname eines additionsvernetzenden Silikonkautschuks der Firma Smooth-On. Laut Herstellerangaben ist dieses Produkt aufgrund seiner niedrigen Viskosität besonders Gießfähig und polymerisiert nahezu ohne Schrumpfung zu einem elastischem, stabilen Kautschuk. Durch die Hitzebeständigkeit bis ca. 230°C ist auch das eingießen von niedrigschmelzenden Metallen direkt in die Silikonform möglich. Die Topfzeit beträgt bei Raumtemperatur ca. 45 Min, die Entformzeit ca. 6 Stunden.
definition:
  literal form: Produktname eines additionsvernetzenden Silikonkautschuks der Firma Smooth-On. Laut Herstellerangaben ist dieses Produkt aufgrund seiner niedrigen Viskosität besonders Gießfähig und polymerisiert nahezu ohne Schrumpfung zu einem elastischem, stabilen Kautschuk. Durch die Hitzebeständigkeit bis ca. 230°C ist auch das eingießen von niedrigschmelzenden Metallen direkt in die Silikonform möglich. Die Topfzeit beträgt bei Raumtemperatur ca. 45 Min, die Entformzeit ca. 6 Stunden.
in scheme: Konservierungs- und Restaurierungsfachthesaurus für archäologische Kulturgüter
pref label: Smooth On Mold Star 30
  type: Label
  rank: preferred

Dentalsilikon
type: Concept
notation: C5G53A
created: 2026-01-30
issued: 2026-01-30
modified: 2026-02-04
publisher: Leibniz-Zentrum für Archäologie (LEIZA)
broader: additionsvernetzender Silikonkautschuk
broader transitive: Silikonkautschuk
broader transitive: [Abform- und Ergänzungsmaterial]
broader transitive: Konservierungs- und Restaurierungsmaterialien
broader transitive: Maßnahme
broader transitive: additionsvernetzender Silikonkautschuk
definition: additionsvernetzender Silikonkautschuk auf Vinylpolysiloxanbasis aus dem Zahnmedizinbereich, speziell entwickelt für die dentale Präzisionsabformung. Charakteristisch ist eine schnelle, zeitlich definierte Abbindezeit und leichte Verarbeitung, wodurch es im Bereich der Konservierung und Restaurierung besonders für eine zeitsparende Abformung kleiner Teilbereiche eines Objektes, z.B. für die Manschettenherstellung zur Ergänzung von Fehlstellen, geeignet ist.
definition:
  literal form: additionsvernetzender Silikonkautschuk auf Vinylpolysiloxanbasis aus dem Zahnmedizinbereich, speziell entwickelt für die dentale Präzisionsabformung. Charakteristisch ist eine schnelle, zeitlich definierte Abbindezeit und leichte Verarbeitung, wodurch es im Bereich der Konservierung und Restaurierung besonders für eine zeitsparende Abformung kleiner Teilbereiche eines Objektes, z.B. für die Manschettenherstellung zur Ergänzung von Fehlstellen, geeignet ist.
in scheme: Konservierungs- und Restaurierungsfachthesaurus für archäologische Kulturgüter
pref label: Dentalsilikon
  type: Label
  rank: preferred

Smooth On Rebound 25
type: Concept
notation: C76568
created: 2026-01-30
issued: 2026-01-30
modified: 2026-02-04
publisher: Leibniz-Zentrum für Archäologie (LEIZA)
broader: additionsvernetzender Silikonkautschuk
broader transitive: Silikonkautschuk
broader transitive: [Abform- und Ergänzungsmaterial]
broader transitive: Konservierungs- und Restaurierungsmaterialien
broader transitive: Maßnahme
broader transitive: additionsvernetzender Silikonkautschuk
definition: Produktname eines additionsvernetzenden Silikonkautschuks der Firma Smooth-On. Laut Herstellerangaben zeichnet sich das Produkt durch seine einfache Anwendung, die hohe Reißfestigkeit und eine vernachlässigbare Schrumpfung besonders für die Herstellung detailreicher Formen aus. Durch die selbstverdickende Eigenschaften kann das Produkt auch auf vertikale Oberflächen tropffrei aufgetragen werden. Die Topfzeit beträgt bei Raumtemperatur ca. 20 Min und die Entformzeit ca. 6 Stunden.
definition:
  literal form: Produktname eines additionsvernetzenden Silikonkautschuks der Firma Smooth-On. Laut Herstellerangaben zeichnet sich das Produkt durch seine einfache Anwendung, die hohe Reißfestigkeit und eine vernachlässigbare Schrumpfung besonders für die Herstellung detailreicher Formen aus. Durch die selbstverdickende Eigenschaften kann das Produkt auch auf vertikale Oberflächen tropffrei aufgetragen werden. Die Topfzeit beträgt bei Raumtemperatur ca. 20 Min und die Entformzeit ca. 6 Stunden.
in scheme: Konservierungs- und Restaurierungsfachthesaurus für archäologische Kulturgüter
pref label: Smooth On Rebound 25
  type: Label
  rank: preferred

Nedform Silikon Addition Transparent 25
type: Concept
notation: GCDG5D
created: 2026-01-30
issued: 2026-01-30
modified: 2026-02-04
publisher: Leibniz-Zentrum für Archäologie (LEIZA)
broader: additionsvernetzender Silikonkautschuk
broader transitive: Silikonkautschuk
broader transitive: [Abform- und Ergänzungsmaterial]
broader transitive: Konservierungs- und Restaurierungsmaterialien
broader transitive: Maßnahme
broader transitive: additionsvernetzender Silikonkautschuk
in scheme: Konservierungs- und Restaurierungsfachthesaurus für archäologische Kulturgüter
pref label: Nedform Silikon Addition Transparent 25
  type: Label
  rank: preferred

Elastosil M 4503
type: Concept
notation: A6CA1C
created: 2026-01-30
issued: 2026-01-30
modified: 2026-02-04
publisher: Leibniz-Zentrum für Archäologie (LEIZA)
broader: kondensationsvernetzender Silikonkautschuk
broader transitive: Silikonkautschuk
broader transitive: kondensationsvernetzender Silikonkautschuk
broader transitive: Konservierungs- und Restaurierungsmaterialien
broader transitive: Maßnahme
broader transitive: [Abform- und Ergänzungsmaterial]
definition: Produktname eines kondensationsvernetzenden Silikonkautschuks der Firma Wacker. Laut Herstellerangaben zeichnet sich das Produkt vor allem durch eine gute Fließfähigkeit, hohe Ein- und Weiterreißfestigkeit, große Dehnbarkeit und Elastizität sowie eine ausgeprägte Langzeitstabilität und Beständigkeit gegenüber Gießharzen aus. Das Produkt hat eine Topfzeit von 75 min (bei Raumtemperatur) und einen Schrumpfrichtwert von 0,5%.
definition:
  literal form: Produktname eines kondensationsvernetzenden Silikonkautschuks der Firma Wacker. Laut Herstellerangaben zeichnet sich das Produkt vor allem durch eine gute Fließfähigkeit, hohe Ein- und Weiterreißfestigkeit, große Dehnbarkeit und Elastizität sowie eine ausgeprägte Langzeitstabilität und Beständigkeit gegenüber Gießharzen aus. Das Produkt hat eine Topfzeit von 75 min (bei Raumtemperatur) und einen Schrumpfrichtwert von 0,5%.
in scheme: Konservierungs- und Restaurierungsfachthesaurus für archäologische Kulturgüter
pref label: Elastosil M 4503
  type: Label
  rank: preferred

Bluesil RTV 3325
type: Concept
notation: A8GFCC
created: 2026-01-30
issued: 2026-01-30
modified: 2026-02-04
publisher: Leibniz-Zentrum für Archäologie (LEIZA)
broader: kondensationsvernetzender Silikonkautschuk
broader transitive: Silikonkautschuk
broader transitive: kondensationsvernetzender Silikonkautschuk
broader transitive: Konservierungs- und Restaurierungsmaterialien
broader transitive: Maßnahme
broader transitive: [Abform- und Ergänzungsmaterial]
definition: Produktname eines kondensationsvernetzenden Silikonkautschuks der Firma Elkem Silicones (früher: Bluestar Silicones), dass in der Vergangenheit unter der Bezeichnung "Rhodorsil RTV 3325" vertrieben wurde,. Laut Herstellerangabe zeichnet sich das Produkt durch eine gute Fließfähigkeit, hohe Reißfestigkeit, ausgezeichnete Wiedergabetreue der Oberflächendetails sowie nicht haftende Eigenschaften und hohe Elastizität, die eine leichte Abnahem der Form von dem Originale ermöglichen, aus. Es können eine Reihe verschiedener Härter mit diesem Silikonkautschuk verwendet werden, die die Topfzeit (zwischen 20 - 150 min) sowie die Entformzeit (6 - 24 h) beeinflussen. Die Lineare Schrumpfung wird mit <0,7% angegeben.
definition:
  literal form: Produktname eines kondensationsvernetzenden Silikonkautschuks der Firma Elkem Silicones (früher: Bluestar Silicones), dass in der Vergangenheit unter der Bezeichnung "Rhodorsil RTV 3325" vertrieben wurde,. Laut Herstellerangabe zeichnet sich das Produkt durch eine gute Fließfähigkeit, hohe Reißfestigkeit, ausgezeichnete Wiedergabetreue der Oberflächendetails sowie nicht haftende Eigenschaften und hohe Elastizität, die eine leichte Abnahem der Form von dem Originale ermöglichen, aus. Es können eine Reihe verschiedener Härter mit diesem Silikonkautschuk verwendet werden, die die Topfzeit (zwischen 20 - 150 min) sowie die Entformzeit (6 - 24 h) beeinflussen. Die Lineare Schrumpfung wird mit <0,7% angegeben.
in scheme: Konservierungs- und Restaurierungsfachthesaurus für archäologische Kulturgüter
pref label: Bluesil RTV 3325
  type: Label
  rank: preferred
alternative label: Rhodorsil RTV 3325
alt label: Rhodorsil RTV 3325
  type: Label
  rank: preferred

Silikon Kondensation 20 A+B
type: Concept
notation: AC1C85
created: 2026-01-30
issued: 2026-01-30
modified: 2026-02-04
publisher: Leibniz-Zentrum für Archäologie (LEIZA)
broader: kondensationsvernetzender Silikonkautschuk
broader transitive: Silikonkautschuk
broader transitive: kondensationsvernetzender Silikonkautschuk
broader transitive: Konservierungs- und Restaurierungsmaterialien
broader transitive: Maßnahme
broader transitive: [Abform- und Ergänzungsmaterial]
definition: Produktname eines kondensationsvernetzenden Silikonkautschuks der Firma Nedform, welches auch unter dem Namen Nedsil 20 TVL vertrieben wird. Laut Herstellerangabe zeichnet sich das Produkt durch eine gute Fließfähigkeit, feine Detailgenauigkeit und eine sehr hohe Reisfestigkeit aus. Die Topfzeit bei Raumtemperatur wird mit 100 min, die Entformzeit mit 16-20 h angegeben, wobei beides maßgeblich von Mischungsverhältnis und Luftfeuchtigkeit abhängt.
definition:
  literal form: Produktname eines kondensationsvernetzenden Silikonkautschuks der Firma Nedform, welches auch unter dem Namen Nedsil 20 TVL vertrieben wird. Laut Herstellerangabe zeichnet sich das Produkt durch eine gute Fließfähigkeit, feine Detailgenauigkeit und eine sehr hohe Reisfestigkeit aus. Die Topfzeit bei Raumtemperatur wird mit 100 min, die Entformzeit mit 16-20 h angegeben, wobei beides maßgeblich von Mischungsverhältnis und Luftfeuchtigkeit abhängt.
in scheme: Konservierungs- und Restaurierungsfachthesaurus für archäologische Kulturgüter
pref label: Silikon Kondensation 20 A+B
  type: Label
  rank: preferred
alternative label: Nedsil 20 TLV
alt label: Nedsil 20 TLV
  type: Label
  rank: preferred

Stearin
type: Concept
notation: AF1328
created: 2026-01-30
issued: 2026-01-30
modified: 2026-02-04
publisher: Leibniz-Zentrum für Archäologie (LEIZA)
broader: Fett
broader transitive: Konservierungs- und Restaurierungsmaterialien
broader transitive: Maßnahme
broader transitive: [Abform- und Ergänzungsmaterial]
broader transitive: Fett
definition: weißes bis schwach gelbliches, wasserunlösliches Gemisch aus Glycerinestern der Stearinsäure und Palmitinsäure. Es entsteht bei der Fettspaltung, indem das Fettsäuregemisch durch Auspressen von der flüssigen Ölsäure getrennt wird, und hat einen Schmelzpunkt von etwa 60–70 °C. Stearin wird in der Konservierung und Restaurierung teilweise für das Einfetten von Formteilen im Zuge der Abformung bzw. Herstellung von Kopien verwendet.
definition:
  literal form: weißes bis schwach gelbliches, wasserunlösliches Gemisch aus Glycerinestern der Stearinsäure und Palmitinsäure. Es entsteht bei der Fettspaltung, indem das Fettsäuregemisch durch Auspressen von der flüssigen Ölsäure getrennt wird, und hat einen Schmelzpunkt von etwa 60–70 °C. Stearin wird in der Konservierung und Restaurierung teilweise für das Einfetten von Formteilen im Zuge der Abformung bzw. Herstellung von Kopien verwendet.
in scheme: Konservierungs- und Restaurierungsfachthesaurus für archäologische Kulturgüter
pref label: Stearin
  type: Label
  rank: preferred

Fett
type: Concept
notation: D7A4BC
created: 2026-01-30
issued: 2026-01-30
modified: 2026-02-04
publisher: Leibniz-Zentrum für Archäologie (LEIZA)
broader: [Abform- und Ergänzungsmaterial]
broader transitive: Konservierungs- und Restaurierungsmaterialien
broader transitive: Maßnahme
broader transitive: [Abform- und Ergänzungsmaterial]
definition: bei Raumtemeperatur fester Stoff, der aus einem Gemisch aus Triglyceriden mit Estern von Fettsäuren besteht. In der Restaurierung werden Fette haupstächlich als Schmier- bzw. Trennmittel z.B. bei der Abformung von Objekten verwendet.
definition:
  literal form: bei Raumtemeperatur fester Stoff, der aus einem Gemisch aus Triglyceriden mit Estern von Fettsäuren besteht. In der Restaurierung werden Fette haupstächlich als Schmier- bzw. Trennmittel z.B. bei der Abformung von Objekten verwendet.
in scheme: Konservierungs- und Restaurierungsfachthesaurus für archäologische Kulturgüter
pref label: Fett
  type: Label
  rank: preferred
narrower: Stearin
narrower: Vaseline

Mikrokristallines Wachs
type: Concept
notation: C9AFG9
created: 2026-01-30
issued: 2026-01-30
modified: 2026-02-04
publisher: Leibniz-Zentrum für Archäologie (LEIZA)
broader: Wachs
broader transitive: Konservierungs- und Restaurierungsmaterialien
broader transitive: Maßnahme
broader transitive: [Abform- und Ergänzungsmaterial]
broader transitive: Wachs
broader transitive: Modelliermasse
in scheme: Konservierungs- und Restaurierungsfachthesaurus für archäologische Kulturgüter
pref label: Mikrokristallines Wachs
  type: Label
  rank: preferred
narrower: Cosmoloid H80

Wachs
type: Concept
notation: CB4G84
preferred label: wax @en
created: 2026-01-30
issued: 2026-01-30
modified: 2026-02-04
publisher: Leibniz-Zentrum für Archäologie (LEIZA)
broader: Modelliermasse
broader transitive: Konservierungs- und Restaurierungsmaterialien
broader transitive: Maßnahme
broader transitive: Modelliermasse
broader transitive: [Abform- und Ergänzungsmaterial]
definition: weich, plastisches Material aus unterschiedlichen Stoffgemischen mit niedrigem Schmelzpunkt und guter Adhäsionsfähigkeit. In der Konservierung und Restaurierung wird Wachs unter anderem für die Ergänzung von Fehlstellen, als Abformmaterial bzw. als Manschette oder als Material für das freie Modellieren des fehlenden Teils, verwendet. Darüber hinaus werden modifizierte Wachse als Trennschicht bzw. Absperrschicht zwischen Materialien und als Versiegelung poröser Materialien eingesetzt.
definition:
  literal form: weich, plastisches Material aus unterschiedlichen Stoffgemischen mit niedrigem Schmelzpunkt und guter Adhäsionsfähigkeit. In der Konservierung und Restaurierung wird Wachs unter anderem für die Ergänzung von Fehlstellen, als Abformmaterial bzw. als Manschette oder als Material für das freie Modellieren des fehlenden Teils, verwendet. Darüber hinaus werden modifizierte Wachse als Trennschicht bzw. Absperrschicht zwischen Materialien und als Versiegelung poröser Materialien eingesetzt.
in scheme: Konservierungs- und Restaurierungsfachthesaurus für archäologische Kulturgüter
narrower: Mikrokristallines Wachs
narrower: Bienenwachs
pref label: Wachs
  type: Label
  rank: preferred
pref label: wax
  type: Label
  rank: normal

Modelliermasse
type: Concept
notation: DG8FG3
created: 2026-01-30
issued: 2026-01-30
modified: 2026-02-04
publisher: Leibniz-Zentrum für Archäologie (LEIZA)
broader: [Abform- und Ergänzungsmaterial]
broader transitive: Konservierungs- und Restaurierungsmaterialien
broader transitive: Maßnahme
broader transitive: [Abform- und Ergänzungsmaterial]
definition: Oberbegriff für leicht formbares Material, welches in der Restaurierung hauptsächlich für die Einbettung von Objekten, die Herstellung von Manschetten bzw. Formen und/oder die Erstellung von dreidimensionalen Modellen verwendet wird.
definition:
  literal form: Oberbegriff für leicht formbares Material, welches in der Restaurierung hauptsächlich für die Einbettung von Objekten, die Herstellung von Manschetten bzw. Formen und/oder die Erstellung von dreidimensionalen Modellen verwendet wird.
in scheme: Konservierungs- und Restaurierungsfachthesaurus für archäologische Kulturgüter
narrower: Plastilin
narrower: Ton <Restaurierungsmaterial>
narrower: Wachs
narrower: Gips (Restaurierungsmaterial)
pref label: Modelliermasse
  type: Label
  rank: preferred

Cosmoloid H80
type: Concept
notation: F6344G
created: 2026-01-30
issued: 2026-01-30
modified: 2026-02-04
publisher: Leibniz-Zentrum für Archäologie (LEIZA)
broader: Mikrokristallines Wachs
broader transitive: Modelliermasse
broader transitive: Konservierungs- und Restaurierungsmaterialien
broader transitive: Maßnahme
broader transitive: [Abform- und Ergänzungsmaterial]
broader transitive: Mikrokristallines Wachs
broader transitive: Wachs
definition: mikrokristallines Kohlenwasserstoffwachs, das aus verzweigt-kettigen und naphthenischen Kohlenwasserstoffen besteht und durch katalytische Entfernung von Schwefel aus Paraffinen hergestellt wird. Es hat einen Schmelzpunkt von ca. 85°C, ist nahezu säurefrei und in aliphatischen und aromatischen Kohlenwasserstoffen löslich. In der Konservierung und Restaurierung wird Cosmoloid H80 häufig zur Oberflächenbehandlung und als Korrosionsschutz, insbesondere für Eisenobjekte, eingesetzt.
definition:
  literal form: mikrokristallines Kohlenwasserstoffwachs, das aus verzweigt-kettigen und naphthenischen Kohlenwasserstoffen besteht und durch katalytische Entfernung von Schwefel aus Paraffinen hergestellt wird. Es hat einen Schmelzpunkt von ca. 85°C, ist nahezu säurefrei und in aliphatischen und aromatischen Kohlenwasserstoffen löslich. In der Konservierung und Restaurierung wird Cosmoloid H80 häufig zur Oberflächenbehandlung und als Korrosionsschutz, insbesondere für Eisenobjekte, eingesetzt.
in scheme: Konservierungs- und Restaurierungsfachthesaurus für archäologische Kulturgüter
pref label: Cosmoloid H80
  type: Label
  rank: preferred

Elastosil M3500
type: Concept
notation: C9C7C7
created: 2026-01-30
issued: 2026-01-30
modified: 2026-02-04
publisher: Leibniz-Zentrum für Archäologie (LEIZA)
broader: kondensationsvernetzender Silikonkautschuk
broader transitive: Silikonkautschuk
broader transitive: kondensationsvernetzender Silikonkautschuk
broader transitive: Konservierungs- und Restaurierungsmaterialien
broader transitive: Maßnahme
broader transitive: [Abform- und Ergänzungsmaterial]
definition: Produktname eines standfesten, kondensationsvernetzenden Silikonkautschuke der Firma Wacker, welches in der Vergangenheit am LEIZA für Abformungen verwendet wurde. Das Produkt ist jedoch aktuell nicht mehr verfügbar (Stand 2024).
definition:
  literal form: Produktname eines standfesten, kondensationsvernetzenden Silikonkautschuke der Firma Wacker, welches in der Vergangenheit am LEIZA für Abformungen verwendet wurde. Das Produkt ist jedoch aktuell nicht mehr verfügbar (Stand 2024).
in scheme: Konservierungs- und Restaurierungsfachthesaurus für archäologische Kulturgüter
pref label: Elastosil M3500
  type: Label
  rank: preferred

Vaseline
type: Concept
notation: D81175
created: 2026-01-30
issued: 2026-01-30
modified: 2026-02-04
publisher: Leibniz-Zentrum für Archäologie (LEIZA)
broader: Fett
broader transitive: Konservierungs- und Restaurierungsmaterialien
broader transitive: Maßnahme
broader transitive: [Abform- und Ergänzungsmaterial]
broader transitive: Fett
definition: halbfestes Gemisch aus gesättigten Kohlenwasserstoffen hergestellt aus verschiedenen Paraffinen und Minderalölen. In der Konservierung und Restaurierung wird Vaseline als wasserabweisendes Schutzmittel und temporäres Trennmittel verwendet.
definition:
  literal form: halbfestes Gemisch aus gesättigten Kohlenwasserstoffen hergestellt aus verschiedenen Paraffinen und Minderalölen. In der Konservierung und Restaurierung wird Vaseline als wasserabweisendes Schutzmittel und temporäres Trennmittel verwendet.
in scheme: Konservierungs- und Restaurierungsfachthesaurus für archäologische Kulturgüter
pref label: Vaseline
  type: Label
  rank: preferred

Elastosil M4514
type: Concept
notation: DB5G7D
created: 2026-01-30
issued: 2026-01-30
modified: 2026-02-04
publisher: Leibniz-Zentrum für Archäologie (LEIZA)
broader: kondensationsvernetzender Silikonkautschuk
broader transitive: Silikonkautschuk
broader transitive: kondensationsvernetzender Silikonkautschuk
broader transitive: Konservierungs- und Restaurierungsmaterialien
broader transitive: Maßnahme
broader transitive: [Abform- und Ergänzungsmaterial]
definition: Produktname eines kondensationsvernetzenden Silikonkautschuks der Firma Wacker. Laut Herstellerangaben zeigt dieses Produkt eine besonders gute Beständigkeit gegenüber Polyester- und Polyurethanharzen, auch bei wiederholter Abformungen. Darüber hinaus besitzt es eine sehr gute Fließfähigkeit und Selbstentlüftung sowie eine hohe Dehnbarkeit und Elastizität, wodurch es sehr gut für die Abformung von Objekten mit starker Hinterschneidungen geeignet ist. Die Topfzeit ist, in Abhängigkeit des verwendeten Härters, mit 60-90 min angegeben, der Schrumpfrichtwert liegt bei <0,4 %.
definition:
  literal form: Produktname eines kondensationsvernetzenden Silikonkautschuks der Firma Wacker. Laut Herstellerangaben zeigt dieses Produkt eine besonders gute Beständigkeit gegenüber Polyester- und Polyurethanharzen, auch bei wiederholter Abformungen. Darüber hinaus besitzt es eine sehr gute Fließfähigkeit und Selbstentlüftung sowie eine hohe Dehnbarkeit und Elastizität, wodurch es sehr gut für die Abformung von Objekten mit starker Hinterschneidungen geeignet ist. Die Topfzeit ist, in Abhängigkeit des verwendeten Härters, mit 60-90 min angegeben, der Schrumpfrichtwert liegt bei <0,4 %.
in scheme: Konservierungs- und Restaurierungsfachthesaurus für archäologische Kulturgüter
pref label: Elastosil M4514
  type: Label
  rank: preferred

Plastilin
type: Concept
notation: A2B583
preferred label: plasticine @en
created: 2026-01-30
issued: 2026-01-30
modified: 2026-02-04
publisher: Leibniz-Zentrum für Archäologie (LEIZA)
broader: Modelliermasse
broader transitive: Modelliermasse
broader transitive: Konservierungs- und Restaurierungsmaterialien
broader transitive: Maßnahme
broader transitive: [Abform- und Ergänzungsmaterial]
definition: formbare ton- bzw. wachsähnliche Modelliermasse aus verschiedenen Füllstoffen (Kalziumcarbonat, Kreide, Kalk, etc.) Ölen, Wachsen und Polymeren. Sie trocknet nicht aus, bleibt dauerhaft geschmeidig und knetbar sowie wiedervervendbar. In der Konservierung und Restaurierung wird Plastilin häufig für temporäre Stützen, Abformungen und Manschettenergänzungen verwendet. Die enthaltenen Öle in manchen Plastilin-Produkten können, gerade auf hellen und/oder porösen Oberflächen, zu Verfärbungen, Flecken und fettigen Rückständen führen, sodass solche Oberfläche bei der Verwendung von Plastilin zusätzlich geschützt werden sollten.
definition:
  literal form: formbare ton- bzw. wachsähnliche Modelliermasse aus verschiedenen Füllstoffen (Kalziumcarbonat, Kreide, Kalk, etc.) Ölen, Wachsen und Polymeren. Sie trocknet nicht aus, bleibt dauerhaft geschmeidig und knetbar sowie wiedervervendbar. In der Konservierung und Restaurierung wird Plastilin häufig für temporäre Stützen, Abformungen und Manschettenergänzungen verwendet. Die enthaltenen Öle in manchen Plastilin-Produkten können, gerade auf hellen und/oder porösen Oberflächen, zu Verfärbungen, Flecken und fettigen Rückständen führen, sodass solche Oberfläche bei der Verwendung von Plastilin zusätzlich geschützt werden sollten.
in scheme: Konservierungs- und Restaurierungsfachthesaurus für archäologische Kulturgüter
pref label: Plastilin
  type: Label
  rank: preferred
pref label: plasticine
  type: Label
  rank: normal

Moltofill
type: Concept
notation: A3D23D
created: 2026-01-30
issued: 2026-01-30
modified: 2026-02-04
publisher: Leibniz-Zentrum für Archäologie (LEIZA)
broader: Gips (Restaurierungsmaterial)
broader transitive: Modelliermasse
broader transitive: Konservierungs- und Restaurierungsmaterialien
broader transitive: Maßnahme
broader transitive: [Abform- und Ergänzungsmaterial]
broader transitive: Gips (Restaurierungsmaterial)
definition: Produktname einer gebrauchsfertige Spachtelmasse auf Gipsbasis, die für das Füllen von Rissen, Löchern und Unebenheiten in Wänden und Decken entwickelt wurde. Sie zeichnet sich durch ihre feine Konsistenz, leichte Verarbeitbarkeit und schnelle Trocknung aus und wird daher in der Konservierung und Restaurierung für kleinere Ausbesserungsarbeiten an Keramikobjekten verwendet.
definition:
  literal form: Produktname einer gebrauchsfertige Spachtelmasse auf Gipsbasis, die für das Füllen von Rissen, Löchern und Unebenheiten in Wänden und Decken entwickelt wurde. Sie zeichnet sich durch ihre feine Konsistenz, leichte Verarbeitbarkeit und schnelle Trocknung aus und wird daher in der Konservierung und Restaurierung für kleinere Ausbesserungsarbeiten an Keramikobjekten verwendet.
in scheme: Konservierungs- und Restaurierungsfachthesaurus für archäologische Kulturgüter
pref label: Moltofill
  type: Label
  rank: preferred

Gips (Restaurierungsmaterial)
type: Concept
notation: GD5FG6
created: 2026-01-30
issued: 2026-01-30
modified: 2026-02-04
publisher: Leibniz-Zentrum für Archäologie (LEIZA)
broader: Modelliermasse
broader transitive: Modelliermasse
broader transitive: Konservierungs- und Restaurierungsmaterialien
broader transitive: Maßnahme
broader transitive: [Abform- und Ergänzungsmaterial]
definition: pulverförmiges Material aus Calciumsulfat, das duch Brennen des wasserhaltigen Gips-Minerals gewonnen wird. Durch Zugabe von Wasser wird aus dem fein gemahlenen Gipspulver eine formbar Modelliermasse, die an der Luft aushärtet. Aufgrund seiner leichten Berarbeitbarkeit und der schnellen Härtung wird Gips in der Restaurierung für Abgüsse/Modelle, Formbau oder die Ergänzung von Fehlstellen verwendet.
definition:
  literal form: pulverförmiges Material aus Calciumsulfat, das duch Brennen des wasserhaltigen Gips-Minerals gewonnen wird. Durch Zugabe von Wasser wird aus dem fein gemahlenen Gipspulver eine formbar Modelliermasse, die an der Luft aushärtet. Aufgrund seiner leichten Berarbeitbarkeit und der schnellen Härtung wird Gips in der Restaurierung für Abgüsse/Modelle, Formbau oder die Ergänzung von Fehlstellen verwendet.
in scheme: Konservierungs- und Restaurierungsfachthesaurus für archäologische Kulturgüter
pref label: Gips (Restaurierungsmaterial)
  type: Label
  rank: preferred
narrower: Moltofill
narrower: Exaduro Gips
narrower: Alabaster Modellgips
narrower: Keramiplast®

Ton <Restaurierungsmaterial>
type: Concept
notation: A8245D
created: 2026-01-30
issued: 2026-01-30
modified: 2026-02-04
publisher: Leibniz-Zentrum für Archäologie (LEIZA)
broader: Modelliermasse
broader transitive: Modelliermasse
broader transitive: Konservierungs- und Restaurierungsmaterialien
broader transitive: Maßnahme
broader transitive: [Abform- und Ergänzungsmaterial]
definition: mineralisches Naturmaterial mit hoher Formbarkeit und Plastizität, das in der Konservierung und Restaurierung hauptsächlich als primäres Trägermaterial für die Ergänzung stark fragmentierter Objekte (Gefäße) verwendet wird.
definition:
  literal form: mineralisches Naturmaterial mit hoher Formbarkeit und Plastizität, das in der Konservierung und Restaurierung hauptsächlich als primäres Trägermaterial für die Ergänzung stark fragmentierter Objekte (Gefäße) verwendet wird.
in scheme: Konservierungs- und Restaurierungsfachthesaurus für archäologische Kulturgüter
pref label: Ton <Restaurierungsmaterial>
  type: Label
  rank: preferred

Exaduro Gips
type: Concept
notation: C35AG4
created: 2026-01-30
issued: 2026-01-30
modified: 2026-02-04
publisher: Leibniz-Zentrum für Archäologie (LEIZA)
broader: Gips (Restaurierungsmaterial)
broader transitive: Modelliermasse
broader transitive: Konservierungs- und Restaurierungsmaterialien
broader transitive: Maßnahme
broader transitive: [Abform- und Ergänzungsmaterial]
broader transitive: Gips (Restaurierungsmaterial)
in scheme: Konservierungs- und Restaurierungsfachthesaurus für archäologische Kulturgüter
pref label: Exaduro Gips
  type: Label
  rank: preferred
alternative label: ⍺-Gips
alt label: ⍺-Gips
  type: Label
  rank: preferred

Revultex
type: Concept
notation: C97B35
created: 2026-01-30
issued: 2026-01-30
modified: 2026-02-04
publisher: Leibniz-Zentrum für Archäologie (LEIZA)
broader: Naturkautschuk
broader transitive: Konservierungs- und Restaurierungsmaterialien
broader transitive: Maßnahme
broader transitive: Naturkautschuk
broader transitive: [Abform- und Ergänzungsmaterial]
in scheme: Konservierungs- und Restaurierungsfachthesaurus für archäologische Kulturgüter
pref label: Revultex
  type: Label
  rank: preferred

Alabaster Modellgips
type: Concept
notation: CD784B
created: 2026-01-30
issued: 2026-01-30
modified: 2026-02-04
publisher: Leibniz-Zentrum für Archäologie (LEIZA)
broader: Gips (Restaurierungsmaterial)
broader transitive: Modelliermasse
broader transitive: Konservierungs- und Restaurierungsmaterialien
broader transitive: Maßnahme
broader transitive: [Abform- und Ergänzungsmaterial]
broader transitive: Gips (Restaurierungsmaterial)
definition: Hochreiner, weißer Gips, speziell für die Herstellung detaillierter Modelle und Formen. Er zeichnet sich durch seine feine Körnung, schnelle Abbindezeit und hohe Härte bei gleichzeitig guter Bearbeitbarkeit nach Aushärtung aus.
definition:
  literal form: Hochreiner, weißer Gips, speziell für die Herstellung detaillierter Modelle und Formen. Er zeichnet sich durch seine feine Körnung, schnelle Abbindezeit und hohe Härte bei gleichzeitig guter Bearbeitbarkeit nach Aushärtung aus.
in scheme: Konservierungs- und Restaurierungsfachthesaurus für archäologische Kulturgüter
pref label: Alabaster Modellgips
  type: Label
  rank: preferred

Keramiplast®
type: Concept
notation: D24653
created: 2026-01-30
issued: 2026-01-30
modified: 2026-02-04
publisher: Leibniz-Zentrum für Archäologie (LEIZA)
broader: Gips (Restaurierungsmaterial)
broader transitive: Modelliermasse
broader transitive: Konservierungs- und Restaurierungsmaterialien
broader transitive: Maßnahme
broader transitive: [Abform- und Ergänzungsmaterial]
broader transitive: Gips (Restaurierungsmaterial)
definition: Produktname einer lufthärtenden Modelliermasse auf Basis von Zellulose und mineralischen Bestandteilen, die sich durch ihre hohe Formstabilität, feine Oberflächenstruktur und einfache Verarbeitung auszeichnet. In der Konservierung und Restaurierung wird Keramiplast hauptsächlich für das Füllen von feinen Abplatzungen und Rissen in Keramikobjekten oder für das Modellieren von Formteilen verwendet.
definition:
  literal form: Produktname einer lufthärtenden Modelliermasse auf Basis von Zellulose und mineralischen Bestandteilen, die sich durch ihre hohe Formstabilität, feine Oberflächenstruktur und einfache Verarbeitung auszeichnet. In der Konservierung und Restaurierung wird Keramiplast hauptsächlich für das Füllen von feinen Abplatzungen und Rissen in Keramikobjekten oder für das Modellieren von Formteilen verwendet.
in scheme: Konservierungs- und Restaurierungsfachthesaurus für archäologische Kulturgüter
pref label: Keramiplast®
  type: Label
  rank: preferred

Naturkautschuk
type: Concept
notation: D2G12A
created: 2026-01-30
issued: 2026-01-30
modified: 2026-02-04
publisher: Leibniz-Zentrum für Archäologie (LEIZA)
broader: [Abform- und Ergänzungsmaterial]
broader transitive: Konservierungs- und Restaurierungsmaterialien
broader transitive: Maßnahme
broader transitive: [Abform- und Ergänzungsmaterial]
definition: elastischer, polymerer Werkstoff, der hauptsächlich aus dem Milchsaft (Latex) des Kautschukbaums (Hevea brasiliensis) gewonnen wird. Chemisch besteht er überwiegend aus Polyisopren, einem cis-1,4-Polymer, das ihm seine charakteristische Elastizität und Reißfestigkeit verleiht. Naturkautschuk ist wasserunlöslich, dehnbar und besitzt eine hohe chemische Beständigkeit.
definition:
  literal form: elastischer, polymerer Werkstoff, der hauptsächlich aus dem Milchsaft (Latex) des Kautschukbaums (Hevea brasiliensis) gewonnen wird. Chemisch besteht er überwiegend aus Polyisopren, einem cis-1,4-Polymer, das ihm seine charakteristische Elastizität und Reißfestigkeit verleiht. Naturkautschuk ist wasserunlöslich, dehnbar und besitzt eine hohe chemische Beständigkeit.
in scheme: Konservierungs- und Restaurierungsfachthesaurus für archäologische Kulturgüter
pref label: Naturkautschuk
  type: Label
  rank: preferred
alternative label: Gummi elasticum
alternative label: Latex
alt label: Latex
  type: Label
  rank: preferred
alt label: Gummi elasticum
  type: Label
  rank: normal
narrower: Revultex
narrower: Givul MR

Givul MR
type: Concept
notation: DFDG2A
created: 2026-01-30
issued: 2026-01-30
modified: 2026-02-04
publisher: Leibniz-Zentrum für Archäologie (LEIZA)
broader: Naturkautschuk
broader transitive: Konservierungs- und Restaurierungsmaterialien
broader transitive: Maßnahme
broader transitive: [Abform- und Ergänzungsmaterial]
broader transitive: Naturkautschuk
in scheme: Konservierungs- und Restaurierungsfachthesaurus für archäologische Kulturgüter
pref label: Givul MR
  type: Label
  rank: preferred

Holzmehl
type: Concept
notation: A17G33
created: 2026-01-30
issued: 2026-01-30
modified: 2026-02-04
publisher: Leibniz-Zentrum für Archäologie (LEIZA)
broader: Füllstoff
broader transitive: Füllstoff
broader transitive: Konservierungs- und Restaurierungsmaterialien
broader transitive: Maßnahme
in scheme: Konservierungs- und Restaurierungsfachthesaurus für archäologische Kulturgüter
pref label: Holzmehl
  type: Label
  rank: preferred

Japanpapier
type: Concept
notation: A8272G
preferred label: japanese paper @en
created: 2026-01-30
issued: 2026-01-30
modified: 2026-02-04
publisher: Leibniz-Zentrum für Archäologie (LEIZA)
broader: Verstärkungsfaser
broader transitive: Verstärkungsfaser
broader transitive: Konservierungs- und Restaurierungsmaterialien
broader transitive: Maßnahme
in scheme: Konservierungs- und Restaurierungsfachthesaurus für archäologische Kulturgüter
pref label: Japanpapier
  type: Label
  rank: preferred
pref label: japanese paper
  type: Label
  rank: normal

Verstärkungsfaser
type: Concept
notation: BGGCA4
preferred label: reinforcing fiber @en
created: 2026-01-30
issued: 2026-01-30
modified: 2026-02-04
publisher: Leibniz-Zentrum für Archäologie (LEIZA)
broader: Konservierungs- und Restaurierungsmaterialien
broader transitive: Konservierungs- und Restaurierungsmaterialien
broader transitive: Maßnahme
in scheme: Konservierungs- und Restaurierungsfachthesaurus für archäologische Kulturgüter
pref label: Verstärkungsfaser
  type: Label
  rank: preferred
pref label: reinforcing fiber
  type: Label
  rank: normal
definition: Oberbegriff für fasrige Materialien, die zur Verstärkung anderer Materialien eingesetzt werden. Sie erhöhen deren Festigkeit, Steifigkeit und Stabilität, indem sie die mechanischen Eigenschaften des Materials verbessern. Die Verstärkungsfasern werden dafür in der Regel in eine Matrix (z.B. aus Polymeren) eingebettet.
definition:
  literal form: Oberbegriff für fasrige Materialien, die zur Verstärkung anderer Materialien eingesetzt werden. Sie erhöhen deren Festigkeit, Steifigkeit und Stabilität, indem sie die mechanischen Eigenschaften des Materials verbessern. Die Verstärkungsfasern werden dafür in der Regel in eine Matrix (z.B. aus Polymeren) eingebettet.
narrower: Japanpapier
narrower: Kohlefaser
narrower: Glasfasergewebe
narrower: Naturseide
narrower: Goldschlägerhaut

Hohlglaskügelchen
type: Concept
notation: B9D357
preferred label: hollow glass balls @en
created: 2026-01-30
issued: 2026-01-30
modified: 2026-02-04
publisher: Leibniz-Zentrum für Archäologie (LEIZA)
broader: Füllstoff
broader transitive: Konservierungs- und Restaurierungsmaterialien
broader transitive: Maßnahme
broader transitive: Füllstoff
in scheme: Konservierungs- und Restaurierungsfachthesaurus für archäologische Kulturgüter
pref label: Hohlglaskügelchen
  type: Label
  rank: preferred
pref label: hollow glass balls
  type: Label
  rank: normal
alternative label: Mikro-Hohlglaskügelchen
definition: mikroskopisch kleine, hohle Kügelchen aus Borosilikatglas mit geringem Gewicht und hoher Stabilität, die als Füllstoff in Restaurierungsmaterialien eingesetzt werden.
alt label: Mikro-Hohlglaskügelchen
  type: Label
  rank: preferred

Füllstoff
type: Concept
notation: BB78D2
preferred label: filler @en
created: 2026-01-30
issued: 2026-01-30
modified: 2026-02-04
publisher: Leibniz-Zentrum für Archäologie (LEIZA)
broader: Konservierungs- und Restaurierungsmaterialien
broader transitive: Konservierungs- und Restaurierungsmaterialien
broader transitive: Maßnahme
in scheme: Konservierungs- und Restaurierungsfachthesaurus für archäologische Kulturgüter
pref label: Füllstoff
  type: Label
  rank: preferred
pref label: filler
  type: Label
  rank: normal
definition: verhältnismäßig inerter fester Stoff, der einem Kunststoff oder einem Klebstoff beigemischt wird, um dessen Festigkeit, Beständigkeit, Verarbeitungseigenschaften oder andere Eigenschaften zu verbessern oder um die Kosten zu senken.
definition:
  literal form: verhältnismäßig inerter fester Stoff, der einem Kunststoff oder einem Klebstoff beigemischt wird, um dessen Festigkeit, Beständigkeit, Verarbeitungseigenschaften oder andere Eigenschaften zu verbessern oder um die Kosten zu senken.
narrower: Holzmehl
narrower: Hohlglaskügelchen
narrower: Talkum
narrower: Metallpulver
narrower: pyrogene Kieselsäure
narrower: Graphit
narrower: Kreide

Talkum
type: Concept
notation: BFB3B9
preferred label: talcum powder @en
created: 2026-01-30
issued: 2026-01-30
modified: 2026-02-04
publisher: Leibniz-Zentrum für Archäologie (LEIZA)
broader: Füllstoff
broader transitive: Füllstoff
broader transitive: Konservierungs- und Restaurierungsmaterialien
broader transitive: Maßnahme
in scheme: Konservierungs- und Restaurierungsfachthesaurus für archäologische Kulturgüter
pref label: Talkum
  type: Label
  rank: preferred
pref label: talcum powder
  type: Label
  rank: normal

Metallpulver
type: Concept
notation: C1BBFB
preferred label: metal powder @en
created: 2026-01-30
issued: 2026-01-30
modified: 2026-02-04
publisher: Leibniz-Zentrum für Archäologie (LEIZA)
broader: Füllstoff
broader transitive: Füllstoff
broader transitive: Konservierungs- und Restaurierungsmaterialien
broader transitive: Maßnahme
in scheme: Konservierungs- und Restaurierungsfachthesaurus für archäologische Kulturgüter
pref label: Metallpulver
  type: Label
  rank: preferred
pref label: metal powder
  type: Label
  rank: normal

pyrogene Kieselsäure
type: Concept
notation: DA86F8
preferred label: fumed silica @en
created: 2026-01-30
issued: 2026-01-30
modified: 2026-02-04
publisher: Leibniz-Zentrum für Archäologie (LEIZA)
broader: Füllstoff
broader transitive: Füllstoff
broader transitive: Konservierungs- und Restaurierungsmaterialien
broader transitive: Maßnahme
in scheme: Konservierungs- und Restaurierungsfachthesaurus für archäologische Kulturgüter
pref label: pyrogene Kieselsäure
  type: Label
  rank: preferred
pref label: fumed silica
  type: Label
  rank: normal
alternative label: Aerosil
alternative label: Pyrogenes Siliziumdioxid
alternative label: amorphe Kieselsäure
alt label: Pyrogenes Siliziumdioxid
  type: Label
  rank: preferred
alt label: Aerosil
  type: Label
  rank: normal
alt label: amorphe Kieselsäure
  type: Label
  rank: normal
narrower: HDK
narrower: Aerosil
definition: sehr feines Pulver von schneeweißer Farbe aus synthetisch hergestelltem Siliziumdioxid. Charakteristisch sind die sehr kleinen Partikelgrößen, das äußert geringe Schüttvolumen und die flockige Struktur der Agglomerate. In der Konservierung und Restaurierung wird pyrogene Kieselsäure hauptsächlich als Verdickungsmittel für Polymere und Silikonkautschuke verwendet.
definition:
  literal form: sehr feines Pulver von schneeweißer Farbe aus synthetisch hergestelltem Siliziumdioxid. Charakteristisch sind die sehr kleinen Partikelgrößen, das äußert geringe Schüttvolumen und die flockige Struktur der Agglomerate. In der Konservierung und Restaurierung wird pyrogene Kieselsäure hauptsächlich als Verdickungsmittel für Polymere und Silikonkautschuke verwendet.

Graphit
type: Concept
notation: FC6F82
preferred label: graphite @en
created: 2026-01-30
issued: 2026-01-30
modified: 2026-02-04
publisher: Leibniz-Zentrum für Archäologie (LEIZA)
broader: Füllstoff
broader transitive: Konservierungs- und Restaurierungsmaterialien
broader transitive: Maßnahme
broader transitive: Füllstoff
in scheme: Konservierungs- und Restaurierungsfachthesaurus für archäologische Kulturgüter
pref label: Graphit
  type: Label
  rank: preferred
pref label: graphite
  type: Label
  rank: normal

Kreide
type: Concept
notation: G2G253
created: 2026-01-30
issued: 2026-01-30
modified: 2026-02-04
publisher: Leibniz-Zentrum für Archäologie (LEIZA)
broader: Füllstoff
broader transitive: Füllstoff
broader transitive: Konservierungs- und Restaurierungsmaterialien
broader transitive: Maßnahme
in scheme: Konservierungs- und Restaurierungsfachthesaurus für archäologische Kulturgüter
pref label: Kreide
  type: Label
  rank: preferred

Kohlefaser
type: Concept
notation: CD477D
preferred label: carbon fibre @en
created: 2026-01-30
issued: 2026-01-30
modified: 2026-02-04
publisher: Leibniz-Zentrum für Archäologie (LEIZA)
broader: Verstärkungsfaser
broader transitive: Verstärkungsfaser
broader transitive: Konservierungs- und Restaurierungsmaterialien
broader transitive: Maßnahme
in scheme: Konservierungs- und Restaurierungsfachthesaurus für archäologische Kulturgüter
pref label: Kohlefaser
  type: Label
  rank: preferred
pref label: carbon fibre
  type: Label
  rank: normal
alternative label: Carbonfaser
alternative label: Kohlenstofffaser
alt label: Carbonfaser
  type: Label
  rank: preferred
alt label: Kohlenstofffaser
  type: Label
  rank: normal

Glasfasergewebe
type: Concept
notation: F61BGA
preferred label: glass fibre fabric @en
created: 2026-01-30
issued: 2026-01-30
modified: 2026-02-04
publisher: Leibniz-Zentrum für Archäologie (LEIZA)
broader: Verstärkungsfaser
broader transitive: Verstärkungsfaser
broader transitive: Konservierungs- und Restaurierungsmaterialien
broader transitive: Maßnahme
in scheme: Konservierungs- und Restaurierungsfachthesaurus für archäologische Kulturgüter
pref label: Glasfasergewebe
  type: Label
  rank: preferred
pref label: glass fibre fabric
  type: Label
  rank: normal
alternative label: Glasfaser
alt label: Glasfaser
  type: Label
  rank: preferred

Naturseide
type: Concept
notation: FGBB8G
created: 2026-01-30
issued: 2026-01-30
modified: 2026-02-04
publisher: Leibniz-Zentrum für Archäologie (LEIZA)
broader: Verstärkungsfaser
broader transitive: Verstärkungsfaser
broader transitive: Konservierungs- und Restaurierungsmaterialien
broader transitive: Maßnahme
in scheme: Konservierungs- und Restaurierungsfachthesaurus für archäologische Kulturgüter
pref label: Naturseide
  type: Label
  rank: preferred

Goldschlägerhaut
type: Concept
notation: GF1639
preferred label: goldbeater skin @en
created: 2026-01-30
issued: 2026-01-30
modified: 2026-02-04
publisher: Leibniz-Zentrum für Archäologie (LEIZA)
broader: Verstärkungsfaser
broader transitive: Verstärkungsfaser
broader transitive: Konservierungs- und Restaurierungsmaterialien
broader transitive: Maßnahme
in scheme: Konservierungs- und Restaurierungsfachthesaurus für archäologische Kulturgüter
pref label: goldbeater skin
  type: Label
  rank: normal
pref label: Goldschlägerhaut
  type: Label
  rank: preferred

Auro Naturharzölimpregniergrund Nr. 121
type: Concept
notation: A28B4D
created: 2026-01-30
issued: 2026-01-30
modified: 2026-02-04
publisher: Leibniz-Zentrum für Archäologie (LEIZA)
broader: Öl
broader transitive: Konservierungs- und Restaurierungsmaterialien
broader transitive: Maßnahme
broader transitive: Öl
in scheme: Konservierungs- und Restaurierungsfachthesaurus für archäologische Kulturgüter
pref label: Auro Naturharzölimpregniergrund Nr. 121
  type: Label
  rank: preferred
alternative label: Auro Öl
alternative label: Holzöl
alt label: Auro Öl
  type: Label
  rank: preferred
alt label: Holzöl
  type: Label
  rank: normal

Öl
type: Concept
notation: CCCC7G
created: 2026-01-30
issued: 2026-01-30
modified: 2026-02-04
publisher: Leibniz-Zentrum für Archäologie (LEIZA)
broader: Konservierungs- und Restaurierungsmaterialien
broader transitive: Konservierungs- und Restaurierungsmaterialien
broader transitive: Maßnahme
in scheme: Konservierungs- und Restaurierungsfachthesaurus für archäologische Kulturgüter
pref label: Öl
  type: Label
  rank: preferred
narrower: Auro Naturharzölimpregniergrund Nr. 121
narrower: Auro Hartöl Nr. 126
narrower: Leinöl

Auro Hartöl Nr. 126
type: Concept
notation: F3DB41
created: 2026-01-30
issued: 2026-01-30
modified: 2026-02-04
publisher: Leibniz-Zentrum für Archäologie (LEIZA)
broader: Öl
broader transitive: Konservierungs- und Restaurierungsmaterialien
broader transitive: Maßnahme
broader transitive: Öl
in scheme: Konservierungs- und Restaurierungsfachthesaurus für archäologische Kulturgüter
pref label: Auro Hartöl Nr. 126
  type: Label
  rank: preferred
alternative label: Holzöl
alt label: Holzöl
  type: Label
  rank: preferred

Leinöl
type: Concept
notation: G44C1A
created: 2026-01-30
issued: 2026-01-30
modified: 2026-02-04
publisher: Leibniz-Zentrum für Archäologie (LEIZA)
broader: Öl
broader transitive: Konservierungs- und Restaurierungsmaterialien
broader transitive: Maßnahme
broader transitive: Öl
in scheme: Konservierungs- und Restaurierungsfachthesaurus für archäologische Kulturgüter
pref label: Leinöl
  type: Label
  rank: preferred

HDK
type: Concept
notation: D38D51
created: 2026-01-30
issued: 2026-01-30
modified: 2026-02-04
publisher: Leibniz-Zentrum für Archäologie (LEIZA)
broader: pyrogene Kieselsäure
broader transitive: Füllstoff
broader transitive: Konservierungs- und Restaurierungsmaterialien
broader transitive: Maßnahme
broader transitive: pyrogene Kieselsäure
in scheme: Konservierungs- und Restaurierungsfachthesaurus für archäologische Kulturgüter
pref label: HDK
  type: Label
  rank: preferred
definition: Produktname für verschiedene Varianten pyrogener Kieselsäure der Firma Wacker.

Aerosil
type: Concept
notation: GGFD3F
created: 2026-01-30
issued: 2026-01-30
modified: 2026-02-04
publisher: Leibniz-Zentrum für Archäologie (LEIZA)
broader: pyrogene Kieselsäure
broader transitive: Füllstoff
broader transitive: Konservierungs- und Restaurierungsmaterialien
broader transitive: Maßnahme
broader transitive: pyrogene Kieselsäure
in scheme: Konservierungs- und Restaurierungsfachthesaurus für archäologische Kulturgüter
pref label: Aerosil
  type: Label
  rank: preferred
definition: Produktname für verschiedene Varianten pyrogener Kieselsäure der Firma Evonik Industries (früher Degussa).

Araldit BY 158
type: Concept
notation: A57386
created: 2026-01-30
issued: 2026-01-30
modified: 2026-02-04
publisher: Leibniz-Zentrum für Archäologie (LEIZA)
broader: Epoxidharz
broader transitive: synthetisches Polymer
broader transitive: Epoxidharz
broader transitive: [Adhäsivstoff]
broader transitive: Konservierungs- und Restaurierungsmaterialien
broader transitive: Maßnahme
definition: Produktname eines niedrigviskosen Epoxidharzes der Firma Huntsman Corporation, basierend auf Bisphenol-A und einem reaktiven Verdünnungsmittel. In Kombination mit aliphatischen und/oder cycloaliphatischen Aminen wird Araldite BY 158 vor allem in industriellen Injektionssystemen verwendet, um stabile und widerstandsfähige Verbindungen zu schaffen.
definition:
  literal form: Produktname eines niedrigviskosen Epoxidharzes der Firma Huntsman Corporation, basierend auf Bisphenol-A und einem reaktiven Verdünnungsmittel. In Kombination mit aliphatischen und/oder cycloaliphatischen Aminen wird Araldite BY 158 vor allem in industriellen Injektionssystemen verwendet, um stabile und widerstandsfähige Verbindungen zu schaffen.
in scheme: Konservierungs- und Restaurierungsfachthesaurus für archäologische Kulturgüter
pref label: Araldit BY 158
  type: Label
  rank: preferred

Epoxidharz
type: Concept
notation: AF31AG
preferred label: epoxy resin @en
created: 2026-01-30
issued: 2026-01-30
modified: 2026-02-04
publisher: Leibniz-Zentrum für Archäologie (LEIZA)
broader: synthetisches Polymer
broader transitive: synthetisches Polymer
broader transitive: [Adhäsivstoff]
broader transitive: Konservierungs- und Restaurierungsmaterialien
broader transitive: Maßnahme
definition: synthetisch hergestelltes duroplastisches Harzsystem, dass aus zwei Komponenten besteht. Die eine Komponente trägt dabei eine Epoxidgruppe und die Andere fungiert als Härter, indem sie mit der Epoxidgruppe eine vernetzende Reaktion eingeht. Durch die Variation einer oder beider Komponenten lässt sich eine große Bandbreite unterschiedlicher Polymere herstellen, wobei die Zugabe von Beschleunigern, Verdünnungsmitteln, Weichmachern und weiteren Additiven die Komplexität der Grundrezeptur zusätzlich erhöht. Die meisten in der Konservierung und Restaurierung verwendeten Epoxidharze bestehen aus Diglycidylether des Bisphenol A, da diese eine starke Klebekraft, ein gutes Penetrationsvermögen und weitere für die Anwendungen in der Konservierung/Restaurierung nützliche Eigenschaften aufweisen. Aufgrund der quervernetzten Struktur nach der Aushärtung sind epoxidharze jedoch nur noch schwer chemisch lösbar und somit nicht/kaum reversibel.
definition:
  literal form: synthetisch hergestelltes duroplastisches Harzsystem, dass aus zwei Komponenten besteht. Die eine Komponente trägt dabei eine Epoxidgruppe und die Andere fungiert als Härter, indem sie mit der Epoxidgruppe eine vernetzende Reaktion eingeht. Durch die Variation einer oder beider Komponenten lässt sich eine große Bandbreite unterschiedlicher Polymere herstellen, wobei die Zugabe von Beschleunigern, Verdünnungsmitteln, Weichmachern und weiteren Additiven die Komplexität der Grundrezeptur zusätzlich erhöht. Die meisten in der Konservierung und Restaurierung verwendeten Epoxidharze bestehen aus Diglycidylether des Bisphenol A, da diese eine starke Klebekraft, ein gutes Penetrationsvermögen und weitere für die Anwendungen in der Konservierung/Restaurierung nützliche Eigenschaften aufweisen. Aufgrund der quervernetzten Struktur nach der Aushärtung sind epoxidharze jedoch nur noch schwer chemisch lösbar und somit nicht/kaum reversibel.
in scheme: Konservierungs- und Restaurierungsfachthesaurus für archäologische Kulturgüter
pref label: Epoxidharz
  type: Label
  rank: preferred
pref label: epoxy resin
  type: Label
  rank: normal
narrower: Araldit BY 158
narrower: Biresin LS/LM
narrower: EPO-TEK 301
narrower: UHU Plus Schnellfest
narrower: Araldite 2020
narrower: Hxtal NYL-1
narrower: Araldit AY 103
narrower: Araldit XB 260
narrower: RenPaste™ SV/HV 427
narrower: Ebalta AH 100
narrower: UHU Plus Endfest 300

Biresin LS/LM
type: Concept
notation: A99485
created: 2026-01-30
issued: 2026-01-30
modified: 2026-02-04
publisher: Leibniz-Zentrum für Archäologie (LEIZA)
broader: Epoxidharz
broader transitive: synthetisches Polymer
broader transitive: [Adhäsivstoff]
broader transitive: Konservierungs- und Restaurierungsmaterialien
broader transitive: Maßnahme
broader transitive: Epoxidharz
in scheme: Konservierungs- und Restaurierungsfachthesaurus für archäologische Kulturgüter
pref label: Biresin LS/LM
  type: Label
  rank: preferred

EPO-TEK 301
type: Concept
notation: BB9249
created: 2026-01-30
issued: 2026-01-30
modified: 2026-02-04
publisher: Leibniz-Zentrum für Archäologie (LEIZA)
broader: Epoxidharz
broader transitive: synthetisches Polymer
broader transitive: [Adhäsivstoff]
broader transitive: Konservierungs- und Restaurierungsmaterialien
broader transitive: Maßnahme
broader transitive: Epoxidharz
definition: Produktname eines zweikomponentigen, bei Raumtemperatur aushärtenden Epoxidharzes der Firma Epoxy Technology. Es zeichnet sich durch eine sehr niedrige Viskosität sowie gute optische und mechanische Eigenschaften aus.
definition:
  literal form: Produktname eines zweikomponentigen, bei Raumtemperatur aushärtenden Epoxidharzes der Firma Epoxy Technology. Es zeichnet sich durch eine sehr niedrige Viskosität sowie gute optische und mechanische Eigenschaften aus.
in scheme: Konservierungs- und Restaurierungsfachthesaurus für archäologische Kulturgüter
pref label: EPO-TEK 301
  type: Label
  rank: preferred

UHU Plus Schnellfest
type: Concept
notation: C3G438
created: 2026-01-30
issued: 2026-01-30
modified: 2026-02-04
publisher: Leibniz-Zentrum für Archäologie (LEIZA)
broader: Epoxidharz
broader transitive: synthetisches Polymer
broader transitive: [Adhäsivstoff]
broader transitive: Konservierungs- und Restaurierungsmaterialien
broader transitive: Maßnahme
broader transitive: Epoxidharz
in scheme: Konservierungs- und Restaurierungsfachthesaurus für archäologische Kulturgüter
pref label: UHU Plus Schnellfest
  type: Label
  rank: preferred

Araldite 2020
type: Concept
notation: D2D671
created: 2026-01-30
issued: 2026-01-30
modified: 2026-02-04
publisher: Leibniz-Zentrum für Archäologie (LEIZA)
broader: Epoxidharz
broader transitive: synthetisches Polymer
broader transitive: Epoxidharz
broader transitive: [Adhäsivstoff]
broader transitive: Konservierungs- und Restaurierungsmaterialien
broader transitive: Maßnahme
definition: Produktname eines niedrigviskosen, bei Raumtemperatur aushärtenden Zweikomponenten-Systems auf Epoxidharzbasis der Firma Huntsman Corporation. Araldit 20/20 wird aus zwei Komponenten (Harz A und Härter B) angemischt und wurde speziell für das Kleben, Vergießen und Beschichten von Glas und ähnlichen Materialien entwickelt. Es zeichnet sich durch eine gute Haftung, Beständigkeit und hohe Transparenz aus. Araldite 20/20 zeigt eine ähnliche Lichtbrechung wie Glas, wodurch es bei der Verwendung als Glasklebstoff die geklebten Bruchkanten weniger bis kaum sichtbar erscheinen lässt.
definition:
  literal form: Produktname eines niedrigviskosen, bei Raumtemperatur aushärtenden Zweikomponenten-Systems auf Epoxidharzbasis der Firma Huntsman Corporation. Araldit 20/20 wird aus zwei Komponenten (Harz A und Härter B) angemischt und wurde speziell für das Kleben, Vergießen und Beschichten von Glas und ähnlichen Materialien entwickelt. Es zeichnet sich durch eine gute Haftung, Beständigkeit und hohe Transparenz aus. Araldite 20/20 zeigt eine ähnliche Lichtbrechung wie Glas, wodurch es bei der Verwendung als Glasklebstoff die geklebten Bruchkanten weniger bis kaum sichtbar erscheinen lässt.
in scheme: Konservierungs- und Restaurierungsfachthesaurus für archäologische Kulturgüter
pref label: Araldite 2020
  type: Label
  rank: preferred
alternative label: Araldit 20/20
alt label: Araldit 20/20
  type: Label
  rank: preferred

Hxtal NYL-1
type: Concept
notation: D38147
created: 2026-01-30
issued: 2026-01-30
modified: 2026-02-04
publisher: Leibniz-Zentrum für Archäologie (LEIZA)
broader: Epoxidharz
broader transitive: synthetisches Polymer
broader transitive: [Adhäsivstoff]
broader transitive: Konservierungs- und Restaurierungsmaterialien
broader transitive: Maßnahme
broader transitive: Epoxidharz
definition: Produktname eines Epoxidklebstoffes der in den 80er Jahren von Herber Hillary, in Zusammenarbeit mit den Laboratorien von Texaco und Shell, speziell für die Konservierung und Restaurierung entwickelt wurde. Es wird, anders als die meisten anderen Epoxidharze, durch die Reaktion eines cycloaliphatischen Epoxidharzes mit einer Mischung von Aminen als Härter synthetisiert. Hxtal NYL-01 wurde insbesondere für die Klebung und Ergänzung von Gläsern und Keramiken hergestellt und zeigt einen ähnlichen Brechungsindex wie die meisten Gläser.
definition:
  literal form: Produktname eines Epoxidklebstoffes der in den 80er Jahren von Herber Hillary, in Zusammenarbeit mit den Laboratorien von Texaco und Shell, speziell für die Konservierung und Restaurierung entwickelt wurde. Es wird, anders als die meisten anderen Epoxidharze, durch die Reaktion eines cycloaliphatischen Epoxidharzes mit einer Mischung von Aminen als Härter synthetisiert. Hxtal NYL-01 wurde insbesondere für die Klebung und Ergänzung von Gläsern und Keramiken hergestellt und zeigt einen ähnlichen Brechungsindex wie die meisten Gläser.
in scheme: Konservierungs- und Restaurierungsfachthesaurus für archäologische Kulturgüter
pref label: Hxtal NYL-1
  type: Label
  rank: preferred

Araldit AY 103
type: Concept
notation: D5F7BC
created: 2026-01-30
issued: 2026-01-30
modified: 2026-02-04
publisher: Leibniz-Zentrum für Archäologie (LEIZA)
broader: Epoxidharz
broader transitive: synthetisches Polymer
broader transitive: Epoxidharz
broader transitive: [Adhäsivstoff]
broader transitive: Konservierungs- und Restaurierungsmaterialien
broader transitive: Maßnahme
definition: Produktname eines niedrigviskosen Epoxidharz-Zweikomponentensystems der Firma Huntsman Corporation, das eine hohe Haftung auf Metall, Keramik, Glas und Kunststoffen bietet. Es ist lösungsmittelfrei, leicht aufzutragen und härtet bei Raumtemperatur aus. Die Mischung weist eine hohe Zugscherfestigkeit und eine gute Wärmebeständigkeit bis ca. 50°C auf
definition:
  literal form: Produktname eines niedrigviskosen Epoxidharz-Zweikomponentensystems der Firma Huntsman Corporation, das eine hohe Haftung auf Metall, Keramik, Glas und Kunststoffen bietet. Es ist lösungsmittelfrei, leicht aufzutragen und härtet bei Raumtemperatur aus. Die Mischung weist eine hohe Zugscherfestigkeit und eine gute Wärmebeständigkeit bis ca. 50°C auf
in scheme: Konservierungs- und Restaurierungsfachthesaurus für archäologische Kulturgüter
pref label: Araldit AY 103
  type: Label
  rank: preferred

Araldit XB 260
type: Concept
notation: D8B3D6
created: 2026-01-30
issued: 2026-01-30
modified: 2026-02-04
publisher: Leibniz-Zentrum für Archäologie (LEIZA)
broader: Epoxidharz
broader transitive: synthetisches Polymer
broader transitive: Epoxidharz
broader transitive: [Adhäsivstoff]
broader transitive: Konservierungs- und Restaurierungsmaterialien
broader transitive: Maßnahme
in scheme: Konservierungs- und Restaurierungsfachthesaurus für archäologische Kulturgüter
pref label: Araldit XB 260
  type: Label
  rank: preferred

RenPaste™ SV/HV 427
type: Concept
notation: DAA17A
created: 2026-01-30
issued: 2026-01-30
modified: 2026-02-04
publisher: Leibniz-Zentrum für Archäologie (LEIZA)
broader: Epoxidharz
broader transitive: synthetisches Polymer
broader transitive: Epoxidharz
broader transitive: [Adhäsivstoff]
broader transitive: Konservierungs- und Restaurierungsmaterialien
broader transitive: Maßnahme
definition: Produktname einer zweikomponentigen, kalt aushärtende Epoxidharzpaste der Firma Huntsman Corporation, die sich durch gute Haftung, geringe Dichte und gute Bearbeitbarkeit mit Werkzeugen auszeichnet. Sie wird in der Konservierung und Restaurierung für Reparaturen an Modellen, Formen oder Oberflächen eingesetzt und ermöglicht präzise Formgebung bei minimaler Schrumpfung. Die Paste ist einfach zu verarbeiten, härtet bei Raumtemperatur aus und bietet eine stabile, langlebige Struktur.
definition:
  literal form: Produktname einer zweikomponentigen, kalt aushärtende Epoxidharzpaste der Firma Huntsman Corporation, die sich durch gute Haftung, geringe Dichte und gute Bearbeitbarkeit mit Werkzeugen auszeichnet. Sie wird in der Konservierung und Restaurierung für Reparaturen an Modellen, Formen oder Oberflächen eingesetzt und ermöglicht präzise Formgebung bei minimaler Schrumpfung. Die Paste ist einfach zu verarbeiten, härtet bei Raumtemperatur aus und bietet eine stabile, langlebige Struktur.
in scheme: Konservierungs- und Restaurierungsfachthesaurus für archäologische Kulturgüter
pref label: RenPaste™ SV/HV 427
  type: Label
  rank: preferred
alternative label: Araldit SV 426
alt label: Araldit SV 426
  type: Label
  rank: preferred

Ebalta AH 100
type: Concept
notation: F5G8DB
created: 2026-01-30
issued: 2026-01-30
modified: 2026-02-04
publisher: Leibniz-Zentrum für Archäologie (LEIZA)
alternative label: AH 100
broader: Epoxidharz
broader transitive: synthetisches Polymer
broader transitive: [Adhäsivstoff]
broader transitive: Konservierungs- und Restaurierungsmaterialien
broader transitive: Maßnahme
broader transitive: Epoxidharz
definition: Produktname eines ungefüllten, dünnflüssigen Epoxidharzes der Firma Ebalta, basierend auf dem Reaktionsprodukt Bisphenol-A-Epichlorhydrin. AH steht für Allzweckharz und ist somit für Laminier-, Gieß- oder Klebe-Anwendungen geeignet.
definition:
  literal form: Produktname eines ungefüllten, dünnflüssigen Epoxidharzes der Firma Ebalta, basierend auf dem Reaktionsprodukt Bisphenol-A-Epichlorhydrin. AH steht für Allzweckharz und ist somit für Laminier-, Gieß- oder Klebe-Anwendungen geeignet.
in scheme: Konservierungs- und Restaurierungsfachthesaurus für archäologische Kulturgüter
alt label: AH 100
  type: Label
  rank: preferred
pref label: Ebalta AH 100
  type: Label
  rank: preferred

UHU Plus Endfest 300
type: Concept
notation: G12F98
created: 2026-01-30
issued: 2026-01-30
modified: 2026-02-04
publisher: Leibniz-Zentrum für Archäologie (LEIZA)
broader: Epoxidharz
broader transitive: synthetisches Polymer
broader transitive: [Adhäsivstoff]
broader transitive: Konservierungs- und Restaurierungsmaterialien
broader transitive: Maßnahme
broader transitive: Epoxidharz
in scheme: Konservierungs- und Restaurierungsfachthesaurus für archäologische Kulturgüter
pref label: UHU Plus Endfest 300
  type: Label
  rank: preferred

Acrylfarbe
type: Concept
notation: C632FD
created: 2026-01-30
issued: 2026-01-30
modified: 2026-02-04
publisher: Leibniz-Zentrum für Archäologie (LEIZA)
broader: Dispersionsfarbe
broader transitive: Konservierungs- und Restaurierungsmaterialien
broader transitive: Maßnahme
broader transitive: Farbstoff
broader transitive: Dispersionsfarbe
in scheme: Konservierungs- und Restaurierungsfachthesaurus für archäologische Kulturgüter
pref label: Acrylfarbe
  type: Label
  rank: preferred

Pigment
type: Concept
notation: F64B9C
preferred label: pigment @en
created: 2026-01-30
issued: 2026-01-30
modified: 2026-02-04
publisher: Leibniz-Zentrum für Archäologie (LEIZA)
broader: Farbstoff
broader transitive: Konservierungs- und Restaurierungsmaterialien
broader transitive: Maßnahme
broader transitive: Farbstoff
definition: feiner, als Feststoff vorliegender Farbstoff, der zur Einfärbung anderer Materialien in diesen suspendiert oder ein/aufgerieben wird.
in scheme: Konservierungs- und Restaurierungsfachthesaurus für archäologische Kulturgüter
pref label: Pigment
  type: Label
  rank: preferred
pref label: pigment
  type: Label
  rank: normal

Paraloid B72
type: Concept
notation: A14455
created: 2026-01-30
issued: 2026-01-30
modified: 2026-02-04
publisher: Leibniz-Zentrum für Archäologie (LEIZA)
alternative label: Acryloid B72
alternative label: Paraloid B-72
broader: Acrylharz
broader transitive: Acrylharz
broader transitive: synthetisches Polymer
broader transitive: [Adhäsivstoff]
broader transitive: Konservierungs- und Restaurierungsmaterialien
broader transitive: Maßnahme
definition: Produktname für ein synthestisches Acrylharz der Firma Rohm und Haas (heute Teil von Dow Chemicals), bestehend aus Ethylmethacrylat und Methylacrylat sowie einem kleinen Anteil Butylmethacrylat. Aufgrund seiner hervorragenden Eigenschaften hinsichtlich Alterungsbeständigkeit, Transparenz und Reversibilität ist Paraloid B72 eines der am häufigsten eingesetzten Materialien in der Konservierung und Restaurierung. In verschiedenen organischen Lösungsmitteln gelöst wird es als Klebstoff, Bindemittel, Festigungsmittel und für Schutzüberzug für unterschiedliche Materialien verwendet.
definition:
  literal form: Produktname für ein synthestisches Acrylharz der Firma Rohm und Haas (heute Teil von Dow Chemicals), bestehend aus Ethylmethacrylat und Methylacrylat sowie einem kleinen Anteil Butylmethacrylat. Aufgrund seiner hervorragenden Eigenschaften hinsichtlich Alterungsbeständigkeit, Transparenz und Reversibilität ist Paraloid B72 eines der am häufigsten eingesetzten Materialien in der Konservierung und Restaurierung. In verschiedenen organischen Lösungsmitteln gelöst wird es als Klebstoff, Bindemittel, Festigungsmittel und für Schutzüberzug für unterschiedliche Materialien verwendet.
in scheme: Konservierungs- und Restaurierungsfachthesaurus für archäologische Kulturgüter
alt label: Acryloid B72
  type: Label
  rank: preferred
alt label: Paraloid B-72
  type: Label
  rank: normal
pref label: Paraloid B72
  type: Label
  rank: preferred

Acrylharz
type: Concept
notation: GFD582
preferred label: acrylic resin @en
created: 2026-01-30
issued: 2026-01-30
modified: 2026-02-04
publisher: Leibniz-Zentrum für Archäologie (LEIZA)
alternative label: Acrylpolymere
alternative label: Polyacrylat
alternative label: polyacrylate @en
broader: synthetisches Polymer
broader transitive: synthetisches Polymer
broader transitive: [Adhäsivstoff]
broader transitive: Konservierungs- und Restaurierungsmaterialien
broader transitive: Maßnahme
definition: synthetisches, thermoplastisches Polymere auf Basis von Acrylsäureestern oder Methacrylsäureestern, das durch die Polymerisation von Acrylat- oder Methylacrylat-Monomeren hergestellt wird. Grundsätzlich weist Acrylharz eine hohe Transperenz, gute Altersbeständigkeit und Reversibilität auf, die jedoch je nach genauer chemischer Zusammensetzung des verwendeten Produktes variieren kann. Aufgrund der guten Eigenschaften ist Acrylharz in der Konservierung und Restaurierung einer der am häufigsten als Klebstoff, Bindemittel, Festigungsmittel und für Schutzüberzug verwendeten Stoffe.
definition:
  literal form: synthetisches, thermoplastisches Polymere auf Basis von Acrylsäureestern oder Methacrylsäureestern, das durch die Polymerisation von Acrylat- oder Methylacrylat-Monomeren hergestellt wird. Grundsätzlich weist Acrylharz eine hohe Transperenz, gute Altersbeständigkeit und Reversibilität auf, die jedoch je nach genauer chemischer Zusammensetzung des verwendeten Produktes variieren kann. Aufgrund der guten Eigenschaften ist Acrylharz in der Konservierung und Restaurierung einer der am häufigsten als Klebstoff, Bindemittel, Festigungsmittel und für Schutzüberzug verwendeten Stoffe.
in scheme: Konservierungs- und Restaurierungsfachthesaurus für archäologische Kulturgüter
alt label: Polyacrylat
  type: Label
  rank: preferred
alt label: Acrylpolymere
  type: Label
  rank: normal
alt label: polyacrylate
  type: Label
  rank: normal
pref label: Acrylharz
  type: Label
  rank: preferred
pref label: acrylic resin
  type: Label
  rank: normal
narrower: Paraloid B72
narrower: Lascaux 498 HY
narrower: Technovit 2000 LC
narrower: Paraloid B44
narrower: Kallocryl
narrower: Acrylic One
narrower: Paraloid B48N
narrower: Plastogen G
narrower: Plastogen EP
narrower: Acrystal
narrower: Ebacryl
narrower: Plexisol B 597
narrower: Cyanacrylat
narrower: Technovit 5071
narrower: Plexigum

Lascaux 498 HY
type: Concept
notation: A1C48C
created: 2026-01-30
issued: 2026-01-30
modified: 2026-02-04
publisher: Leibniz-Zentrum für Archäologie (LEIZA)
broader: Acrylharz
broader transitive: Acrylharz
broader transitive: synthetisches Polymer
broader transitive: [Adhäsivstoff]
broader transitive: Konservierungs- und Restaurierungsmaterialien
broader transitive: Maßnahme
definition: Produktname einer wässrigen Acrylatdispersion auf Butyl-Methacrylat-Basis, die speziell für die Konservierung und Restaurierung entwickelt wurde. Das Material bildet einen zähelastischen, extrem zugfesten Film, der sich durch hohe Transparenz, Licht- und Alterungsbeständigkeit sowie Reversibilität auszeichnet. Die Dispersion ist wasserverdünnbar, bildet jedoch nach der Trocknung einen wasserfesten Film. Dieser bleibt permanent löslich in organischen Lösungsmitteln wie Aceton, Alkohol, Toluol und Xylol. Es eignet sich sowohl für Nass- als auch für Trockenapplikationen und wird häufig als Klebemittel für empfindliche Materialien wie Textilien, Papier und Kunstwerke eingesetzt.
definition:
  literal form: Produktname einer wässrigen Acrylatdispersion auf Butyl-Methacrylat-Basis, die speziell für die Konservierung und Restaurierung entwickelt wurde. Das Material bildet einen zähelastischen, extrem zugfesten Film, der sich durch hohe Transparenz, Licht- und Alterungsbeständigkeit sowie Reversibilität auszeichnet. Die Dispersion ist wasserverdünnbar, bildet jedoch nach der Trocknung einen wasserfesten Film. Dieser bleibt permanent löslich in organischen Lösungsmitteln wie Aceton, Alkohol, Toluol und Xylol. Es eignet sich sowohl für Nass- als auch für Trockenapplikationen und wird häufig als Klebemittel für empfindliche Materialien wie Textilien, Papier und Kunstwerke eingesetzt.
in scheme: Konservierungs- und Restaurierungsfachthesaurus für archäologische Kulturgüter
pref label: Lascaux 498 HY
  type: Label
  rank: preferred

Technovit 2000 LC
type: Concept
notation: A64281
created: 2026-01-30
issued: 2026-01-30
modified: 2026-02-04
publisher: Leibniz-Zentrum für Archäologie (LEIZA)
broader: Acrylharz
broader transitive: Acrylharz
broader transitive: synthetisches Polymer
broader transitive: [Adhäsivstoff]
broader transitive: Konservierungs- und Restaurierungsmaterialien
broader transitive: Maßnahme
definition: Produktname eines lichthärtendes Methacrylharzes der Firma Heraeus Kulzer GmbH und Co. KG
in scheme: Konservierungs- und Restaurierungsfachthesaurus für archäologische Kulturgüter
pref label: Technovit 2000 LC
  type: Label
  rank: preferred

Paraloid B44
type: Concept
notation: AFF6GA
created: 2026-01-30
issued: 2026-01-30
modified: 2026-02-04
publisher: Leibniz-Zentrum für Archäologie (LEIZA)
broader: Acrylharz
broader transitive: Acrylharz
broader transitive: synthetisches Polymer
broader transitive: [Adhäsivstoff]
broader transitive: Konservierungs- und Restaurierungsmaterialien
broader transitive: Maßnahme
definition: Produktname eines synthetischen Acrylharzes der Firma Rohm und Haas (heute Teil von Dow Chemicals) auf Basis von Methylmethacrylat und Ethylacrylat sowie einem geringem Anteil Butylmethacrylat. Ähnlich wie Paraloid B72 zeigt es gute Alterungsbeständigkeit, Transparenz und Reversibilität, ist in verschiedenen organischen Lösungsmitteln löslich und wird als Klebstoff, Bindemittel, Festigungsmittel und für Schutzüberzüge verwendet. Im Gegensatz zu Paraloid B72 besitzt es eine höhere Glasübergangstemperatur (ca. 60°C), wodurch Paraloid B44 besonders für die Verwendung in wärmeren Umgebungen geeignet ist.
definition:
  literal form: Produktname eines synthetischen Acrylharzes der Firma Rohm und Haas (heute Teil von Dow Chemicals) auf Basis von Methylmethacrylat und Ethylacrylat sowie einem geringem Anteil Butylmethacrylat. Ähnlich wie Paraloid B72 zeigt es gute Alterungsbeständigkeit, Transparenz und Reversibilität, ist in verschiedenen organischen Lösungsmitteln löslich und wird als Klebstoff, Bindemittel, Festigungsmittel und für Schutzüberzüge verwendet. Im Gegensatz zu Paraloid B72 besitzt es eine höhere Glasübergangstemperatur (ca. 60°C), wodurch Paraloid B44 besonders für die Verwendung in wärmeren Umgebungen geeignet ist.
in scheme: Konservierungs- und Restaurierungsfachthesaurus für archäologische Kulturgüter
pref label: Paraloid B44
  type: Label
  rank: preferred

Kallocryl
type: Concept
notation: B15G98
created: 2026-01-30
issued: 2026-01-30
modified: 2026-02-04
publisher: Leibniz-Zentrum für Archäologie (LEIZA)
broader: Acrylharz
broader transitive: Acrylharz
broader transitive: synthetisches Polymer
broader transitive: [Adhäsivstoff]
broader transitive: Konservierungs- und Restaurierungsmaterialien
broader transitive: Maßnahme
definition: Produktname eines synthetischen Acrylharzes der Firma SPEIKO - Spezialitäten GmbH, auf Basis von Polymethylmethacrylat (PMMA). Es zeigt ähnliche Eigenschaften wie Paraloid B72, ist jedoch etwas härter und besitzt eine höhere Glasübergangstemperatur (ca. 50-60°C). Kallocryl wurde ursprünglich für den Dentalbereich, für die Erstellung von Prothesen entiwckelt und ist daher für Anwendungen im Bereich der Konservierung/Restaurierung noch nicht soweit erforscht wie andere PMMA basierte Polymere.
definition:
  literal form: Produktname eines synthetischen Acrylharzes der Firma SPEIKO - Spezialitäten GmbH, auf Basis von Polymethylmethacrylat (PMMA). Es zeigt ähnliche Eigenschaften wie Paraloid B72, ist jedoch etwas härter und besitzt eine höhere Glasübergangstemperatur (ca. 50-60°C). Kallocryl wurde ursprünglich für den Dentalbereich, für die Erstellung von Prothesen entiwckelt und ist daher für Anwendungen im Bereich der Konservierung/Restaurierung noch nicht soweit erforscht wie andere PMMA basierte Polymere.
in scheme: Konservierungs- und Restaurierungsfachthesaurus für archäologische Kulturgüter
pref label: Kallocryl
  type: Label
  rank: preferred

Acrylic One
type: Concept
notation: B69C57
created: 2026-01-30
issued: 2026-01-30
modified: 2026-02-04
publisher: Leibniz-Zentrum für Archäologie (LEIZA)
broader: Acrylharz
broader transitive: Acrylharz
broader transitive: synthetisches Polymer
broader transitive: [Adhäsivstoff]
broader transitive: Konservierungs- und Restaurierungsmaterialien
broader transitive: Maßnahme
definition: Produktname einer lösungsmittelfreien Gieß- und Laminiermasse auf Basis von wässrigen Acrylharzen und natürlichen Mineralkristallen (Calciumsulfat - Gips) der Firma Acrylic One. Das System ist für Ausformungen oder den Stützkapselbau beim Abformen eine geeignete Alternative zu Reaktionsharzen (Epoxid-, Polyester-,Polyurethan, etc.)
definition:
  literal form: Produktname einer lösungsmittelfreien Gieß- und Laminiermasse auf Basis von wässrigen Acrylharzen und natürlichen Mineralkristallen (Calciumsulfat - Gips) der Firma Acrylic One. Das System ist für Ausformungen oder den Stützkapselbau beim Abformen eine geeignete Alternative zu Reaktionsharzen (Epoxid-, Polyester-,Polyurethan, etc.)
in scheme: Konservierungs- und Restaurierungsfachthesaurus für archäologische Kulturgüter
pref label: Acrylic One
  type: Label
  rank: preferred

Paraloid B48N
type: Concept
notation: B8ABD9
created: 2026-01-30
issued: 2026-01-30
modified: 2026-02-04
publisher: Leibniz-Zentrum für Archäologie (LEIZA)
broader: Acrylharz
broader transitive: Acrylharz
broader transitive: synthetisches Polymer
broader transitive: [Adhäsivstoff]
broader transitive: Konservierungs- und Restaurierungsmaterialien
broader transitive: Maßnahme
definition: Produktname eines synthetischen Acrylharzes der Firma Rohm und Haas (heute Teil von Dow Chemicals), welches von Seiten des Herstellers als Methyl-Methacrylat-Copolymer angegeben wird. Paraloid B48N zeigt ein gutes Löslichkeitsverhalten in verschiedenen, organischen Lösungsmittel wie Toluol, MEK, einigen Estern und Acetaten, ist jedoch unlöslich in den meisten Alkoholen. Seine Glasübergangstemperatur liegt bei ca. 50°C. Im Vergleich zu Paraloid B72 zeigt es eine höhere Härte, geringere Flexibilität sowie eine geringere Alterungsbeständigkeit.
definition:
  literal form: Produktname eines synthetischen Acrylharzes der Firma Rohm und Haas (heute Teil von Dow Chemicals), welches von Seiten des Herstellers als Methyl-Methacrylat-Copolymer angegeben wird. Paraloid B48N zeigt ein gutes Löslichkeitsverhalten in verschiedenen, organischen Lösungsmittel wie Toluol, MEK, einigen Estern und Acetaten, ist jedoch unlöslich in den meisten Alkoholen. Seine Glasübergangstemperatur liegt bei ca. 50°C. Im Vergleich zu Paraloid B72 zeigt es eine höhere Härte, geringere Flexibilität sowie eine geringere Alterungsbeständigkeit.
in scheme: Konservierungs- und Restaurierungsfachthesaurus für archäologische Kulturgüter
pref label: Paraloid B48N
  type: Label
  rank: preferred

Plastogen G
type: Concept
notation: C4A859
created: 2026-01-30
issued: 2026-01-30
modified: 2026-02-04
publisher: Leibniz-Zentrum für Archäologie (LEIZA)
broader: Acrylharz
broader transitive: Acrylharz
broader transitive: synthetisches Polymer
broader transitive: [Adhäsivstoff]
broader transitive: Konservierungs- und Restaurierungsmaterialien
broader transitive: Maßnahme
definition: Methylmethacrylat
in scheme: Konservierungs- und Restaurierungsfachthesaurus für archäologische Kulturgüter
pref label: Plastogen G
  type: Label
  rank: preferred

Plastogen EP
type: Concept
notation: C622FG
created: 2026-01-30
issued: 2026-01-30
modified: 2026-02-04
publisher: Leibniz-Zentrum für Archäologie (LEIZA)
broader: Acrylharz
broader transitive: Acrylharz
broader transitive: synthetisches Polymer
broader transitive: [Adhäsivstoff]
broader transitive: Konservierungs- und Restaurierungsmaterialien
broader transitive: Maßnahme
in scheme: Konservierungs- und Restaurierungsfachthesaurus für archäologische Kulturgüter
pref label: Plastogen EP
  type: Label
  rank: preferred

Acrystal
type: Concept
notation: C77887
created: 2026-01-30
issued: 2026-01-30
modified: 2026-02-04
publisher: Leibniz-Zentrum für Archäologie (LEIZA)
broader: Acrylharz
broader transitive: Acrylharz
broader transitive: synthetisches Polymer
broader transitive: [Adhäsivstoff]
broader transitive: Konservierungs- und Restaurierungsmaterialien
broader transitive: Maßnahme
definition: Produktname einer lösungsmittelfreien Gieß- und Laminiermasse auf Basis von wässrigen Acrylharzen und natürlichen Mineralkristallen (Calciumsulfat - Gips) der Firma Acrystal. Das System ist für Ausformungen oder den Stützkapselbau beim Abformen eine geeignete Alternative zu Reaktionsharzen (Epoxid-, Polyester-,Polyurethan, etc.)
definition:
  literal form: Produktname einer lösungsmittelfreien Gieß- und Laminiermasse auf Basis von wässrigen Acrylharzen und natürlichen Mineralkristallen (Calciumsulfat - Gips) der Firma Acrystal. Das System ist für Ausformungen oder den Stützkapselbau beim Abformen eine geeignete Alternative zu Reaktionsharzen (Epoxid-, Polyester-,Polyurethan, etc.)
in scheme: Konservierungs- und Restaurierungsfachthesaurus für archäologische Kulturgüter
pref label: Acrystal
  type: Label
  rank: preferred

Ebacryl
type: Concept
notation: CG2863
created: 2026-01-30
issued: 2026-01-30
modified: 2026-02-04
publisher: Leibniz-Zentrum für Archäologie (LEIZA)
broader: Acrylharz
broader transitive: Acrylharz
broader transitive: synthetisches Polymer
broader transitive: [Adhäsivstoff]
broader transitive: Konservierungs- und Restaurierungsmaterialien
broader transitive: Maßnahme
in scheme: Konservierungs- und Restaurierungsfachthesaurus für archäologische Kulturgüter
pref label: Ebacryl
  type: Label
  rank: preferred

Plexisol B 597
type: Concept
notation: D5B73B
created: 2026-01-30
issued: 2026-01-30
modified: 2026-02-04
publisher: Leibniz-Zentrum für Archäologie (LEIZA)
broader: Acrylharz
broader transitive: synthetisches Polymer
broader transitive: [Adhäsivstoff]
broader transitive: Konservierungs- und Restaurierungsmaterialien
broader transitive: Maßnahme
broader transitive: Acrylharz
in scheme: Konservierungs- und Restaurierungsfachthesaurus für archäologische Kulturgüter
pref label: Plexisol B 597
  type: Label
  rank: preferred

Cyanacrylat
type: Concept
notation: D9F783
preferred label: cyanoacrylate @en
created: 2026-01-30
issued: 2026-01-30
modified: 2026-02-04
publisher: Leibniz-Zentrum für Archäologie (LEIZA)
broader: Acrylharz
broader transitive: synthetisches Polymer
broader transitive: [Adhäsivstoff]
broader transitive: Konservierungs- und Restaurierungsmaterialien
broader transitive: Maßnahme
broader transitive: Acrylharz
in scheme: Konservierungs- und Restaurierungsfachthesaurus für archäologische Kulturgüter
pref label: Cyanacrylat
  type: Label
  rank: preferred
pref label: cyanoacrylate
  type: Label
  rank: normal
definition: Schnellklebstoff auf Basis von Monomeren der Alkylcyanacrylate und weiteren Zusatzstoffen (Weichmacher, Stabilisatoren, etc.), der sich durch eine sehr schnelle Aushärtung auszeichnet. Durch Kontakt mit Feuchtigkeit auf der Objektoberfläche oder der Luft wird eine anionische Polymerisation der Monomere initiiert, wodurch innerhalb von Sekunden eine Klebeverbindung entsteht. In der Konservierung und Restaurierung wird Cyanacrylat hauptsächlich für die temporäre und/oder punktuelle Heftung von Fragmenten oder Hilfsmitteln (Omegahäkchen, Silikonmanschetten, etc.) verwendet, da er sich aufgrund einiger Eigenschaften, wie Sprödigkeit, geringe Reversibilität und geringe Altersbeständigkeit, nicht für dauerhafte, stabile Klebungen eignet.
definition:
  literal form: Schnellklebstoff auf Basis von Monomeren der Alkylcyanacrylate und weiteren Zusatzstoffen (Weichmacher, Stabilisatoren, etc.), der sich durch eine sehr schnelle Aushärtung auszeichnet. Durch Kontakt mit Feuchtigkeit auf der Objektoberfläche oder der Luft wird eine anionische Polymerisation der Monomere initiiert, wodurch innerhalb von Sekunden eine Klebeverbindung entsteht. In der Konservierung und Restaurierung wird Cyanacrylat hauptsächlich für die temporäre und/oder punktuelle Heftung von Fragmenten oder Hilfsmitteln (Omegahäkchen, Silikonmanschetten, etc.) verwendet, da er sich aufgrund einiger Eigenschaften, wie Sprödigkeit, geringe Reversibilität und geringe Altersbeständigkeit, nicht für dauerhafte, stabile Klebungen eignet.
alternative label: Cyanoacrylat
alternative label: Sekundenkleber
narrower: Loctite
alt label: Sekundenkleber
  type: Label
  rank: preferred
alt label: Cyanoacrylat
  type: Label
  rank: normal

Technovit 5071
type: Concept
notation: G23A9A
created: 2026-01-30
issued: 2026-01-30
modified: 2026-02-04
publisher: Leibniz-Zentrum für Archäologie (LEIZA)
broader: Acrylharz
broader transitive: Acrylharz
broader transitive: synthetisches Polymer
broader transitive: [Adhäsivstoff]
broader transitive: Konservierungs- und Restaurierungsmaterialien
broader transitive: Maßnahme
in scheme: Konservierungs- und Restaurierungsfachthesaurus für archäologische Kulturgüter
pref label: Technovit 5071
  type: Label
  rank: preferred

Plexigum
type: Concept
notation: GBA321
created: 2026-01-30
issued: 2026-01-30
modified: 2026-02-04
publisher: Leibniz-Zentrum für Archäologie (LEIZA)
broader: Acrylharz
broader transitive: Acrylharz
broader transitive: synthetisches Polymer
broader transitive: [Adhäsivstoff]
broader transitive: Konservierungs- und Restaurierungsmaterialien
broader transitive: Maßnahme
in scheme: Konservierungs- und Restaurierungsfachthesaurus für archäologische Kulturgüter
pref label: Plexigum
  type: Label
  rank: preferred

Ponal Classic
type: Concept
notation: A42BD6
created: 2026-01-30
issued: 2026-01-30
modified: 2026-02-04
publisher: Leibniz-Zentrum für Archäologie (LEIZA)
broader: Polyvinylacetat
broader transitive: synthetisches Polymer
broader transitive: Polyvinylacetat
broader transitive: [Adhäsivstoff]
broader transitive: Konservierungs- und Restaurierungsmaterialien
broader transitive: Maßnahme
definition: Produktname einer wässrigen Polyvinylacetat-Dispersion, hergestellt von der Firma Henkel.
in scheme: Konservierungs- und Restaurierungsfachthesaurus für archäologische Kulturgüter
pref label: Ponal Classic
  type: Label
  rank: preferred

Mowilith 50
type: Concept
notation: A447D9
created: 2026-01-30
issued: 2026-01-30
modified: 2026-02-04
publisher: Leibniz-Zentrum für Archäologie (LEIZA)
broader: Polyvinylacetat
broader transitive: synthetisches Polymer
broader transitive: Polyvinylacetat
broader transitive: [Adhäsivstoff]
broader transitive: Konservierungs- und Restaurierungsmaterialien
broader transitive: Maßnahme
in scheme: Konservierungs- und Restaurierungsfachthesaurus für archäologische Kulturgüter
pref label: Mowilith 50
  type: Label
  rank: preferred

Polyvinylacetat
type: Concept
notation: DF5773
preferred label: polyvinyl acetate @en
created: 2026-01-30
issued: 2026-01-30
modified: 2026-02-04
publisher: Leibniz-Zentrum für Archäologie (LEIZA)
broader: synthetisches Polymer
broader transitive: synthetisches Polymer
broader transitive: [Adhäsivstoff]
broader transitive: Konservierungs- und Restaurierungsmaterialien
broader transitive: Maßnahme
in scheme: Konservierungs- und Restaurierungsfachthesaurus für archäologische Kulturgüter
pref label: Polyvinylacetat
  type: Label
  rank: preferred
pref label: polyvinyl acetate
  type: Label
  rank: normal
definition: Durch radikalische Polymerisation von Vinylacetat-Monomeren hergestelltes thermoplastisches Polymer, das in fester oder flüssiger Form (als wässrige Dispersion oder Emulsion) bezogen werden kann. Verschiedene PVAC-Produkte werden in der Restaurierung häuptsächlich für Klebungen, Festigungen und als Schutzüberzug verwendet. Die Glasübergangstemperatur von PVAC liegt in etwa bei Raumtemperatur, was zu einem weichen und klebrigen Zustand führt und unerwünschte Adhäsion von Staub und Schmutz sowie das Verformen bzw. Versagen von Klebunge verursacht.
definition:
  literal form: Durch radikalische Polymerisation von Vinylacetat-Monomeren hergestelltes thermoplastisches Polymer, das in fester oder flüssiger Form (als wässrige Dispersion oder Emulsion) bezogen werden kann. Verschiedene PVAC-Produkte werden in der Restaurierung häuptsächlich für Klebungen, Festigungen und als Schutzüberzug verwendet. Die Glasübergangstemperatur von PVAC liegt in etwa bei Raumtemperatur, was zu einem weichen und klebrigen Zustand führt und unerwünschte Adhäsion von Staub und Schmutz sowie das Verformen bzw. Versagen von Klebunge verursacht.
alternative label: PVA
alternative label: PVAC
narrower: Ponal Classic
narrower: Mowilith 50
narrower: Mowilith DV
narrower: Mowilith D025
alt label: PVAC
  type: Label
  rank: preferred
alt label: PVA
  type: Label
  rank: normal

Mowital B30H
type: Concept
notation: A974A4
created: 2026-01-30
issued: 2026-01-30
modified: 2026-02-04
publisher: Leibniz-Zentrum für Archäologie (LEIZA)
broader: Polyvinylbutyral
broader transitive: synthetisches Polymer
broader transitive: [Adhäsivstoff]
broader transitive: Konservierungs- und Restaurierungsmaterialien
broader transitive: Maßnahme
broader transitive: Polyvinylbutyral
in scheme: Konservierungs- und Restaurierungsfachthesaurus für archäologische Kulturgüter
pref label: Mowital B30H
  type: Label
  rank: preferred
definition: Produktname für ein PVB-Polymer der Firma Kuraray, wobei die Bezeichnung "B30H" hinter dem Markennamen "Mowital" eine Reihe von Eigenschaften dieses speziellen Produkttypens angibt. Für die Anwendung in der Restaurierung ist dabei vor allem die Zahl wichtig, da diese den Polymerisationsgrad angibt. Je höher die Zahl, desto höher ist der Polymerisationsgrad und desto höher ist die Viskosität des Polymers. Bei Mowital B30H handelt es sich demnach um ein Polymer mit mittlerer Viskosität.
definition:
  literal form: Produktname für ein PVB-Polymer der Firma Kuraray, wobei die Bezeichnung "B30H" hinter dem Markennamen "Mowital" eine Reihe von Eigenschaften dieses speziellen Produkttypens angibt. Für die Anwendung in der Restaurierung ist dabei vor allem die Zahl wichtig, da diese den Polymerisationsgrad angibt. Je höher die Zahl, desto höher ist der Polymerisationsgrad und desto höher ist die Viskosität des Polymers. Bei Mowital B30H handelt es sich demnach um ein Polymer mit mittlerer Viskosität.

Polyvinylbutyral
type: Concept
notation: B572B5
created: 2026-01-30
issued: 2026-01-30
modified: 2026-02-04
publisher: Leibniz-Zentrum für Archäologie (LEIZA)
broader: synthetisches Polymer
broader transitive: synthetisches Polymer
broader transitive: [Adhäsivstoff]
broader transitive: Konservierungs- und Restaurierungsmaterialien
broader transitive: Maßnahme
in scheme: Konservierungs- und Restaurierungsfachthesaurus für archäologische Kulturgüter
pref label: Polyvinylbutyral
  type: Label
  rank: preferred
definition: synthetisches, thermoplastisches Polymere aus der Gruppe der Vinylharze, welches durch Reaktion von Polyvinylalkohol mit Butyraldehyd hergestellt wird. In der Konservierung und Restaurierung wird es als Klebstoff, Bindemittel und Festigungsmittel eingesetzt. Polyvinylbutyral weist allgemein einige gute Eigenschaften für diese Verwendungen auf, wie hohe Transparenz, Reversibilität, gute Haftung auf verschiedenen Materialien sowie gut Löslichkeit in einer Reihe von polaren Lösungsmittelns wie Ethanol oder Aceton, die jedoch je nach verwendetem Produkt variieren können.
definition:
  literal form: synthetisches, thermoplastisches Polymere aus der Gruppe der Vinylharze, welches durch Reaktion von Polyvinylalkohol mit Butyraldehyd hergestellt wird. In der Konservierung und Restaurierung wird es als Klebstoff, Bindemittel und Festigungsmittel eingesetzt. Polyvinylbutyral weist allgemein einige gute Eigenschaften für diese Verwendungen auf, wie hohe Transparenz, Reversibilität, gute Haftung auf verschiedenen Materialien sowie gut Löslichkeit in einer Reihe von polaren Lösungsmittelns wie Ethanol oder Aceton, die jedoch je nach verwendetem Produkt variieren können.
alternative label: PVB
narrower: Mowital B30H
narrower: Mowital B60H
alt label: PVB
  type: Label
  rank: preferred

Mowilith DV
type: Concept
notation: AF8F61
created: 2026-01-30
issued: 2026-01-30
modified: 2026-02-04
publisher: Leibniz-Zentrum für Archäologie (LEIZA)
broader: Polyvinylacetat
broader transitive: synthetisches Polymer
broader transitive: Polyvinylacetat
broader transitive: [Adhäsivstoff]
broader transitive: Konservierungs- und Restaurierungsmaterialien
broader transitive: Maßnahme
in scheme: Konservierungs- und Restaurierungsfachthesaurus für archäologische Kulturgüter
pref label: Mowilith DV
  type: Label
  rank: preferred

Mowital B60H
type: Concept
notation: F97896
created: 2026-01-30
issued: 2026-01-30
modified: 2026-02-04
publisher: Leibniz-Zentrum für Archäologie (LEIZA)
broader: Polyvinylbutyral
broader transitive: synthetisches Polymer
broader transitive: [Adhäsivstoff]
broader transitive: Konservierungs- und Restaurierungsmaterialien
broader transitive: Maßnahme
broader transitive: Polyvinylbutyral
in scheme: Konservierungs- und Restaurierungsfachthesaurus für archäologische Kulturgüter
pref label: Mowital B60H
  type: Label
  rank: preferred
definition: Produktname für ein PVB-Polymer der Firma Kuraray, wobei die Bezeichnung "B60H" hinter dem Markennamen "Mowital" eine Reihe von Eigenschaften dieses speziellen Produkttypens angibt. Für die Anwendung in der Restaurierung ist dabei vor allem die Zahl wichtig, da diese den Polymerisationsgrad angibt. Je höher die Zahl, desto höher ist der Polymerisationsgrad und desto höher ist die Viskosität des Polymers. Bei Mowital B60H handelt es sich demnach um ein Polymer mit höherer Viskosität.
definition:
  literal form: Produktname für ein PVB-Polymer der Firma Kuraray, wobei die Bezeichnung "B60H" hinter dem Markennamen "Mowital" eine Reihe von Eigenschaften dieses speziellen Produkttypens angibt. Für die Anwendung in der Restaurierung ist dabei vor allem die Zahl wichtig, da diese den Polymerisationsgrad angibt. Je höher die Zahl, desto höher ist der Polymerisationsgrad und desto höher ist die Viskosität des Polymers. Bei Mowital B60H handelt es sich demnach um ein Polymer mit höherer Viskosität.

Loctite
type: Concept
notation: F584FC
created: 2026-01-30
issued: 2026-01-30
modified: 2026-02-04
publisher: Leibniz-Zentrum für Archäologie (LEIZA)
broader: Cyanacrylat
broader transitive: synthetisches Polymer
broader transitive: [Adhäsivstoff]
broader transitive: Konservierungs- und Restaurierungsmaterialien
broader transitive: Maßnahme
broader transitive: Acrylharz
broader transitive: Cyanacrylat
in scheme: Konservierungs- und Restaurierungsfachthesaurus für archäologische Kulturgüter
pref label: Loctite
  type: Label
  rank: preferred

Mowilith D025
type: Concept
notation: F16511
created: 2026-01-30
issued: 2026-01-30
modified: 2026-02-04
publisher: Leibniz-Zentrum für Archäologie (LEIZA)
broader: Polyvinylacetat
broader transitive: synthetisches Polymer
broader transitive: Polyvinylacetat
broader transitive: [Adhäsivstoff]
broader transitive: Konservierungs- und Restaurierungsmaterialien
broader transitive: Maßnahme
in scheme: Konservierungs- und Restaurierungsfachthesaurus für archäologische Kulturgüter
pref label: Mowilith D025
  type: Label
  rank: preferred

Celluloseether
type: Concept
notation: A44D5F
preferred label: cellulose ether @en
created: 2026-01-30
issued: 2026-01-30
modified: 2026-02-04
publisher: Leibniz-Zentrum für Archäologie (LEIZA)
broader: Cellulosederivat
broader transitive: synthetisches Polymer
broader transitive: [Adhäsivstoff]
broader transitive: Konservierungs- und Restaurierungsmaterialien
broader transitive: Maßnahme
broader transitive: Cellulosederivat
definition: synthetisches Polymer, das durch chemische Veretherung von Cellulose hergestellt wird. Je nach geneuer chemischer Zusammensetzung des gewählten Produktes ergeben sich spezifische Eigenschaften wie Viskosität, Klebekraft und Löslichkeit.
definition:
  literal form: synthetisches Polymer, das durch chemische Veretherung von Cellulose hergestellt wird. Je nach geneuer chemischer Zusammensetzung des gewählten Produktes ergeben sich spezifische Eigenschaften wie Viskosität, Klebekraft und Löslichkeit.
in scheme: Konservierungs- und Restaurierungsfachthesaurus für archäologische Kulturgüter
pref label: Celluloseether
  type: Label
  rank: preferred
pref label: cellulose ether
  type: Label
  rank: normal
narrower: Klucel® G
narrower: Methocel A4C

Cellulosederivat
type: Concept
notation: D41661
created: 2026-01-30
issued: 2026-01-30
modified: 2026-02-04
publisher: Leibniz-Zentrum für Archäologie (LEIZA)
broader: synthetisches Polymer
broader transitive: synthetisches Polymer
broader transitive: [Adhäsivstoff]
broader transitive: Konservierungs- und Restaurierungsmaterialien
broader transitive: Maßnahme
definition: Überbegriff für chemisch modifizierte Cellulosen.
in scheme: Konservierungs- und Restaurierungsfachthesaurus für archäologische Kulturgüter
narrower: Celluloseether
narrower: Celluloseester
pref label: Cellulosederivat
  type: Label
  rank: preferred

Klucel® G
type: Concept
notation: DD4B75
created: 2026-01-30
issued: 2026-01-30
modified: 2026-02-04
publisher: Leibniz-Zentrum für Archäologie (LEIZA)
broader: Celluloseether
broader transitive: synthetisches Polymer
broader transitive: [Adhäsivstoff]
broader transitive: Konservierungs- und Restaurierungsmaterialien
broader transitive: Maßnahme
broader transitive: Celluloseether
broader transitive: Cellulosederivat
definition: Produktname eines wasserlöslichen, nichtionischen Celluloseethers auf Hydroxypropylcellulose (HPC)-Basis der Firma Ashland Inc. Es ist sowohl in Wasser unter 38 °C als auch in polaren organischen Lösungsmitteln wie Ethanol und Aceton löslich. Zu seinen herausragenden Eigenschaften zählen Thermoplastizität, Flexibilität ohne Zusatz von Weichmachern sowie die Reversibilität. In der Konservierung und Restaurierung wird Klucel G häufig als Bindemittel, Verdickungsmittel oder Klebstoff verwendet, insbesondere für wasserempfindliche Materialien wie Papier, Textilien oder Leder.
definition:
  literal form: Produktname eines wasserlöslichen, nichtionischen Celluloseethers auf Hydroxypropylcellulose (HPC)-Basis der Firma Ashland Inc. Es ist sowohl in Wasser unter 38 °C als auch in polaren organischen Lösungsmitteln wie Ethanol und Aceton löslich. Zu seinen herausragenden Eigenschaften zählen Thermoplastizität, Flexibilität ohne Zusatz von Weichmachern sowie die Reversibilität. In der Konservierung und Restaurierung wird Klucel G häufig als Bindemittel, Verdickungsmittel oder Klebstoff verwendet, insbesondere für wasserempfindliche Materialien wie Papier, Textilien oder Leder.
in scheme: Konservierungs- und Restaurierungsfachthesaurus für archäologische Kulturgüter
pref label: Klucel® G
  type: Label
  rank: preferred

Methocel A4C
type: Concept
notation: F84988
created: 2026-01-30
issued: 2026-01-30
modified: 2026-02-04
publisher: Leibniz-Zentrum für Archäologie (LEIZA)
broader: Celluloseether
broader transitive: synthetisches Polymer
broader transitive: [Adhäsivstoff]
broader transitive: Konservierungs- und Restaurierungsmaterialien
broader transitive: Maßnahme
broader transitive: Celluloseether
broader transitive: Cellulosederivat
in scheme: Konservierungs- und Restaurierungsfachthesaurus für archäologische Kulturgüter
pref label: Methocel A4C
  type: Label
  rank: preferred

Archäocoll 2000 N
type: Concept
notation: A5D2D1
created: 2026-01-30
issued: 2026-01-30
modified: 2026-02-04
publisher: Leibniz-Zentrum für Archäologie (LEIZA)
broader: Cellulosenitrat
broader transitive: synthetisches Polymer
broader transitive: [Adhäsivstoff]
broader transitive: Konservierungs- und Restaurierungsmaterialien
broader transitive: Maßnahme
broader transitive: Cellulosederivat
broader transitive: Cellulosenitrat
broader transitive: Celluloseester
definition: Produktname eines cellulosebasierten Spezialkleber, der speziell für die Restaurierung von Keramik entwickelt wurde. Er eignet sich besonders für spröde und poröse Materialien wie vorgeschichtliche Keramik und zeichnet sich durch schnelle Trocknung, sehr gute Benetzung und Reversibilität aus. Archäocoll 2000 N lässt sich leicht mit Aceton entfernen und ist dauerhaft reversibel, was eine spätere Demontage ohne Schaden ermöglicht. Aufgrund seiner mechanischen Eigenschaften, die an die der Keramik angepasst sind, und der geringen Vergilbung eignet er sich gut für die Klebung und Keramik, sollte jedoch aufgrund potenzieller Korrosionsrisiken für andere Materialien in Vitrinen mit Vorsicht verwendet werden.
definition:
  literal form: Produktname eines cellulosebasierten Spezialkleber, der speziell für die Restaurierung von Keramik entwickelt wurde. Er eignet sich besonders für spröde und poröse Materialien wie vorgeschichtliche Keramik und zeichnet sich durch schnelle Trocknung, sehr gute Benetzung und Reversibilität aus. Archäocoll 2000 N lässt sich leicht mit Aceton entfernen und ist dauerhaft reversibel, was eine spätere Demontage ohne Schaden ermöglicht. Aufgrund seiner mechanischen Eigenschaften, die an die der Keramik angepasst sind, und der geringen Vergilbung eignet er sich gut für die Klebung und Keramik, sollte jedoch aufgrund potenzieller Korrosionsrisiken für andere Materialien in Vitrinen mit Vorsicht verwendet werden.
in scheme: Konservierungs- und Restaurierungsfachthesaurus für archäologische Kulturgüter
pref label: Archäocoll 2000 N
  type: Label
  rank: preferred

Cellulosenitrat
type: Concept
notation: GC7998
preferred label: cellulose nitrate @en
created: 2026-01-30
issued: 2026-01-30
modified: 2026-02-04
publisher: Leibniz-Zentrum für Archäologie (LEIZA)
broader: Celluloseester
broader transitive: synthetisches Polymer
broader transitive: [Adhäsivstoff]
broader transitive: Konservierungs- und Restaurierungsmaterialien
broader transitive: Maßnahme
broader transitive: Cellulosederivat
broader transitive: Celluloseester
definition: synthetisches Polymer, das durch die Veresterung von Cellulose mit Nitriersäure (Gemisch aus konzentrierter Salpeter- und konzentrierter Schwefelsäure) hergestellt wird. Vermischt mit Weichmachernund gelöst in Lösemitteln wird es seit dem späten 19. Jh. als eines der ersten synthetischen Harze im Bereich der Konservierung/Restaurierung verwendet. Cellulosenitrat zeichnet sich durch eine Reihe von Eigenschaften aus, die es als beliebtes Konservierungsmittel erscheinen lässte (z.B. schnelle Trocknung, einfache Handhabung, gute Haftung auf verschiedenen Materialien, hohe Glasübergangstemperatur, etc). Allerdings neigt es zum vergilben und zeigte bei durchgeführten Studien (Oddy-Test) korrosiove Wirkung auf Metalle.
definition:
  literal form: synthetisches Polymer, das durch die Veresterung von Cellulose mit Nitriersäure (Gemisch aus konzentrierter Salpeter- und konzentrierter Schwefelsäure) hergestellt wird. Vermischt mit Weichmachernund gelöst in Lösemitteln wird es seit dem späten 19. Jh. als eines der ersten synthetischen Harze im Bereich der Konservierung/Restaurierung verwendet. Cellulosenitrat zeichnet sich durch eine Reihe von Eigenschaften aus, die es als beliebtes Konservierungsmittel erscheinen lässte (z.B. schnelle Trocknung, einfache Handhabung, gute Haftung auf verschiedenen Materialien, hohe Glasübergangstemperatur, etc). Allerdings neigt es zum vergilben und zeigte bei durchgeführten Studien (Oddy-Test) korrosiove Wirkung auf Metalle.
in scheme: Konservierungs- und Restaurierungsfachthesaurus für archäologische Kulturgüter
narrower: Archäocoll 2000 N
narrower: Mecosan S
narrower: Mecosan L-TR
narrower: Pantarol® Metallschutz Nr. 100
narrower: Zaponlack
pref label: Cellulosenitrat
  type: Label
  rank: preferred
pref label: cellulose nitrate
  type: Label
  rank: normal

Celluloseester
type: Concept
notation: A9A929
preferred label: cellulose ester @en
created: 2026-01-30
issued: 2026-01-30
modified: 2026-02-04
publisher: Leibniz-Zentrum für Archäologie (LEIZA)
broader: Cellulosederivat
broader transitive: synthetisches Polymer
broader transitive: [Adhäsivstoff]
broader transitive: Konservierungs- und Restaurierungsmaterialien
broader transitive: Maßnahme
broader transitive: Cellulosederivat
definition: synthetisches Polymer, das duch die chemische Modifikation (Veresterung) von natürlicher Cellulose mit organischen Säuren oder Mineralsäuren hergestellt wird.
in scheme: Konservierungs- und Restaurierungsfachthesaurus für archäologische Kulturgüter
narrower: Cellulosenitrat
pref label: Celluloseester
  type: Label
  rank: preferred
pref label: cellulose ester
  type: Label
  rank: normal

Mecosan L-TR
type: Concept
notation: C65F47
created: 2026-01-30
issued: 2026-01-30
modified: 2026-02-04
publisher: Leibniz-Zentrum für Archäologie (LEIZA)
broader: Cellulosenitrat
broader transitive: synthetisches Polymer
broader transitive: [Adhäsivstoff]
broader transitive: Konservierungs- und Restaurierungsmaterialien
broader transitive: Maßnahme
broader transitive: Cellulosederivat
broader transitive: Cellulosenitrat
broader transitive: Celluloseester
in scheme: Konservierungs- und Restaurierungsfachthesaurus für archäologische Kulturgüter
pref label: Mecosan L-TR
  type: Label
  rank: preferred

Polyvinylalkohol
type: Concept
notation: C838C1
created: 2026-01-30
issued: 2026-01-30
modified: 2026-02-04
publisher: Leibniz-Zentrum für Archäologie (LEIZA)
broader: synthetisches Polymer
broader transitive: synthetisches Polymer
broader transitive: [Adhäsivstoff]
broader transitive: Konservierungs- und Restaurierungsmaterialien
broader transitive: Maßnahme
definition: thermoplastisches Polymer, welches durch Hydrolyse von Polyvinylacetat synthetisiert wird. Es ist beständig gegenüber Ölen, Fetten und organischen Lösungsmitteln, jedoch empfindlich gegenüber Feuchtigkeit. In der Restaurierung wird PVAL als reversibler Klebstoff für poröse Materialien, Bindemittel oder Beschichtungsmaterial eingesetzt.
definition:
  literal form: thermoplastisches Polymer, welches durch Hydrolyse von Polyvinylacetat synthetisiert wird. Es ist beständig gegenüber Ölen, Fetten und organischen Lösungsmitteln, jedoch empfindlich gegenüber Feuchtigkeit. In der Restaurierung wird PVAL als reversibler Klebstoff für poröse Materialien, Bindemittel oder Beschichtungsmaterial eingesetzt.
in scheme: Konservierungs- und Restaurierungsfachthesaurus für archäologische Kulturgüter
pref label: Polyvinylalkohol
  type: Label
  rank: preferred
alternative label: PVAL
alt label: PVAL
  type: Label
  rank: preferred

Polyethylenglycol
type: Concept
notation: F89522
created: 2026-01-30
issued: 2026-01-30
modified: 2026-02-04
publisher: Leibniz-Zentrum für Archäologie (LEIZA)
broader: synthetisches Polymer
broader transitive: synthetisches Polymer
broader transitive: [Adhäsivstoff]
broader transitive: Konservierungs- und Restaurierungsmaterialien
broader transitive: Maßnahme
definition: synthetischer Polyether aus sich wiederholenden -CH2-CH2-O-Monomeren, der durch Polymerisation von Ethylenoxid hergestellt wird. PEG kann in verschiedenen Molekulargewichten bezogen werden, wodurch sich unterschiedliche spezifische Eigenschaften ergeben. Je länger die Molekülkette (je höher die Zahl hinter PEG), desto höher die Viskosität des PEGs. In der Konservierung und Restaurierung wird PEG hauptsächlich als Festigungsmittel für wassergelagerte organische Materialien (z.B. Holz oder Leder) verwendet. Das hygroskopische Polymer ersetzt dabei das Wasser in den Zellwänden, stabilisiert die Objektstruktur und verhindert beim Trocknungsprozess ein Schrumpfen und Reißen des Materials.
definition:
  literal form: synthetischer Polyether aus sich wiederholenden -CH2-CH2-O-Monomeren, der durch Polymerisation von Ethylenoxid hergestellt wird. PEG kann in verschiedenen Molekulargewichten bezogen werden, wodurch sich unterschiedliche spezifische Eigenschaften ergeben. Je länger die Molekülkette (je höher die Zahl hinter PEG), desto höher die Viskosität des PEGs. In der Konservierung und Restaurierung wird PEG hauptsächlich als Festigungsmittel für wassergelagerte organische Materialien (z.B. Holz oder Leder) verwendet. Das hygroskopische Polymer ersetzt dabei das Wasser in den Zellwänden, stabilisiert die Objektstruktur und verhindert beim Trocknungsprozess ein Schrumpfen und Reißen des Materials.
in scheme: Konservierungs- und Restaurierungsfachthesaurus für archäologische Kulturgüter
pref label: Polyethylenglycol
  type: Label
  rank: preferred
alternative label: PEG
alt label: PEG
  type: Label
  rank: preferred

Pantarol® Metallschutz Nr. 100
type: Concept
notation: FD8AG2
created: 2026-01-30
issued: 2026-01-30
modified: 2026-02-04
publisher: Leibniz-Zentrum für Archäologie (LEIZA)
broader: Cellulosenitrat
broader transitive: synthetisches Polymer
broader transitive: [Adhäsivstoff]
broader transitive: Konservierungs- und Restaurierungsmaterialien
broader transitive: Maßnahme
broader transitive: Cellulosederivat
broader transitive: Cellulosenitrat
broader transitive: Celluloseester
definition: Produktname eines farblosen Harzes auf Cellulosenitrat-Epoxidharz-Basis der Firma Edelweiss Industrielacke Lutzenberger GmbH.
in scheme: Konservierungs- und Restaurierungsfachthesaurus für archäologische Kulturgüter
pref label: Pantarol® Metallschutz Nr. 100
  type: Label
  rank: preferred

Zaponlack
type: Concept
notation: GC6999
created: 2026-01-30
issued: 2026-01-30
modified: 2026-02-04
publisher: Leibniz-Zentrum für Archäologie (LEIZA)
broader: Cellulosenitrat
broader transitive: synthetisches Polymer
broader transitive: [Adhäsivstoff]
broader transitive: Konservierungs- und Restaurierungsmaterialien
broader transitive: Maßnahme
broader transitive: Cellulosederivat
broader transitive: Cellulosenitrat
broader transitive: Celluloseester
in scheme: Konservierungs- und Restaurierungsfachthesaurus für archäologische Kulturgüter
pref label: Zaponlack
  type: Label
  rank: preferred

Shellsol A
type: Concept
notation: A32B47
created: 2026-01-30
issued: 2026-01-30
modified: 2026-02-04
publisher: Leibniz-Zentrum für Archäologie (LEIZA)
broader: Siedegrenzbenzin
broader transitive: Siedegrenzbenzin
broader transitive: Konservierungs- und Restaurierungsmaterialien
broader transitive: Lösungsmittel
broader transitive: Maßnahme
definition: farblos, klare Flüssigkeit die als hocharomatisches, unpolares Lösungsmittel fungiert und mit den meisten organischen Flüssigkeiten mischbar ist. In der Konservierung und Restaurierung wird es hauptsächlich als Lösungsmittel für viele Öle, Fette, Wachse und Natur- bzw. Kunstharze eingesetzt.
definition:
  literal form: farblos, klare Flüssigkeit die als hocharomatisches, unpolares Lösungsmittel fungiert und mit den meisten organischen Flüssigkeiten mischbar ist. In der Konservierung und Restaurierung wird es hauptsächlich als Lösungsmittel für viele Öle, Fette, Wachse und Natur- bzw. Kunstharze eingesetzt.
in scheme: Konservierungs- und Restaurierungsfachthesaurus für archäologische Kulturgüter
pref label: Shellsol A
  type: Label
  rank: preferred

Shellsol T
type: Concept
notation: A7B4F9
created: 2026-01-30
issued: 2026-01-30
modified: 2026-02-04
publisher: Leibniz-Zentrum für Archäologie (LEIZA)
broader: Siedegrenzbenzin
broader transitive: Siedegrenzbenzin
broader transitive: Konservierungs- und Restaurierungsmaterialien
broader transitive: Lösungsmittel
broader transitive: Maßnahme
definition: farbloses, klares unpolares Lösungsmittelgemisch aus Iso-Aliphaten. Es ist nahezu aromatenfrei und geruchsarm. In der Restaurierung findet es Verwendung als Ersatz für Balsamterpentinöl, als Lösemittel für Öle, Wachse, ölbasierte Lacke und Farben
definition:
  literal form: farbloses, klares unpolares Lösungsmittelgemisch aus Iso-Aliphaten. Es ist nahezu aromatenfrei und geruchsarm. In der Restaurierung findet es Verwendung als Ersatz für Balsamterpentinöl, als Lösemittel für Öle, Wachse, ölbasierte Lacke und Farben
in scheme: Konservierungs- und Restaurierungsfachthesaurus für archäologische Kulturgüter
pref label: Shellsol T
  type: Label
  rank: preferred

Kauramin® Tränkharz 801
type: Concept
notation: B6CAB5
created: 2026-01-30
issued: 2026-01-30
modified: 2026-02-04
publisher: Leibniz-Zentrum für Archäologie (LEIZA)
broader: Melamin-Formaldehydharz
broader transitive: synthetisches Polymer
broader transitive: Konservierungs- und Restaurierungsmaterialien
broader transitive: Maßnahme
broader transitive: Melamin-Formaldehydharz
broader transitive: [Adhäsivstoff]
in scheme: Konservierungs- und Restaurierungsfachthesaurus für archäologische Kulturgüter
pref label: Kauramin® Tränkharz 801
  type: Label
  rank: preferred

Melamin-Formaldehydharz
type: Concept
notation: DF633G
created: 2026-01-30
issued: 2026-01-30
modified: 2026-02-04
publisher: Leibniz-Zentrum für Archäologie (LEIZA)
broader: synthetisches Polymer
broader transitive: synthetisches Polymer
broader transitive: Konservierungs- und Restaurierungsmaterialien
broader transitive: Maßnahme
broader transitive: [Adhäsivstoff]
definition: Durch Polykondensation von Melamin und Formaldehyd hergestellter Kunststoff, der hauptsächlich für die Konservierung archäologischer Hölzer verwendet wird. Melaminharze ist durchsichtig, lichtecht und wasserfest, zusätzlich weist es eine hohe mechanische Festigkeit sowie eine gute chemische Beständigkeit gegen schwache Laugen und Lösemittel auf.
definition:
  literal form: Durch Polykondensation von Melamin und Formaldehyd hergestellter Kunststoff, der hauptsächlich für die Konservierung archäologischer Hölzer verwendet wird. Melaminharze ist durchsichtig, lichtecht und wasserfest, zusätzlich weist es eine hohe mechanische Festigkeit sowie eine gute chemische Beständigkeit gegen schwache Laugen und Lösemittel auf.
in scheme: Konservierungs- und Restaurierungsfachthesaurus für archäologische Kulturgüter
pref label: Melamin-Formaldehydharz
  type: Label
  rank: preferred
alternative label: Melaminharz
alt label: Melaminharz
  type: Label
  rank: preferred
narrower: Kauramin® Tränkharz 801
narrower: Kauramin CE 5549
narrower: Arigal C
narrower: Kauramin® Tränkharz 800
narrower: Lyfix DML
narrower: Lyofix CHN

Kauramin CE 5549
type: Concept
notation: BFB162
created: 2026-01-30
issued: 2026-01-30
modified: 2026-02-04
publisher: Leibniz-Zentrum für Archäologie (LEIZA)
broader: Melamin-Formaldehydharz
broader transitive: synthetisches Polymer
broader transitive: Konservierungs- und Restaurierungsmaterialien
broader transitive: Maßnahme
broader transitive: Melamin-Formaldehydharz
broader transitive: [Adhäsivstoff]
definition: Begriff aussortiert!
in scheme: Konservierungs- und Restaurierungsfachthesaurus für archäologische Kulturgüter
pref label: Kauramin CE 5549
  type: Label
  rank: preferred

Arigal C
type: Concept
notation: BGACD3
created: 2026-01-30
issued: 2026-01-30
modified: 2026-02-04
publisher: Leibniz-Zentrum für Archäologie (LEIZA)
broader: Melamin-Formaldehydharz
broader transitive: synthetisches Polymer
broader transitive: Konservierungs- und Restaurierungsmaterialien
broader transitive: Maßnahme
broader transitive: Melamin-Formaldehydharz
broader transitive: [Adhäsivstoff]
definition: Produktname eines wasserverdünnbaren Melamin-Formaldehydkondensats der Firma Ciba. Es wurde in den 70er Jahren für die Konservierung von archäologischen Hölzern verwendet, dann allerdings vom Markt genommen und durch das Nachfolgerprodukt Lyfix DML ersetzt.
definition:
  literal form: Produktname eines wasserverdünnbaren Melamin-Formaldehydkondensats der Firma Ciba. Es wurde in den 70er Jahren für die Konservierung von archäologischen Hölzern verwendet, dann allerdings vom Markt genommen und durch das Nachfolgerprodukt Lyfix DML ersetzt.
in scheme: Konservierungs- und Restaurierungsfachthesaurus für archäologische Kulturgüter
pref label: Arigal C
  type: Label
  rank: preferred

Kauramin® Tränkharz 800
type: Concept
notation: C4D6G3
created: 2026-01-30
issued: 2026-01-30
modified: 2026-02-04
publisher: Leibniz-Zentrum für Archäologie (LEIZA)
broader: Melamin-Formaldehydharz
broader transitive: synthetisches Polymer
broader transitive: Konservierungs- und Restaurierungsmaterialien
broader transitive: Maßnahme
broader transitive: Melamin-Formaldehydharz
broader transitive: [Adhäsivstoff]
definition: Produktname des wasserverdünnbaren Melamin-Formaldehydharzes der Firma BASF. Wurde vormals unter der Bezeichnung Kauramin CE 5549 im Jahr 1936 auf den Markt gebracht und nach erfolgreicher Bewährung in Kauramin Tränkharz 800 umbenannt. Im Jahr 2023 wurde das Produkt vom Markt genommen und durch das Nachfolgeprodukt Kauramin Tränkharz 801 ersetzt.
definition:
  literal form: Produktname des wasserverdünnbaren Melamin-Formaldehydharzes der Firma BASF. Wurde vormals unter der Bezeichnung Kauramin CE 5549 im Jahr 1936 auf den Markt gebracht und nach erfolgreicher Bewährung in Kauramin Tränkharz 800 umbenannt. Im Jahr 2023 wurde das Produkt vom Markt genommen und durch das Nachfolgeprodukt Kauramin Tränkharz 801 ersetzt.
in scheme: Konservierungs- und Restaurierungsfachthesaurus für archäologische Kulturgüter
pref label: Kauramin® Tränkharz 800
  type: Label
  rank: preferred
alternative label: Kauramin CE5549
alt label: Kauramin CE5549
  type: Label
  rank: preferred

Lyfix DML
type: Concept
notation: D2F2D5
created: 2026-01-30
issued: 2026-01-30
modified: 2026-02-04
publisher: Leibniz-Zentrum für Archäologie (LEIZA)
broader: Melamin-Formaldehydharz
broader transitive: synthetisches Polymer
broader transitive: Konservierungs- und Restaurierungsmaterialien
broader transitive: Maßnahme
broader transitive: Melamin-Formaldehydharz
broader transitive: [Adhäsivstoff]
in scheme: Konservierungs- und Restaurierungsfachthesaurus für archäologische Kulturgüter
pref label: Lyfix DML
  type: Label
  rank: preferred

Lyofix CHN
type: Concept
notation: FF4767
created: 2026-01-30
issued: 2026-01-30
modified: 2026-02-04
publisher: Leibniz-Zentrum für Archäologie (LEIZA)
broader: Melamin-Formaldehydharz
broader transitive: synthetisches Polymer
broader transitive: Konservierungs- und Restaurierungsmaterialien
broader transitive: Maßnahme
broader transitive: Melamin-Formaldehydharz
broader transitive: [Adhäsivstoff]
in scheme: Konservierungs- und Restaurierungsfachthesaurus für archäologische Kulturgüter
pref label: Lyofix CHN
  type: Label
  rank: preferred

Destilliertes Wasser
type: Concept
notation: B6C1A7
preferred label: distilled water @en
created: 2026-01-30
issued: 2026-01-30
modified: 2026-02-04
publisher: Leibniz-Zentrum für Archäologie (LEIZA)
broader: Wasser
broader transitive: Konservierungs- und Restaurierungsmaterialien
broader transitive: Lösungsmittel
broader transitive: Maßnahme
broader transitive: Wasser
definition: Wasser, bei dem durch Erhitzen und Rekondensieren des Dampfes nahezu alle gelösten Mineralien, Salze und Verunreinigungen entfernt wurden.
in scheme: Konservierungs- und Restaurierungsfachthesaurus für archäologische Kulturgüter
pref label: Destilliertes Wasser
  type: Label
  rank: preferred
pref label: distilled water
  type: Label
  rank: normal

Demineralisiertes Wasser
type: Concept
notation: BBF7BG
created: 2026-01-30
issued: 2026-01-30
modified: 2026-02-04
publisher: Leibniz-Zentrum für Archäologie (LEIZA)
broader: Wasser
broader transitive: Konservierungs- und Restaurierungsmaterialien
broader transitive: Lösungsmittel
broader transitive: Maßnahme
broader transitive: Wasser
definition: Wasser, aus dem die meisten gelösten Mineralien entfernt wurden. Dies kann durch verschiedene Methoden erreicht werden. Je nach Grad der Reinheit wird demineralisiertes Wasser auch deionisiertes oder vollentsalztes Wasser genannt. Demineralisiertes Wasser unterscheidet sich von destilliertem Wasser durch möglicherweise im Wasser verbliebene apolare oder organische Stoffe.
definition:
  literal form: Wasser, aus dem die meisten gelösten Mineralien entfernt wurden. Dies kann durch verschiedene Methoden erreicht werden. Je nach Grad der Reinheit wird demineralisiertes Wasser auch deionisiertes oder vollentsalztes Wasser genannt. Demineralisiertes Wasser unterscheidet sich von destilliertem Wasser durch möglicherweise im Wasser verbliebene apolare oder organische Stoffe.
in scheme: Konservierungs- und Restaurierungsfachthesaurus für archäologische Kulturgüter
pref label: Demineralisiertes Wasser
  type: Label
  rank: preferred
alternative label: Deionisiertes Wasser
alternative label: vollentsalztes Wasser
alt label: Deionisiertes Wasser
  type: Label
  rank: preferred
alt label: vollentsalztes Wasser
  type: Label
  rank: normal

Natriumnitrit
type: Concept
notation: A75619
created: 2026-01-30
issued: 2026-01-30
modified: 2026-02-04
publisher: Leibniz-Zentrum für Archäologie (LEIZA)
broader: Korrosionsinhibitor
broader transitive: Korrosionsinhibitor
broader transitive: Konservierungs- und Restaurierungsmaterialien
broader transitive: Maßnahme
in scheme: Konservierungs- und Restaurierungsfachthesaurus für archäologische Kulturgüter
pref label: Natriumnitrit
  type: Label
  rank: preferred

Korrosionsinhibitor
type: Concept
notation: ACFF37
created: 2026-01-30
issued: 2026-01-30
modified: 2026-02-04
publisher: Leibniz-Zentrum für Archäologie (LEIZA)
broader: Konservierungs- und Restaurierungsmaterialien
broader transitive: Konservierungs- und Restaurierungsmaterialien
broader transitive: Maßnahme
definition: chemische Substanz, die bereits in geringer Konzentrationen in der Lage ist die Korrosionsgeschwindigkeit von Metallen in aggressiven Umgebungen zu verringern. Sie wirken, indem sie schützende Filme auf der Metalloberfläche bilden und somit die chemische Reaktionen hemmen. In der Konservierung und Restaurierung finden sie Anwendung, um metallische Artefakte vor weiterer Schädigung zu bewahren und ihre langfristige Stabilität zu gewährleisten.
definition:
  literal form: chemische Substanz, die bereits in geringer Konzentrationen in der Lage ist die Korrosionsgeschwindigkeit von Metallen in aggressiven Umgebungen zu verringern. Sie wirken, indem sie schützende Filme auf der Metalloberfläche bilden und somit die chemische Reaktionen hemmen. In der Konservierung und Restaurierung finden sie Anwendung, um metallische Artefakte vor weiterer Schädigung zu bewahren und ihre langfristige Stabilität zu gewährleisten.
in scheme: Konservierungs- und Restaurierungsfachthesaurus für archäologische Kulturgüter
narrower: Natriumnitrit
narrower: Benzotriazol
narrower: Tannin
narrower: Diethanolamin
pref label: Korrosionsinhibitor
  type: Label
  rank: preferred

Benzotriazol
type: Concept
notation: B6B615
preferred label: benzotriazole @en
created: 2026-01-30
issued: 2026-01-30
modified: 2026-02-04
publisher: Leibniz-Zentrum für Archäologie (LEIZA)
broader: Korrosionsinhibitor
broader transitive: Korrosionsinhibitor
broader transitive: Konservierungs- und Restaurierungsmaterialien
broader transitive: Maßnahme
in scheme: Konservierungs- und Restaurierungsfachthesaurus für archäologische Kulturgüter
pref label: Benzotriazol
  type: Label
  rank: preferred
pref label: benzotriazole
  type: Label
  rank: normal
alternative label: BTA
alt label: BTA
  type: Label
  rank: preferred

Tannin
type: Concept
notation: BADDA1
created: 2026-01-30
issued: 2026-01-30
modified: 2026-02-04
publisher: Leibniz-Zentrum für Archäologie (LEIZA)
broader: Korrosionsinhibitor
broader transitive: Korrosionsinhibitor
broader transitive: Konservierungs- und Restaurierungsmaterialien
broader transitive: Maßnahme
in scheme: Konservierungs- und Restaurierungsfachthesaurus für archäologische Kulturgüter
pref label: Tannin
  type: Label
  rank: preferred

Diethanolamin
type: Concept
notation: F845F7
created: 2026-01-30
issued: 2026-01-30
modified: 2026-02-04
publisher: Leibniz-Zentrum für Archäologie (LEIZA)
broader: Korrosionsinhibitor
broader transitive: Korrosionsinhibitor
broader transitive: Konservierungs- und Restaurierungsmaterialien
broader transitive: Maßnahme
in scheme: Konservierungs- und Restaurierungsfachthesaurus für archäologische Kulturgüter
pref label: Diethanolamin
  type: Label
  rank: preferred

Titriplex III
type: Concept
notation: CC2F8A
created: 2026-01-30
issued: 2026-01-30
modified: 2026-02-04
publisher: Leibniz-Zentrum für Archäologie (LEIZA)
broader: Ethylendiamintetraessigsäure
broader transitive: Konservierungs- und Restaurierungsmaterialien
broader transitive: Maßnahme
broader transitive: Ethylendiamintetraessigsäure
broader transitive: Komplexbildner
definition: Handelsname der Firma Merck für das Dinatriumsalz von EDTA (Na2EDTA).
in scheme: Konservierungs- und Restaurierungsfachthesaurus für archäologische Kulturgüter
pref label: Titriplex III
  type: Label
  rank: preferred

Ethylendiamintetraessigsäure
type: Concept
notation: D9F9D8
preferred label: ethylenediaminetetra acetic acid @en
created: 2026-01-30
issued: 2026-01-30
modified: 2026-02-04
publisher: Leibniz-Zentrum für Archäologie (LEIZA)
broader: Komplexbildner
broader transitive: Konservierungs- und Restaurierungsmaterialien
broader transitive: Maßnahme
broader transitive: Komplexbildner
definition: organischer Komplexbildner, der aufgrund seiner chemischen Struktur in der Lage ist, selektiv Metallionen aus Verbindungen zu extrahieren und in stabile, wasserlösliche Komplexe zu überführen. In der Konservierung und Restaurierung ist ETDA ein häufig eingesetztes Mittel zur Entfernung ungewollter Metallablagerungen bzw. Korrosionsprodukte, da es durch seine selektive Wirkung verhältnismäßig schonend zur originalen Objektoberfläche ist.
definition:
  literal form: organischer Komplexbildner, der aufgrund seiner chemischen Struktur in der Lage ist, selektiv Metallionen aus Verbindungen zu extrahieren und in stabile, wasserlösliche Komplexe zu überführen. In der Konservierung und Restaurierung ist ETDA ein häufig eingesetztes Mittel zur Entfernung ungewollter Metallablagerungen bzw. Korrosionsprodukte, da es durch seine selektive Wirkung verhältnismäßig schonend zur originalen Objektoberfläche ist.
in scheme: Konservierungs- und Restaurierungsfachthesaurus für archäologische Kulturgüter
narrower: Titriplex III
pref label: Ethylendiamintetraessigsäure
  type: Label
  rank: preferred
pref label: ethylenediaminetetra acetic acid
  type: Label
  rank: normal
alternative label: ETDA
alt label: ETDA
  type: Label
  rank: preferred

Komplexbildner
type: Concept
notation: F87124
preferred label: sequestering agent @en
created: 2026-01-30
issued: 2026-01-30
modified: 2026-02-04
publisher: Leibniz-Zentrum für Archäologie (LEIZA)
broader: Konservierungs- und Restaurierungsmaterialien
broader transitive: Konservierungs- und Restaurierungsmaterialien
broader transitive: Maßnahme
definition: chemischer Stoff, der stabile Verbindungen (Komplexe) mit Metallionen eingeht, wodurch sich deren Reaktivität und Löslichkeit verändert. In der Restaurierung werden solche Stoffe vor allem verwendet, um unerwünschte Metallionen oder Ablagerungen in/auf Objekten zu entfernen. Dabei kann es jedoch auch zu einer unkontrollierten, fortschreitenden Reaktion mit dem ursprünglichen Material kommen, weshalb Komplexbilder mit Bedacht eingesetzt werden müssen.
definition:
  literal form: chemischer Stoff, der stabile Verbindungen (Komplexe) mit Metallionen eingeht, wodurch sich deren Reaktivität und Löslichkeit verändert. In der Restaurierung werden solche Stoffe vor allem verwendet, um unerwünschte Metallionen oder Ablagerungen in/auf Objekten zu entfernen. Dabei kann es jedoch auch zu einer unkontrollierten, fortschreitenden Reaktion mit dem ursprünglichen Material kommen, weshalb Komplexbilder mit Bedacht eingesetzt werden müssen.
in scheme: Konservierungs- und Restaurierungsfachthesaurus für archäologische Kulturgüter
narrower: Ethylendiamintetraessigsäure
narrower: Thioharnstoff
pref label: Komplexbildner
  type: Label
  rank: preferred
pref label: sequestering agent
  type: Label
  rank: normal
alternative label: Chelatbildner
alt label: Chelatbildner
  type: Label
  rank: preferred

Thioharnstoff
type: Concept
notation: F49B77
preferred label: thiourea @en
created: 2026-01-30
issued: 2026-01-30
modified: 2026-02-04
publisher: Leibniz-Zentrum für Archäologie (LEIZA)
broader: Komplexbildner
broader transitive: Konservierungs- und Restaurierungsmaterialien
broader transitive: Maßnahme
broader transitive: Komplexbildner
in scheme: Konservierungs- und Restaurierungsfachthesaurus für archäologische Kulturgüter
pref label: Thioharnstoff
  type: Label
  rank: preferred
pref label: thiourea
  type: Label
  rank: normal

Plasma
type: Concept
notation: A7C8CB
created: 2026-01-30
issued: 2026-01-30
modified: 2026-02-04
publisher: Leibniz-Zentrum für Archäologie (LEIZA)
broader: Reduktionsmittel
broader transitive: Konservierungs- und Restaurierungsmaterialien
broader transitive: Maßnahme
broader transitive: Reduktionsmittel
in scheme: Konservierungs- und Restaurierungsfachthesaurus für archäologische Kulturgüter
pref label: Plasma
  type: Label
  rank: preferred
definition: ionisiertes, energiereiches Gas, welches entweder durch hohe Temperaturen von mehreren 1000°C oder durch den Durchfluss elektrischen Stroms entsteht. Im Vergleich zu "normalem" Gas, das nicht ionisiert ist, unterscheides sich Plasma durch die Fähigkeit elektrischen Strom zu leiten. Dadurch ist es in der Lage magnetische Felder und elektromagnetische Wellen zu absorbieren, reflektieren und zu emmittieren und wird gleichzeitig selbst von diesen beeinflusst. In der Restaurierung kann Plasma zur Reduktion von Korrosionsprodukten in deren ursprünglichen metallischen Zustand verwendet werden.
definition:
  literal form: ionisiertes, energiereiches Gas, welches entweder durch hohe Temperaturen von mehreren 1000°C oder durch den Durchfluss elektrischen Stroms entsteht. Im Vergleich zu "normalem" Gas, das nicht ionisiert ist, unterscheides sich Plasma durch die Fähigkeit elektrischen Strom zu leiten. Dadurch ist es in der Lage magnetische Felder und elektromagnetische Wellen zu absorbieren, reflektieren und zu emmittieren und wird gleichzeitig selbst von diesen beeinflusst. In der Restaurierung kann Plasma zur Reduktion von Korrosionsprodukten in deren ursprünglichen metallischen Zustand verwendet werden.
narrower: Stickstoffplasma
narrower: Argonplasma
narrower: Sauerstoffplasma
narrower: Methanplasma

Reduktionsmittel
type: Concept
notation: B3FCA1
preferred label: reducing agent @en
created: 2026-01-30
issued: 2026-01-30
modified: 2026-02-04
publisher: Leibniz-Zentrum für Archäologie (LEIZA)
broader: Konservierungs- und Restaurierungsmaterialien
broader transitive: Konservierungs- und Restaurierungsmaterialien
broader transitive: Maßnahme
in scheme: Konservierungs- und Restaurierungsfachthesaurus für archäologische Kulturgüter
pref label: Reduktionsmittel
  type: Label
  rank: preferred
pref label: reducing agent
  type: Label
  rank: normal
definition: chemische Substanz, die in der Lage ist bei einer chemischen Reaktion andere Substanzen zu reduzieren. Das Reduktionsmittel fungiert dabei als Eletronendonator (gibt Elektronen ab) und wird somit selbst oxidiert (Redoxreaktion). In der Restaurierung werden Reduktionsmittel eingesetzt, um die ungewollte Oxidation von Metallen zu reduzieren, Korrosionsprodukte zu entfernen und die ursprüngliche Erscheinung von Objekten wiederherzustellen.
definition:
  literal form: chemische Substanz, die in der Lage ist bei einer chemischen Reaktion andere Substanzen zu reduzieren. Das Reduktionsmittel fungiert dabei als Eletronendonator (gibt Elektronen ab) und wird somit selbst oxidiert (Redoxreaktion). In der Restaurierung werden Reduktionsmittel eingesetzt, um die ungewollte Oxidation von Metallen zu reduzieren, Korrosionsprodukte zu entfernen und die ursprüngliche Erscheinung von Objekten wiederherzustellen.
narrower: Plasma
narrower: Natriumsulfit
narrower: Natriumdithionit
narrower: Natriumborhydrid
narrower: Natriumthiosulfat

Stickstoffplasma
type: Concept
notation: BB7D84
created: 2026-01-30
issued: 2026-01-30
modified: 2026-02-04
publisher: Leibniz-Zentrum für Archäologie (LEIZA)
broader: Plasma
broader transitive: Konservierungs- und Restaurierungsmaterialien
broader transitive: Maßnahme
broader transitive: Plasma
broader transitive: Reduktionsmittel
in scheme: Konservierungs- und Restaurierungsfachthesaurus für archäologische Kulturgüter
pref label: Stickstoffplasma
  type: Label
  rank: preferred

Argonplasma
type: Concept
notation: C4F616
created: 2026-01-30
issued: 2026-01-30
modified: 2026-02-04
publisher: Leibniz-Zentrum für Archäologie (LEIZA)
broader: Plasma
broader transitive: Konservierungs- und Restaurierungsmaterialien
broader transitive: Maßnahme
broader transitive: Plasma
broader transitive: Reduktionsmittel
in scheme: Konservierungs- und Restaurierungsfachthesaurus für archäologische Kulturgüter
pref label: Argonplasma
  type: Label
  rank: preferred

Sauerstoffplasma
type: Concept
notation: CC687C
created: 2026-01-30
issued: 2026-01-30
modified: 2026-02-04
publisher: Leibniz-Zentrum für Archäologie (LEIZA)
broader: Plasma
broader transitive: Konservierungs- und Restaurierungsmaterialien
broader transitive: Maßnahme
broader transitive: Plasma
broader transitive: Reduktionsmittel
in scheme: Konservierungs- und Restaurierungsfachthesaurus für archäologische Kulturgüter
pref label: Sauerstoffplasma
  type: Label
  rank: preferred

Methanplasma
type: Concept
notation: CD75GD
created: 2026-01-30
issued: 2026-01-30
modified: 2026-02-04
publisher: Leibniz-Zentrum für Archäologie (LEIZA)
broader: Plasma
broader transitive: Konservierungs- und Restaurierungsmaterialien
broader transitive: Maßnahme
broader transitive: Plasma
broader transitive: Reduktionsmittel
in scheme: Konservierungs- und Restaurierungsfachthesaurus für archäologische Kulturgüter
pref label: Methanplasma
  type: Label
  rank: preferred

Natriumsulfit
type: Concept
notation: B614CD
created: 2026-01-30
issued: 2026-01-30
modified: 2026-02-04
publisher: Leibniz-Zentrum für Archäologie (LEIZA)
broader: Reduktionsmittel
broader transitive: Konservierungs- und Restaurierungsmaterialien
broader transitive: Maßnahme
broader transitive: Reduktionsmittel
in scheme: Konservierungs- und Restaurierungsfachthesaurus für archäologische Kulturgüter
pref label: Natriumsulfit
  type: Label
  rank: preferred

Natriumdithionit
type: Concept
notation: CB3941
created: 2026-01-30
issued: 2026-01-30
modified: 2026-02-04
publisher: Leibniz-Zentrum für Archäologie (LEIZA)
broader: Reduktionsmittel
broader transitive: Konservierungs- und Restaurierungsmaterialien
broader transitive: Maßnahme
broader transitive: Reduktionsmittel
in scheme: Konservierungs- und Restaurierungsfachthesaurus für archäologische Kulturgüter
pref label: Natriumdithionit
  type: Label
  rank: preferred

Natriumborhydrid
type: Concept
notation: D4A6D1
created: 2026-01-30
issued: 2026-01-30
modified: 2026-02-04
publisher: Leibniz-Zentrum für Archäologie (LEIZA)
broader: Reduktionsmittel
broader transitive: Konservierungs- und Restaurierungsmaterialien
broader transitive: Maßnahme
broader transitive: Reduktionsmittel
in scheme: Konservierungs- und Restaurierungsfachthesaurus für archäologische Kulturgüter
pref label: Natriumborhydrid
  type: Label
  rank: preferred
alternative label: NaBH4
alt label: NaBH4
  type: Label
  rank: preferred

Natriumthiosulfat
type: Concept
notation: FCA8C9
created: 2026-01-30
issued: 2026-01-30
modified: 2026-02-04
publisher: Leibniz-Zentrum für Archäologie (LEIZA)
broader: Reduktionsmittel
broader transitive: Konservierungs- und Restaurierungsmaterialien
broader transitive: Maßnahme
broader transitive: Reduktionsmittel
in scheme: Konservierungs- und Restaurierungsfachthesaurus für archäologische Kulturgüter
pref label: Natriumthiosulfat
  type: Label
  rank: preferred

Base
type: Concept
notation: A2B746
preferred label: alkaline solution @en
created: 2026-01-30
issued: 2026-01-30
modified: 2026-02-04
publisher: Leibniz-Zentrum für Archäologie (LEIZA)
alternative label: base @en
broader: Konservierungs- und Restaurierungsmaterialien
broader transitive: Konservierungs- und Restaurierungsmaterialien
broader transitive: Maßnahme
definition: chemische Substanz, die in wässriger Lösung ein Proton aufnehmen oder ein freies Elektronenpaar abspalten kann. In der Restaurierung wird sie zur Reinigung, Stabilisierung und Konservierung von Objekten verwendet.
definition:
  literal form: chemische Substanz, die in wässriger Lösung ein Proton aufnehmen oder ein freies Elektronenpaar abspalten kann. In der Restaurierung wird sie zur Reinigung, Stabilisierung und Konservierung von Objekten verwendet.
in scheme: Konservierungs- und Restaurierungsfachthesaurus für archäologische Kulturgüter
narrower: Ammoniak
narrower: Thiosulfat
narrower: Natriumcarbonat
narrower: Natriumhydroxid
alt label: base
  type: Label
  rank: preferred
pref label: Base
  type: Label
  rank: preferred
pref label: alkaline solution
  type: Label
  rank: normal

Ammoniak
type: Concept
notation: A5D92A
preferred label: ammonia @en
created: 2026-01-30
issued: 2026-01-30
modified: 2026-02-04
publisher: Leibniz-Zentrum für Archäologie (LEIZA)
alternative label: NH3
broader: Base
broader transitive: Base
broader transitive: Konservierungs- und Restaurierungsmaterialien
broader transitive: Maßnahme
definition: leicht flüchtige, alkalische Verbindung, die in der Konservierung/Restaurierung für die Entfernung von Verfärbungen durch Kupfer oder für die Entfernung von Shellack verwendet wird. Die stark basische Substanz löst besonders Fette, Öle und oxidierte Schutzlacke. Aufgrund der ätzenden Wirkung und gesundheitsgefährdenden Dämpfen ist bei der Anwendung besondere Vorsicht geboten.
definition:
  literal form: leicht flüchtige, alkalische Verbindung, die in der Konservierung/Restaurierung für die Entfernung von Verfärbungen durch Kupfer oder für die Entfernung von Shellack verwendet wird. Die stark basische Substanz löst besonders Fette, Öle und oxidierte Schutzlacke. Aufgrund der ätzenden Wirkung und gesundheitsgefährdenden Dämpfen ist bei der Anwendung besondere Vorsicht geboten.
in scheme: Konservierungs- und Restaurierungsfachthesaurus für archäologische Kulturgüter
alt label: NH3
  type: Label
  rank: preferred
pref label: Ammoniak
  type: Label
  rank: preferred
pref label: ammonia
  type: Label
  rank: normal

Thiosulfat
type: Concept
notation: AA8A54
created: 2026-01-30
issued: 2026-01-30
modified: 2026-02-04
publisher: Leibniz-Zentrum für Archäologie (LEIZA)
broader: Base
broader transitive: Base
broader transitive: Konservierungs- und Restaurierungsmaterialien
broader transitive: Maßnahme
in scheme: Konservierungs- und Restaurierungsfachthesaurus für archäologische Kulturgüter
pref label: Thiosulfat
  type: Label
  rank: preferred

Natriumcarbonat
type: Concept
notation: CB2D46
preferred label: sodium carbonate @en
created: 2026-01-30
issued: 2026-01-30
modified: 2026-02-04
publisher: Leibniz-Zentrum für Archäologie (LEIZA)
alternative label: Na2CO3
alternative label: Soda
alternative label: Waschsoda
broader: Base
broader transitive: Base
broader transitive: Konservierungs- und Restaurierungsmaterialien
broader transitive: Maßnahme
definition: alkalische Verbindung, die in der Konservierung/Restaurierung zur schonenden Reinigung, Entfettung sowie zur Neutralisierung von Säuren eingesetzt wird.
in scheme: Konservierungs- und Restaurierungsfachthesaurus für archäologische Kulturgüter
alt label: Na2CO3
  type: Label
  rank: preferred
alt label: Soda
  type: Label
  rank: normal
alt label: Waschsoda
  type: Label
  rank: normal
pref label: Natriumcarbonat
  type: Label
  rank: preferred
pref label: sodium carbonate
  type: Label
  rank: normal

Natriumhydroxid
type: Concept
notation: GG3G4B
preferred label: sodium hydroxide @en
created: 2026-01-30
issued: 2026-01-30
modified: 2026-02-04
publisher: Leibniz-Zentrum für Archäologie (LEIZA)
alternative label: NaOH
alternative label: Natronlauge
alternative label: Ätznatron
broader: Base
broader transitive: Base
broader transitive: Konservierungs- und Restaurierungsmaterialien
broader transitive: Maßnahme
definition: stark alkalische, hygroskopische Verbindung, die in der Kondervierung/Restaurierung hauptsächlich zur Reinigung und Entfettung von Oberflächen sowie für die Entsalzung archäologischer Eisenobjekte verwendet wird. Die stark basische Substanz löst organische Materialien wie Fette und Proteine und ist in der Lage Chloridionen aus Metallen zu extrahieren und in Lösung zu bringen. Die ätzende Wirkung erfordert strenge Sicherheitsmaßnahmen bei der Anwednung.
definition:
  literal form: stark alkalische, hygroskopische Verbindung, die in der Kondervierung/Restaurierung hauptsächlich zur Reinigung und Entfettung von Oberflächen sowie für die Entsalzung archäologischer Eisenobjekte verwendet wird. Die stark basische Substanz löst organische Materialien wie Fette und Proteine und ist in der Lage Chloridionen aus Metallen zu extrahieren und in Lösung zu bringen. Die ätzende Wirkung erfordert strenge Sicherheitsmaßnahmen bei der Anwednung.
in scheme: Konservierungs- und Restaurierungsfachthesaurus für archäologische Kulturgüter
alt label: NaOH
  type: Label
  rank: preferred
alt label: Ätznatron
  type: Label
  rank: normal
alt label: Natronlauge
  type: Label
  rank: normal
pref label: Natriumhydroxid
  type: Label
  rank: preferred
pref label: sodium hydroxide
  type: Label
  rank: normal

Oxalsäure
type: Concept
notation: D3A484
preferred label: oxalic acid @en
created: 2026-01-30
issued: 2026-01-30
modified: 2026-02-04
publisher: Leibniz-Zentrum für Archäologie (LEIZA)
alternative label: C2H2O4
alternative label: Ethandidicarbonsäure
alternative label: Kleesäure
broader: Säure
broader transitive: Konservierungs- und Restaurierungsmaterialien
broader transitive: Maßnahme
broader transitive: Säure
definition: organische Dicarbonsäure, die in der Konservierung/Restaurierung hauptsächlich für die Entfernung von Kalkablagerungen und als Reduktionsmittel für die Entfernung von Eisenverbindungen verwendet wird. Aufgrund der ätzenden Wirkung und gesundheitsgefährdenden Dämpfen ist bei der Anwendung besondere Vorsicht geboten.
definition:
  literal form: organische Dicarbonsäure, die in der Konservierung/Restaurierung hauptsächlich für die Entfernung von Kalkablagerungen und als Reduktionsmittel für die Entfernung von Eisenverbindungen verwendet wird. Aufgrund der ätzenden Wirkung und gesundheitsgefährdenden Dämpfen ist bei der Anwendung besondere Vorsicht geboten.
in scheme: Konservierungs- und Restaurierungsfachthesaurus für archäologische Kulturgüter
alt label: C2H2O4
  type: Label
  rank: preferred
alt label: Kleesäure
  type: Label
  rank: normal
alt label: Ethandidicarbonsäure
  type: Label
  rank: normal
pref label: Oxalsäure
  type: Label
  rank: preferred
pref label: oxalic acid
  type: Label
  rank: normal

Ascorbinsäure
type: Concept
notation: F54686
created: 2026-01-30
issued: 2026-01-30
modified: 2026-02-04
publisher: Leibniz-Zentrum für Archäologie (LEIZA)
broader: Säure
broader transitive: Konservierungs- und Restaurierungsmaterialien
broader transitive: Maßnahme
broader transitive: Säure
in scheme: Konservierungs- und Restaurierungsfachthesaurus für archäologische Kulturgüter
pref label: Ascorbinsäure
  type: Label
  rank: preferred

Mecosan S
type: Concept
created: 2026-02-25
issued: 2026-02-25
modified: 2026-02-25
publisher: Leibniz-Zentrum für Archäologie (LEIZA)
broader: Cellulosenitrat
broader transitive: synthetisches Polymer
broader transitive: Maßnahme
broader transitive: Celluloseester
broader transitive: Cellulosenitrat
broader transitive: [Adhäsivstoff]
broader transitive: Konservierungs- und Restaurierungsmaterialien
broader transitive: Cellulosederivat
in scheme: Konservierungs- und Restaurierungsfachthesaurus für archäologische Kulturgüter
pref label: Mecosan S
  type: Label
  rank: preferred

Bienenwachs
type: Concept
preferred label: bees wax @en
created: 2026-02-25
issued: 2026-02-25
modified: 2026-02-25
publisher: Leibniz-Zentrum für Archäologie (LEIZA)
broader: Wachs
broader transitive: Maßnahme
broader transitive: Konservierungs- und Restaurierungsmaterialien
broader transitive: Wachs
broader transitive: Modelliermasse
broader transitive: [Abform- und Ergänzungsmaterial]
in scheme: Konservierungs- und Restaurierungsfachthesaurus für archäologische Kulturgüter
pref label: Bienenwachs
  type: Label
  rank: preferred
pref label: bees wax
  type: Label
  rank: normal

Silberputztuch
type: Concept
created: 2026-02-25
issued: 2026-02-25
modified: 2026-02-25
publisher: Leibniz-Zentrum für Archäologie (LEIZA)
broader: manuelle Werkzeuge
broader transitive: manuelle Werkzeuge
broader transitive: Konservierungs- und Restaurierungswerkzeuge
broader transitive: Maßnahme
in scheme: Konservierungs- und Restaurierungsfachthesaurus für archäologische Kulturgüter
pref label: Silberputztuch
  type: Label
  rank: preferred

Ölfarbe
type: Concept
notation: G5G1DC
created: 2026-01-30
issued: 2026-01-30
modified: 2026-02-04
publisher: Leibniz-Zentrum für Archäologie (LEIZA)
broader: Farbstoff
broader transitive: Maßnahme
broader transitive: Farbstoff
broader transitive: Konservierungs- und Restaurierungsmaterialien
in scheme: Konservierungs- und Restaurierungsfachthesaurus für archäologische Kulturgüter
narrower: wasservermalbare Ölfarbe
narrower: terpentinvermalbare Ölfarbe
pref label: Ölfarbe
  type: Label
  rank: preferred

Zeichnung
type: Concept
created: 2026-02-25
issued: 2026-02-25
modified: 2026-02-25
publisher: Leibniz-Zentrum für Archäologie (LEIZA)
broader: Bildgebende Dokumentation
broader transitive: Bildgebende Dokumentation
broader transitive: Dokumentation
broader transitive: Zustandsdokumentation
in scheme: Konservierungs- und Restaurierungsfachthesaurus für archäologische Kulturgüter
pref label: Zeichnung
  type: Label
  rank: preferred

Kunststoffhammer
type: Concept
created: 2026-02-25
issued: 2026-02-25
modified: 2026-02-25
publisher: Leibniz-Zentrum für Archäologie (LEIZA)
broader: manuelle Werkzeuge
broader transitive: manuelle Werkzeuge
broader transitive: Konservierungs- und Restaurierungswerkzeuge
broader transitive: Maßnahme
in scheme: Konservierungs- und Restaurierungsfachthesaurus für archäologische Kulturgüter
pref label: Kunststoffhammer
  type: Label
  rank: preferred

Acrylglaspunzen
type: Concept
created: 2026-02-25
issued: 2026-02-25
modified: 2026-02-25
publisher: Leibniz-Zentrum für Archäologie (LEIZA)
broader: manuelle Werkzeuge
broader transitive: manuelle Werkzeuge
broader transitive: Konservierungs- und Restaurierungswerkzeuge
broader transitive: Maßnahme
in scheme: Konservierungs- und Restaurierungsfachthesaurus für archäologische Kulturgüter
pref label: Acrylglaspunzen
  type: Label
  rank: preferred
alternative label: Plexiglaspunzen
alt label: Plexiglaspunzen
  type: Label
  rank: preferred

wasservermalbare Ölfarbe
type: Concept
preferred label: water-mixable oil paint @en
created: 2026-02-25
issued: 2026-02-25
modified: 2026-02-25
publisher: Leibniz-Zentrum für Archäologie (LEIZA)
broader: Ölfarbe
broader transitive: Maßnahme
broader transitive: Konservierungs- und Restaurierungsmaterialien
broader transitive: Farbstoff
broader transitive: Ölfarbe
in scheme: Konservierungs- und Restaurierungsfachthesaurus für archäologische Kulturgüter
pref label: wasservermalbare Ölfarbe
  type: Label
  rank: preferred
pref label: water-mixable oil paint
  type: Label
  rank: normal
alternative label: wasserlösliche Ölfarbe
alt label: wasserlösliche Ölfarbe
  type: Label
  rank: preferred

terpentinvermalbare Ölfarbe
type: Concept
preferred label: turpentine-based oil paint @en
created: 2026-02-25
issued: 2026-02-25
modified: 2026-02-25
publisher: Leibniz-Zentrum für Archäologie (LEIZA)
broader: Ölfarbe
broader transitive: Maßnahme
broader transitive: Konservierungs- und Restaurierungsmaterialien
broader transitive: Farbstoff
broader transitive: Ölfarbe
in scheme: Konservierungs- und Restaurierungsfachthesaurus für archäologische Kulturgüter
pref label: terpentinvermalbare Ölfarbe
  type: Label
  rank: preferred
pref label: turpentine-based oil paint
  type: Label
  rank: normal
alternative label: terpentinlösliche Ölfarbe
alt label: terpentinlösliche Ölfarbe
  type: Label
  rank: preferred

Verstärkung
type: Concept
notation: A31C7C
preferred label: reinforcement @en
created: 2026-01-30
issued: 2026-01-30
modified: 2026-03-04
publisher: Leibniz-Zentrum für Archäologie (LEIZA)
broader: stabilisierende Konservierung
broader transitive: stabilisierende Konservierung
broader transitive: Maßnahme
broader transitive: Konservierung
broader transitive: [Behandlungsmethode]
definition: Methode, bei der ein Objekt durch das Hinzufügen oder Anbringen stützender Materialien oder Strukturelemente mechanisch stabilisiert wird, um seine Tragfähigkeit zu sichern oder zu erhöhen.
in scheme: Konservierungs- und Restaurierungsfachthesaurus für archäologische Kulturgüter
narrower: temporäre Stabilisierung
narrower: Unterfütterung
narrower: Laminierung (Konservierungsmethode)
narrower: Trägerbau
pref label: Verstärkung
  type: Label
  rank: preferred
pref label: reinforcement
  type: Label
  rank: normal

temporäre Stabilisierung
type: Concept
notation: B26D29
created: 2026-01-30
issued: 2026-01-30
modified: 2026-03-04
publisher: Leibniz-Zentrum für Archäologie (LEIZA)
broader: Verstärkung
broader transitive: Verstärkung
broader transitive: stabilisierende Konservierung
broader transitive: Maßnahme
broader transitive: Konservierung
broader transitive: [Behandlungsmethode]
definition: zeitlich begrenzte, nicht dauerhafte Unterstützung eines fragilen Materials, beispielsweise für einen Transport oder als Erstversorgungsmaßnahme.
in scheme: Konservierungs- und Restaurierungsfachthesaurus für archäologische Kulturgüter
pref label: temporäre Stabilisierung
  type: Label
  rank: preferred
alternative label: temporäre Verstärkung
alt label: temporäre Verstärkung
  type: Label
  rank: preferred

Unterfütterung
type: Concept
created: 2026-03-04
issued: 2026-03-04
modified: 2026-03-04
publisher: Leibniz-Zentrum für Archäologie (LEIZA)
broader: Verstärkung
broader transitive: Verstärkung
broader transitive: stabilisierende Konservierung
broader transitive: Maßnahme
broader transitive: Konservierung
broader transitive: [Behandlungsmethode]
in scheme: Konservierungs- und Restaurierungsfachthesaurus für archäologische Kulturgüter
pref label: Unterfütterung
  type: Label
  rank: preferred
alternative label: Hinterfütterung
alternative label: Verfüllung
alt label: Verfüllung
  type: Label
  rank: preferred
alt label: Hinterfütterung
  type: Label
  rank: normal

Laminierung (Konservierungsmethode)
type: Concept
notation: C7427F
created: 2026-01-30
issued: 2026-01-30
modified: 2026-02-04
publisher: Leibniz-Zentrum für Archäologie (LEIZA)
broader: Verstärkung
broader transitive: Verstärkung
broader transitive: stabilisierende Konservierung
broader transitive: Maßnahme
broader transitive: Konservierung
broader transitive: [Behandlungsmethode]
definition: Methode, bei der ein fragiles Objekt durch das Hinterlegen mit einem Gewebe (z.B. Glasfaser, Japanpapier, etc.) stabilisiert wird. Durch Tränkung des Gewebes mit einer Polymerlösung entsteht ein stabiles Laminat, das fest mit dem Objektmaterial verbunden ist und dieses bei mechanischer Einwirkung unterstützt.
definition:
  literal form: Methode, bei der ein fragiles Objekt durch das Hinterlegen mit einem Gewebe (z.B. Glasfaser, Japanpapier, etc.) stabilisiert wird. Durch Tränkung des Gewebes mit einer Polymerlösung entsteht ein stabiles Laminat, das fest mit dem Objektmaterial verbunden ist und dieses bei mechanischer Einwirkung unterstützt.
in scheme: Konservierungs- und Restaurierungsfachthesaurus für archäologische Kulturgüter
pref label: Laminierung (Konservierungsmethode)
  type: Label
  rank: preferred
alternative label: Hinterklebung
alt label: Hinterklebung
  type: Label
  rank: preferred

Trägerbau
type: Concept
notation: D2D988
created: 2026-01-30
issued: 2026-01-30
modified: 2026-02-04
publisher: Leibniz-Zentrum für Archäologie (LEIZA)
broader: Verstärkung
broader transitive: Verstärkung
broader transitive: stabilisierende Konservierung
broader transitive: Maßnahme
broader transitive: Konservierung
broader transitive: [Behandlungsmethode]
definition: Methode, bei der ein individuell an die Form des Objektes angepasstes Gestell erarbeitet wird, in welches das Objekt eingespannt/aufgelegt/befestigt werden kann. Der Träger ist dabei i.d.R. nicht dauerhaft fest mit dem Objekt verbunden. Durch den Unterbau wird das Objekt bestmöglich gestützt und die mechanische Belastung reduziert.
definition:
  literal form: Methode, bei der ein individuell an die Form des Objektes angepasstes Gestell erarbeitet wird, in welches das Objekt eingespannt/aufgelegt/befestigt werden kann. Der Träger ist dabei i.d.R. nicht dauerhaft fest mit dem Objekt verbunden. Durch den Unterbau wird das Objekt bestmöglich gestützt und die mechanische Belastung reduziert.
in scheme: Konservierungs- und Restaurierungsfachthesaurus für archäologische Kulturgüter
pref label: Trägerbau
  type: Label
  rank: preferred

Strahlmittel
type: Concept
notation: ADD53A
created: 2026-01-30
issued: 2026-01-30
modified: 2026-02-04
publisher: Leibniz-Zentrum für Archäologie (LEIZA)
broader: Konservierungs- und Restaurierungsmaterialien
broader transitive: Maßnahme
broader transitive: Konservierungs- und Restaurierungsmaterialien
in scheme: Konservierungs- und Restaurierungsfachthesaurus für archäologische Kulturgüter
narrower: Walnussschalenganulat (Strahlmittel)
narrower: Kunststoffgranulat (Strahlmittel)
narrower: Edelkorund (Strahlmittel)
narrower: Glasperlen (Strahlmittel)
pref label: Strahlmittel
  type: Label
  rank: preferred
alternative label: Feinstrahlmittel
alternative label: Strahlgut
definition: feinkörnige Substanz, die für die Methode des Feinstrahlens in einem Strahlgerät verwendet wird. Je nach Objektzustand und dem angestrebten Ergebnis stehen härtere oder weichere, kugelige oder kantige Strahlmittel zur Verfügung. Im Bereich der Restaurierung haben sich vor allem mineralische und organische Strahlmittel etabliert.
definition:
  literal form: feinkörnige Substanz, die für die Methode des Feinstrahlens in einem Strahlgerät verwendet wird. Je nach Objektzustand und dem angestrebten Ergebnis stehen härtere oder weichere, kugelige oder kantige Strahlmittel zur Verfügung. Im Bereich der Restaurierung haben sich vor allem mineralische und organische Strahlmittel etabliert.
alt label: Strahlgut
  type: Label
  rank: preferred
alt label: Feinstrahlmittel
  type: Label
  rank: normal

Festigung
type: Concept
notation: DA9CGG
preferred label: consolidation @en
created: 2026-01-30
issued: 2026-01-30
modified: 2026-03-04
publisher: Leibniz-Zentrum für Archäologie (LEIZA)
broader: stabilisierende Konservierung
broader transitive: Maßnahme
broader transitive: Konservierung
broader transitive: stabilisierende Konservierung
broader transitive: [Behandlungsmethode]
in scheme: Konservierungs- und Restaurierungsfachthesaurus für archäologische Kulturgüter
narrower: Tränkung
pref label: Festigung
  type: Label
  rank: preferred
pref label: consolidation
  type: Label
  rank: normal
alternative label: Festigen
alternative label: Sicherung
alternative label: innere Stabilisierung
definition: Methode, bei der geschwächtes oder poröses Originalmaterial durch Eindringen oder Anlagerung eines Festigungsmaterials in seiner inneren Kohäsion stabilisiert wird.
alt label: Sicherung
  type: Label
  rank: normal
alt label: innere Stabilisierung
  type: Label
  rank: normal
alt label: Festigen
  type: Label
  rank: preferred

Glasperlen (Strahlmittel)
type: Concept
notation: FGB66B
created: 2026-01-30
issued: 2026-01-30
modified: 2026-03-04
publisher: Leibniz-Zentrum für Archäologie (LEIZA)
broader: Strahlmittel
broader transitive: Maßnahme
broader transitive: Strahlmittel
broader transitive: Konservierungs- und Restaurierungsmaterialien
definition: feinkugeliges Feinstrahlmittel aus Natronglas. Im Vergleich zu Edelkorund zeigen Glasperlen als Strahlmittel eine weniger stark abrasive Wirkung und sind daher besonders für die Reinigung/Freilegung empfindlicherer Oberflächen geeignet. Durch die kugelige Form wird zudem eine "Hämmerwirkung" erzielt, die zur leichten Verdichtung der Oberflächen bei metallischen Objekten führt.
definition:
  literal form: feinkugeliges Feinstrahlmittel aus Natronglas. Im Vergleich zu Edelkorund zeigen Glasperlen als Strahlmittel eine weniger stark abrasive Wirkung und sind daher besonders für die Reinigung/Freilegung empfindlicherer Oberflächen geeignet. Durch die kugelige Form wird zudem eine "Hämmerwirkung" erzielt, die zur leichten Verdichtung der Oberflächen bei metallischen Objekten führt.
in scheme: Konservierungs- und Restaurierungsfachthesaurus für archäologische Kulturgüter
pref label: Glasperlen (Strahlmittel)
  type: Label
  rank: preferred

Draht (Werkzeug)
type: Concept
notation: A48485
created: 2026-01-30
issued: 2026-01-30
modified: 2026-03-04
publisher: Leibniz-Zentrum für Archäologie (LEIZA)
broader: manuelle Werkzeuge
broader transitive: manuelle Werkzeuge
broader transitive: Konservierungs- und Restaurierungswerkzeuge
broader transitive: Maßnahme
in scheme: Konservierungs- und Restaurierungsfachthesaurus für archäologische Kulturgüter
narrower: Omega-Häkchen
narrower: Bindedraht
pref label: Draht (Werkzeug)
  type: Label
  rank: preferred

Omega-Häkchen
type: Concept
notation: BA264C
created: 2026-01-30
issued: 2026-01-30
modified: 2026-02-04
publisher: Leibniz-Zentrum für Archäologie (LEIZA)
broader: Draht (Werkzeug)
broader transitive: Draht (Werkzeug)
broader transitive: manuelle Werkzeuge
broader transitive: Konservierungs- und Restaurierungswerkzeuge
broader transitive: Maßnahme
in scheme: Konservierungs- und Restaurierungsfachthesaurus für archäologische Kulturgüter
pref label: Omega-Häkchen
  type: Label
  rank: preferred

Bindedraht
type: Concept
notation: F85978
created: 2026-01-30
issued: 2026-01-30
modified: 2026-02-04
publisher: Leibniz-Zentrum für Archäologie (LEIZA)
broader: Draht (Werkzeug)
broader transitive: Draht (Werkzeug)
broader transitive: manuelle Werkzeuge
broader transitive: Konservierungs- und Restaurierungswerkzeuge
broader transitive: Maßnahme
in scheme: Konservierungs- und Restaurierungsfachthesaurus für archäologische Kulturgüter
pref label: Bindedraht
  type: Label
  rank: preferred

Tränkung
type: Concept
notation: A9FF5A
created: 2026-01-30
issued: 2026-01-30
modified: 2026-02-04
publisher: Leibniz-Zentrum für Archäologie (LEIZA)
broader: Festigung
broader transitive: Maßnahme
broader transitive: [Behandlungsmethode]
broader transitive: Festigung
broader transitive: Konservierung
broader transitive: stabilisierende Konservierung
in scheme: Konservierungs- und Restaurierungsfachthesaurus für archäologische Kulturgüter
pref label: Tränkung
  type: Label
  rank: preferred
definition: Konservierungsmethode, bei der die poröse/instabile, innere Werkstoffstruktur eines Objektes durch die Einbringung eines sich in Lösung befindlichen Polymers stabilisiert wird. Nach Verflüchtigung des Lösungsmittels bildet das Polymere ein stabiles Gerüst, welches die instabile Struktur des original Objektmaterials zusammenhält und unterstützt.
definition:
  literal form: Konservierungsmethode, bei der die poröse/instabile, innere Werkstoffstruktur eines Objektes durch die Einbringung eines sich in Lösung befindlichen Polymers stabilisiert wird. Nach Verflüchtigung des Lösungsmittels bildet das Polymere ein stabiles Gerüst, welches die instabile Struktur des original Objektmaterials zusammenhält und unterstützt.
narrower: Injektion
narrower: Badtränkung
narrower: Pinseltränkung
narrower: Pipettentränkung

Walnussschalenganulat (Strahlmittel)
type: Concept
notation: B71F12
created: 2026-01-30
issued: 2026-01-30
modified: 2026-03-04
publisher: Leibniz-Zentrum für Archäologie (LEIZA)
broader: Strahlmittel
broader transitive: Maßnahme
broader transitive: Strahlmittel
broader transitive: Konservierungs- und Restaurierungsmaterialien
in scheme: Konservierungs- und Restaurierungsfachthesaurus für archäologische Kulturgüter
pref label: Walnussschalenganulat (Strahlmittel)
  type: Label
  rank: preferred
definition: organisches Strahlmittel aus den Schalen der Walnuss. Trotz der geringen Härte besitzen Walsnussschalen eine hohe Festigkeit, wodurch sie besonders gut für einen leichten und schonenden Reinigungseffekt empfindlicher Materialien geeignet sind.
definition:
  literal form: organisches Strahlmittel aus den Schalen der Walnuss. Trotz der geringen Härte besitzen Walsnussschalen eine hohe Festigkeit, wodurch sie besonders gut für einen leichten und schonenden Reinigungseffekt empfindlicher Materialien geeignet sind.

Kunststoffgranulat (Strahlmittel)
type: Concept
notation: D8C292
created: 2026-01-30
issued: 2026-01-30
modified: 2026-03-04
publisher: Leibniz-Zentrum für Archäologie (LEIZA)
broader: Strahlmittel
broader transitive: Maßnahme
broader transitive: Strahlmittel
broader transitive: Konservierungs- und Restaurierungsmaterialien
in scheme: Konservierungs- und Restaurierungsfachthesaurus für archäologische Kulturgüter
pref label: Kunststoffgranulat (Strahlmittel)
  type: Label
  rank: preferred

Edelkorund (Strahlmittel)
type: Concept
notation: DF9GCF
created: 2026-01-30
issued: 2026-01-30
modified: 2026-03-04
publisher: Leibniz-Zentrum für Archäologie (LEIZA)
broader: Strahlmittel
broader transitive: Maßnahme
broader transitive: Strahlmittel
broader transitive: Konservierungs- und Restaurierungsmaterialien
in scheme: Konservierungs- und Restaurierungsfachthesaurus für archäologische Kulturgüter
pref label: Edelkorund (Strahlmittel)
  type: Label
  rank: preferred
definition: synthetisch hergestelltes Feinstrahlmittel aus nahezu reinem Aluminiumoxyd. Korund weist eine hohe Härte und spitz bizarre Kornform auf, wodurch es in der Verwendung als Strahlmittel eine stark abrasive Wirkung zeigt. In der Restaurierung wird Korund vor allem für die Freilegung von metallischen Korrosionsprodukten verwendet.
definition:
  literal form: synthetisch hergestelltes Feinstrahlmittel aus nahezu reinem Aluminiumoxyd. Korund weist eine hohe Härte und spitz bizarre Kornform auf, wodurch es in der Verwendung als Strahlmittel eine stark abrasive Wirkung zeigt. In der Restaurierung wird Korund vor allem für die Freilegung von metallischen Korrosionsprodukten verwendet.

Bürste
type: Concept
notation: C4569A
preferred label: brush @en
created: 2026-01-30
issued: 2026-01-30
modified: 2026-02-04
publisher: Leibniz-Zentrum für Archäologie (LEIZA)
broader: manuelle Werkzeuge
broader transitive: Maßnahme
broader transitive: Konservierungs- und Restaurierungswerkzeuge
broader transitive: manuelle Werkzeuge
in scheme: Konservierungs- und Restaurierungsfachthesaurus für archäologische Kulturgüter
pref label: Bürste
  type: Label
  rank: preferred
pref label: brush
  type: Label
  rank: normal
narrower: Stahldrahtbürste
narrower: Messingbürste

Messingbürste
type: Concept
created: 2026-03-04
issued: 2026-03-04
modified: 2026-03-04
publisher: Leibniz-Zentrum für Archäologie (LEIZA)
broader: Bürste
broader transitive: manuelle Werkzeuge
broader transitive: Konservierungs- und Restaurierungswerkzeuge
broader transitive: Maßnahme
broader transitive: Bürste
in scheme: Konservierungs- und Restaurierungsfachthesaurus für archäologische Kulturgüter
pref label: Messingbürste
  type: Label
  rank: preferred
alternative label: Messingbürstchen
alt label: Messingbürstchen
  type: Label
  rank: preferred

Richten (Restaurierungsmethode)
type: Concept
created: 2026-03-04
issued: 2026-03-04
modified: 2026-03-04
publisher: Leibniz-Zentrum für Archäologie (LEIZA)
alternative label: Richtung (Restaurierungsmethode)
broader: Formkorrektur
broader transitive: Formkorrektur
broader transitive: Restaurierung
broader transitive: Maßnahme
broader transitive: [Behandlungsmethode]
in scheme: Konservierungs- und Restaurierungsfachthesaurus für archäologische Kulturgüter
alt label: Richtung (Restaurierungsmethode)
  type: Label
  rank: preferred
pref label: Richten (Restaurierungsmethode)
  type: Label
  rank: preferred

Formkorrektur
type: Concept
created: 2026-03-04
issued: 2026-03-04
modified: 2026-03-04
publisher: Leibniz-Zentrum für Archäologie (LEIZA)
broader: Restaurierung
broader transitive: Restaurierung
broader transitive: Maßnahme
broader transitive: [Behandlungsmethode]
in scheme: Konservierungs- und Restaurierungsfachthesaurus für archäologische Kulturgüter
pref label: Formkorrektur
  type: Label
  rank: preferred
narrower: Richten (Restaurierungsmethode)
narrower: Glätten (Restaurierungsmethode)

Injektion
type: Concept
notation: BFA1CC
created: 2026-01-30
issued: 2026-01-30
modified: 2026-02-04
publisher: Leibniz-Zentrum für Archäologie (LEIZA)
broader: Tränkung
broader transitive: Tränkung
broader transitive: Maßnahme
broader transitive: Konservierung
broader transitive: Festigung
broader transitive: [Behandlungsmethode]
broader transitive: stabilisierende Konservierung
definition: Festigungsmethode bei der ein sich in Lösung befindliches Polymer mit einer Spritze gezielt in das Objekt bzw. in innere Hohlräume des Objektes eingebracht werden kann.
in scheme: Konservierungs- und Restaurierungsfachthesaurus für archäologische Kulturgüter
pref label: Injektion
  type: Label
  rank: preferred

Badtränkung
type: Concept
notation: C17A3G
created: 2026-01-30
issued: 2026-01-30
modified: 2026-02-04
publisher: Leibniz-Zentrum für Archäologie (LEIZA)
broader: Tränkung
broader transitive: Tränkung
broader transitive: Maßnahme
broader transitive: Konservierung
broader transitive: Festigung
broader transitive: [Behandlungsmethode]
broader transitive: stabilisierende Konservierung
definition: Festigungsmethode, bei der das Objekt durch Eintauchen in eine Badlösung gefestigt wird. Der gesamte Porenraum des Objektwerkstoffes wird dabei mit einem sich in Lösung befindlichen Polymers ausgefüllt. Theoretisch sind bei der Badtränkung auch Teiltränung gezielter Bereiche möglich, in dem nur diese Bereiche in das Bad eingetaucht werden. Durch den Kapillareffekt im Inneren eines porösen Materials, kann die Verteilung des gelösten Polymers jedoch nicht genau kontrolliert werden. Aus diesem Grund wird unter einer Badtränkung in der Regel eine Volltränkung des gesamten Objektes verstanden.
definition:
  literal form: Festigungsmethode, bei der das Objekt durch Eintauchen in eine Badlösung gefestigt wird. Der gesamte Porenraum des Objektwerkstoffes wird dabei mit einem sich in Lösung befindlichen Polymers ausgefüllt. Theoretisch sind bei der Badtränkung auch Teiltränung gezielter Bereiche möglich, in dem nur diese Bereiche in das Bad eingetaucht werden. Durch den Kapillareffekt im Inneren eines porösen Materials, kann die Verteilung des gelösten Polymers jedoch nicht genau kontrolliert werden. Aus diesem Grund wird unter einer Badtränkung in der Regel eine Volltränkung des gesamten Objektes verstanden.
in scheme: Konservierungs- und Restaurierungsfachthesaurus für archäologische Kulturgüter
pref label: Badtränkung
  type: Label
  rank: preferred
narrower: Vacuumtränkung

Pinseltränkung
type: Concept
notation: CD536F
created: 2026-01-30
issued: 2026-01-30
modified: 2026-02-04
publisher: Leibniz-Zentrum für Archäologie (LEIZA)
broader: Tränkung
broader transitive: Tränkung
broader transitive: Maßnahme
broader transitive: Konservierung
broader transitive: Festigung
broader transitive: [Behandlungsmethode]
broader transitive: stabilisierende Konservierung
definition: Festigungsmethode, bei der ein sich in Lösung befindliches Polymer als Festigungsmittel auf die Oberfläche des Objektes aufgepinselt wird. Der Prozess wird nach Bedarf mehrfach wiederholt um den Sättigungsgrad der Tränkung und somit die stabilisierende Wirkung zu erhöhen. Bei dieser Methode ist eine sehr kontrollierte Einbringung des Festigungsmittels möglich, sodass auch nur gezielte Bereiche eines Objektes gefestigt werden können.
definition:
  literal form: Festigungsmethode, bei der ein sich in Lösung befindliches Polymer als Festigungsmittel auf die Oberfläche des Objektes aufgepinselt wird. Der Prozess wird nach Bedarf mehrfach wiederholt um den Sättigungsgrad der Tränkung und somit die stabilisierende Wirkung zu erhöhen. Bei dieser Methode ist eine sehr kontrollierte Einbringung des Festigungsmittels möglich, sodass auch nur gezielte Bereiche eines Objektes gefestigt werden können.
in scheme: Konservierungs- und Restaurierungsfachthesaurus für archäologische Kulturgüter
pref label: Pinseltränkung
  type: Label
  rank: preferred

Pipettentränkung
type: Concept
notation: G3368F
created: 2026-01-30
issued: 2026-01-30
modified: 2026-02-04
publisher: Leibniz-Zentrum für Archäologie (LEIZA)
broader: Tränkung
broader transitive: Tränkung
broader transitive: Maßnahme
broader transitive: Konservierung
broader transitive: Festigung
broader transitive: [Behandlungsmethode]
broader transitive: stabilisierende Konservierung
definition: Festigungsmethode, bei der ein sich in Lösung befindliches Polymere als Festigungsmittel mit Hilfe einer Pipette auf das Objekt aufgetropft wird. Die Anwendung kann dabei mehrfach wiederholt werden, um den Sättigungsgrad des Objektmaterials und somit die stabilisierende Wirkung zu erhöhen. Wie bei der Pinseltränkung ist ebenfalls eine große Kontrolle der Auftragung möglich und es können gezielt einzelne Bereiche gefestigt werden.
definition:
  literal form: Festigungsmethode, bei der ein sich in Lösung befindliches Polymere als Festigungsmittel mit Hilfe einer Pipette auf das Objekt aufgetropft wird. Die Anwendung kann dabei mehrfach wiederholt werden, um den Sättigungsgrad des Objektmaterials und somit die stabilisierende Wirkung zu erhöhen. Wie bei der Pinseltränkung ist ebenfalls eine große Kontrolle der Auftragung möglich und es können gezielt einzelne Bereiche gefestigt werden.
in scheme: Konservierungs- und Restaurierungsfachthesaurus für archäologische Kulturgüter
pref label: Pipettentränkung
  type: Label
  rank: preferred

Stahldrahtbürste
type: Concept
created: 2026-03-04
issued: 2026-03-04
modified: 2026-03-04
publisher: Leibniz-Zentrum für Archäologie (LEIZA)
alternative label: Stahlbürste
alternative label: Stahldrahtbürstchen
broader: Bürste
broader transitive: Maßnahme
broader transitive: Bürste
broader transitive: Konservierungs- und Restaurierungswerkzeuge
broader transitive: manuelle Werkzeuge
in scheme: Konservierungs- und Restaurierungsfachthesaurus für archäologische Kulturgüter
alt label: Stahlbürste
  type: Label
  rank: preferred
alt label: Stahldrahtbürstchen
  type: Label
  rank: normal
pref label: Stahldrahtbürste
  type: Label
  rank: preferred

Glätten (Restaurierungsmethode)
type: Concept
created: 2026-03-04
issued: 2026-03-04
modified: 2026-03-04
publisher: Leibniz-Zentrum für Archäologie (LEIZA)
alternative label: Glättung (Restaurierungsmethode)
broader: Formkorrektur
broader transitive: Formkorrektur
broader transitive: Restaurierung
broader transitive: Maßnahme
broader transitive: [Behandlungsmethode]
in scheme: Konservierungs- und Restaurierungsfachthesaurus für archäologische Kulturgüter
alt label: Glättung (Restaurierungsmethode)
  type: Label
  rank: preferred
pref label: Glätten (Restaurierungsmethode)
  type: Label
  rank: preferred

Vacuumtränkung
type: Concept
notation: A9D149
created: 2026-01-30
issued: 2026-01-30
modified: 2026-02-04
publisher: Leibniz-Zentrum für Archäologie (LEIZA)
alternative label: Niederdrucktränkung
broader: Badtränkung
broader transitive: Badtränkung
broader transitive: Tränkung
broader transitive: Maßnahme
broader transitive: Konservierung
broader transitive: Festigung
broader transitive: [Behandlungsmethode]
broader transitive: stabilisierende Konservierung
definition: Spezielle Art der Badtränkung, bei der die Zugabe des Festigungsmittel (ein gelöstes Polymer) unter Vakuum, z.B. in einem Exsikkator, erfolgt. Durch das erzeugte Vakuum entsteht ein Sog, der die Polymerlösung tiefer in den Porenraum des Objektmaterials zieht. Auf diese Weise ist eine besonders gute Penetration des Objektes mit dem Festigungsmittel möglich. Allerdings ist die Methode nicht für sehr fragile Objekte geeignet, da der erzeugte Druck durch das Vakuum die instabile Struktur des Materials weiter beschädigen könnte.
definition:
  literal form: Spezielle Art der Badtränkung, bei der die Zugabe des Festigungsmittel (ein gelöstes Polymer) unter Vakuum, z.B. in einem Exsikkator, erfolgt. Durch das erzeugte Vakuum entsteht ein Sog, der die Polymerlösung tiefer in den Porenraum des Objektmaterials zieht. Auf diese Weise ist eine besonders gute Penetration des Objektes mit dem Festigungsmittel möglich. Allerdings ist die Methode nicht für sehr fragile Objekte geeignet, da der erzeugte Druck durch das Vakuum die instabile Struktur des Materials weiter beschädigen könnte.
in scheme: Konservierungs- und Restaurierungsfachthesaurus für archäologische Kulturgüter
alt label: Niederdrucktränkung
  type: Label
  rank: preferred
pref label: Vacuumtränkung
  type: Label
  rank: preferred